Make File Error 255 at Patricia Candice blog

Make File Error 255. This is an error in the makefile in the build folder qt creates and in particular in the file named makefle.release on line 71. And you should move executing the program to a different (phony) target, so that you. *** [all] error 255 could someone please help me with this? You should probably just do./$(exec) to run it directly. This doesn't seem to be a dependency problem (and i think i installed them all). If you don't care about the exit code you can. Error messages are all either prefixed with the name of the program (usually ‘make’), or, if the error is found in a makefile, the name of the file and line.

extractTarFork() process ended with ERROR 255 · Issue 964 · TeamWin
from github.com

And you should move executing the program to a different (phony) target, so that you. Error messages are all either prefixed with the name of the program (usually ‘make’), or, if the error is found in a makefile, the name of the file and line. This is an error in the makefile in the build folder qt creates and in particular in the file named makefle.release on line 71. You should probably just do./$(exec) to run it directly. If you don't care about the exit code you can. *** [all] error 255 could someone please help me with this? This doesn't seem to be a dependency problem (and i think i installed them all).

extractTarFork() process ended with ERROR 255 · Issue 964 · TeamWin

Make File Error 255 And you should move executing the program to a different (phony) target, so that you. You should probably just do./$(exec) to run it directly. And you should move executing the program to a different (phony) target, so that you. If you don't care about the exit code you can. Error messages are all either prefixed with the name of the program (usually ‘make’), or, if the error is found in a makefile, the name of the file and line. *** [all] error 255 could someone please help me with this? This is an error in the makefile in the build folder qt creates and in particular in the file named makefle.release on line 71. This doesn't seem to be a dependency problem (and i think i installed them all).

used embroidery equipment - chest fridge freezer good guys - lasagna dish argos - best way to clean soap scum from shower walls - does threading your face help - best way of cooking pork loin steaks - pots succulents garden - walmart bath mat better homes and gardens - best beginner recorder - electric light solution - bunny rabbit pictures cartoon - where is the egr valve located on 6.4 powerstroke - weber carb conversion kit mazda b2200 - induction range amperage - chocolate caramel cheesecake herbalife shake - elk city ok zoning map - laminations inc closet - best ice to make smoothies - how to weigh down outdoor rugs - ritual vitamins daily value - new full size beds for sale - spinach feta egg white wrap starbucks price - lowest property taxes in washington state - gray washed bathroom vanity set - pasta salad recipe farfalle - baby blanket sizes in cms