{"text_format":"1","workbook":"xlsx","n_sheets":2,"sheets":["2019","2018"],"not_rendered":{"charts":0,"images":0,"macros":1,"external_links":0,"defined_names":2,"comments":0,"pivot_tables":0},"unopened":[],"bounds":{"document_bytes":16777216,"sheet_cells":100000,"rows_first":2000,"rows_last":500,"rows_between":2000,"halvings":0,"cell_chars":16384,"cell_head_chars":4096},"cells_cut":0,"cells_raw":0,"read":"whole","date_system":"1900"}

{"sheet":"2019","index":0,"n_rows":501,"n_cols":4,"rows_kept":501,"cut":false,"hidden":false,"merged":[]}
["Franchise","2019 Rankings","2018 Rankings","Change in Rankings"]
["McDonald's",1,{"$f":"VLOOKUP(A2,'2018'!A:B,2,FALSE)","v":1},0]
["Dunkin'",2,{"$f":"VLOOKUP(A3,'2018'!A:B,2,FALSE)","v":3},1]
["Sonic Drive-In",3,{"$f":"VLOOKUP(A4,'2018'!A:B,2,FALSE)","v":6},3]
["Taco Bell",4,{"$f":"VLOOKUP(A5,'2018'!A:B,2,FALSE)","v":8},4]
["The UPS Store",5,{"$f":"VLOOKUP(A6,'2018'!A:B,2,FALSE)","v":4},-1]
["Culver's",6,{"$f":"VLOOKUP(A7,'2018'!A:B,2,FALSE)","v":13},7]
["Planet Fitness",7,{"$f":"VLOOKUP(A8,'2018'!A:B,2,FALSE)","v":21},14]
["Great Clips",8,{"$f":"VLOOKUP(A9,'2018'!A:B,2,FALSE)","v":7},-1]
["Jersey Mike's Subs",9,{"$f":"VLOOKUP(A10,'2018'!A:B,2,FALSE)","v":24},15]
["7-Eleven Inc.",10,{"$f":"VLOOKUP(A11,'2018'!A:B,2,FALSE)","v":2},-8]
["Jimmy John's Gourmet Sandwiches",11,{"$f":"VLOOKUP(A12,'2018'!A:B,2,FALSE)","v":11},0]
["Baskin-Robbins",12,{"$f":"VLOOKUP(A13,'2018'!A:B,2,FALSE)","v":41},29]
["Ace Hardware Corp.",13,{"$f":"VLOOKUP(A14,'2018'!A:B,2,FALSE)","v":19},6]
["Kumon Math & Reading Centers",14,{"$f":"VLOOKUP(A15,'2018'!A:B,2,FALSE)","v":20},6]
["RE/MAX LLC",15,{"$f":"VLOOKUP(A16,'2018'!A:B,2,FALSE)","v":5},-10]
["Pizza Hut LLC",16,{"$f":"VLOOKUP(A17,'2018'!A:B,2,FALSE)","v":47},31]
["Sport Clips",17,{"$f":"VLOOKUP(A18,'2018'!A:B,2,FALSE)","v":10},-7]
["Snap-on Tools",18,{"$f":"VLOOKUP(A19,'2018'!A:B,2,FALSE)","v":30},12]
["Jack in the Box",19,{"$f":"VLOOKUP(A20,'2018'!A:B,2,FALSE)","v":43},24]
["Anytime Fitness",20,{"$f":"VLOOKUP(A21,'2018'!A:B,2,FALSE)","v":17},-3]
["Dairy Queen",21,{"$f":"VLOOKUP(A22,'2018'!A:B,2,FALSE)","v":67},46]
["Smoothie King",22,{"$f":"VLOOKUP(A23,'2018'!A:B,2,FALSE)","v":35},13]
["KFC US LLC",23,{"$f":"VLOOKUP(A24,'2018'!A:B,2,FALSE)","v":233},210]
["CPR-Cell Phone Repair",24,{"$f":"VLOOKUP(A25,'2018'!A:B,2,FALSE)","v":26},2]
["Orangetheory Fitness",25,{"$f":"VLOOKUP(A26,'2018'!A:B,2,FALSE)","v":48},23]
["Bojangles' Famous Chicken 'n Biscuits",26,{"$f":"VLOOKUP(A27,'2018'!A:B,2,FALSE)","v":57},31]
["Hampton by Hilton",27,{"$f":"VLOOKUP(A28,'2018'!A:B,2,FALSE)","v":29},2]
["Servpro",28,{"$f":"VLOOKUP(A29,'2018'!A:B,2,FALSE)","v":12},-16]
["uBreakiFix",29,{"$f":"VLOOKUP(A30,'2018'!A:B,2,FALSE)","v":18},-11]
["HomeVestors of America Inc.",30,{"$f":"VLOOKUP(A31,'2018'!A:B,2,FALSE)","v":37},7]
["Supercuts",31,{"$f":"VLOOKUP(A32,'2018'!A:B,2,FALSE)","v":14},-17]
["Keller Williams",32,{"$f":"VLOOKUP(A33,'2018'!A:B,2,FALSE)","v":22},-10]
["Carl's Jr. Restaurants LLC",33,{"$f":"VLOOKUP(A34,'2018'!A:B,2,FALSE)","v":15},-18]
["Golden Corral Restaurants",34,{"$f":"VLOOKUP(A35,'2018'!A:B,2,FALSE)","v":54},20]
["Budget Blinds LLC",35,{"$f":"VLOOKUP(A36,'2018'!A:B,2,FALSE)","v":23},-12]
["Holiday Inn and Holiday Inn Express",36,{"$f":"VLOOKUP(A37,'2018'!A:B,2,FALSE)","v":62},26]
["Matco Tools",37,{"$f":"VLOOKUP(A38,'2018'!A:B,2,FALSE)","v":36},-1]
["Merry Maids",38,{"$f":"VLOOKUP(A39,'2018'!A:B,2,FALSE)","v":38},0]
["Jan-Pro Franchising Int'l. Inc.",39,{"$f":"VLOOKUP(A40,'2018'!A:B,2,FALSE)","v":51},12]
["Mathnasium Learning Centers",40,{"$f":"VLOOKUP(A41,'2018'!A:B,2,FALSE)","v":28},-12]
["McAlister's Deli",41,{"$f":"VLOOKUP(A42,'2018'!A:B,2,FALSE)","v":114},73]
["Stratus Building Solutions",42,{"$f":"VLOOKUP(A43,'2018'!A:B,2,FALSE)","v":103},61]
["Arby's",43,{"$f":"VLOOKUP(A44,'2018'!A:B,2,FALSE)","v":112},69]
["Papa John's Int'l. Inc.",44,{"$f":"VLOOKUP(A45,'2018'!A:B,2,FALSE)","v":16},-28]
["Hardee's Restaurants LLC",45,{"$f":"VLOOKUP(A46,'2018'!A:B,2,FALSE)","v":9},-36]
["Pet Supplies Plus",46,{"$f":"VLOOKUP(A47,'2018'!A:B,2,FALSE)","v":32},-14]
["Mosquito Joe",47,{"$f":"VLOOKUP(A48,'2018'!A:B,2,FALSE)","v":42},-5]
["Huntington Learning Centers",48,{"$f":"VLOOKUP(A49,'2018'!A:B,2,FALSE)","v":154},106]
["Firehouse Subs",49,{"$f":"VLOOKUP(A50,'2018'!A:B,2,FALSE)","v":39},-10]
["Goldfish Swim School Franchising LLC",50,{"$f":"VLOOKUP(A51,'2018'!A:B,2,FALSE)","v":55},5]
["Freddy's Frozen Custard & Steakburgers",51,{"$f":"VLOOKUP(A52,'2018'!A:B,2,FALSE)","v":44},-7]
["Anago Cleaning Systems",52,{"$f":"VLOOKUP(A53,'2018'!A:B,2,FALSE)","v":68},16]
["Doubletree by Hilton",53,{"$f":"VLOOKUP(A54,'2018'!A:B,2,FALSE)","v":144},91]
["Mac Tools",54,{"$f":"VLOOKUP(A55,'2018'!A:B,2,FALSE)","v":40},-14]
["Primrose School Franchising Co.",55,{"$f":"VLOOKUP(A56,'2018'!A:B,2,FALSE)","v":27},-28]
["Hilton Hotels and Resorts",56,{"$f":"VLOOKUP(A57,'2018'!A:B,2,FALSE)","v":33},-23]
["911 Restoration",57,{"$f":"VLOOKUP(A58,'2018'!A:B,2,FALSE)","v":162},105]
["Lawn Doctor",58,{"$f":"VLOOKUP(A59,'2018'!A:B,2,FALSE)","v":91},33]
["Weed Man",59,{"$f":"VLOOKUP(A60,'2018'!A:B,2,FALSE)","v":59},0]
["Cruise Planners",60,{"$f":"VLOOKUP(A61,'2018'!A:B,2,FALSE)","v":60},0]
["Blaze Fast-Fire'd Pizza",61,{"$f":"VLOOKUP(A62,'2018'!A:B,2,FALSE)","v":95},34]
["Red Roof Inn",62,{"$f":"VLOOKUP(A63,'2018'!A:B,2,FALSE)","v":92},30]
["Miracle-Ear Inc.",63,"NEW",{"$error":"#N/A"}]
["Fyzical Therapy & Balance Centers",64,{"$f":"VLOOKUP(A65,'2018'!A:B,2,FALSE)","v":117},53]
["Tropical Smoothie Cafe",65,{"$f":"VLOOKUP(A66,'2018'!A:B,2,FALSE)","v":71},6]
["Express Employment Professionals",66,{"$f":"VLOOKUP(A67,'2018'!A:B,2,FALSE)","v":69},3]
["Kona Ice",67,{"$f":"VLOOKUP(A68,'2018'!A:B,2,FALSE)","v":83},16]
["Kilwins Chocolates Franchise Inc.",68,{"$f":"VLOOKUP(A69,'2018'!A:B,2,FALSE)","v":94},26]
["The Maids",69,{"$f":"VLOOKUP(A70,'2018'!A:B,2,FALSE)","v":46},-23]
["Homewood Suites by Hilton",70,{"$f":"VLOOKUP(A71,'2018'!A:B,2,FALSE)","v":66},-4]
["Potbelly Sandwich Shop",71,{"$f":"VLOOKUP(A72,'2018'!A:B,2,FALSE)","v":269},198]
["Chem-Dry Carpet & Upholstery Cleaning",72,{"$f":"VLOOKUP(A73,'2018'!A:B,2,FALSE)","v":137},65]
["Motel 6",73,{"$f":"VLOOKUP(A74,'2018'!A:B,2,FALSE)","v":116},43]
["Cinnabon",74,{"$f":"VLOOKUP(A75,'2018'!A:B,2,FALSE)","v":98},24]
["Pearle Vision",75,{"$f":"VLOOKUP(A76,'2018'!A:B,2,FALSE)","v":72},-3]
["Vanguard Cleaning Systems",76,{"$f":"VLOOKUP(A77,'2018'!A:B,2,FALSE)","v":84},8]
["Fuzzy's Taco Shop",77,{"$f":"VLOOKUP(A78,'2018'!A:B,2,FALSE)","v":123},46]
["Hilton Garden Inn",78,{"$f":"VLOOKUP(A79,'2018'!A:B,2,FALSE)","v":100},22]
["Auntie Anne's Hand-Rolled Soft Pretzels",79,{"$f":"VLOOKUP(A80,'2018'!A:B,2,FALSE)","v":124},45]
["Ben & Jerry's",80,{"$f":"VLOOKUP(A81,'2018'!A:B,2,FALSE)","v":261},181]
["Cornwell Quality Tools",81,{"$f":"VLOOKUP(A82,'2018'!A:B,2,FALSE)","v":145},64]
["Goddard Systems Inc.",82,{"$f":"VLOOKUP(A83,'2018'!A:B,2,FALSE)","v":77},-5]
["Marco's Pizza",83,{"$f":"VLOOKUP(A84,'2018'!A:B,2,FALSE)","v":25},-58]
["The Learning Experience Academy of Early Education",84,{"$f":"VLOOKUP(A85,'2018'!A:B,2,FALSE)","v":79},-5]
["SafeSplash/SwimLabs/Swimtastic",85,{"$f":"VLOOKUP(A86,'2018'!A:B,2,FALSE)","v":325},240]
["Palm Beach Tan",86,{"$f":"VLOOKUP(A87,'2018'!A:B,2,FALSE)","v":52},-34]
["British Swim School USA",87,{"$f":"VLOOKUP(A88,'2018'!A:B,2,FALSE)","v":121},34]
["Checkers Drive-In Restaurants Inc.",88,{"$f":"VLOOKUP(A89,'2018'!A:B,2,FALSE)","v":140},52]
["Home2 Suites by Hilton",89,"NEW",{"$error":"#N/A"}]
["Jiffy Lube Int'l. Inc.",90,{"$f":"VLOOKUP(A91,'2018'!A:B,2,FALSE)","v":181},91]
["CMIT Solutions Inc.",91,{"$f":"VLOOKUP(A92,'2018'!A:B,2,FALSE)","v":186},95]
["Embassy Suites by Hilton",92,{"$f":"VLOOKUP(A93,'2018'!A:B,2,FALSE)","v":61},-31]
["Rooter-Man",93,{"$f":"VLOOKUP(A94,'2018'!A:B,2,FALSE)","v":107},14]
["Jazzercise Inc.",94,{"$f":"VLOOKUP(A95,'2018'!A:B,2,FALSE)","v":63},-31]
["FastSigns Int'l. Inc.",95,{"$f":"VLOOKUP(A96,'2018'!A:B,2,FALSE)","v":70},-25]
["Carstar Franchise Systems Inc.",96,{"$f":"VLOOKUP(A97,'2018'!A:B,2,FALSE)","v":255},159]
["Urban Air Adventure Park",97,"NEW",{"$error":"#N/A"}]
["Pillar To Post Home Inspectors",98,{"$f":"VLOOKUP(A99,'2018'!A:B,2,FALSE)","v":64},-34]
["Express Oil Change & Tire Engineers",99,{"$f":"VLOOKUP(A100,'2018'!A:B,2,FALSE)","v":120},21]
["Spring-Green Lawn Care",100,{"$f":"VLOOKUP(A101,'2018'!A:B,2,FALSE)","v":169},69]
["Dream Vacations",101,{"$f":"VLOOKUP(A102,'2018'!A:B,2,FALSE)","v":138},37]
["Charleys Philly Steaks",102,{"$f":"VLOOKUP(A103,'2018'!A:B,2,FALSE)","v":160},58]
["Weichert Real Estate Affiliates Inc.",103,{"$f":"VLOOKUP(A104,'2018'!A:B,2,FALSE)","v":139},36]
["Fleet Feet",104,{"$f":"VLOOKUP(A105,'2018'!A:B,2,FALSE)","v":90},-14]
["Taco John's Int'l. Inc.",105,"NEW",{"$error":"#N/A"}]
["Valvoline Instant Oil Change",106,{"$f":"VLOOKUP(A107,'2018'!A:B,2,FALSE)","v":34},-72]
["American Family Care",107,{"$f":"VLOOKUP(A108,'2018'!A:B,2,FALSE)","v":115},8]
["Edible Arrangements",108,{"$f":"VLOOKUP(A109,'2018'!A:B,2,FALSE)","v":53},-55]
["The Joint Corp.",109,{"$f":"VLOOKUP(A110,'2018'!A:B,2,FALSE)","v":109},0]
["Chester's",110,{"$f":"VLOOKUP(A111,'2018'!A:B,2,FALSE)","v":153},43]
["Kiddie Academy",111,{"$f":"VLOOKUP(A112,'2018'!A:B,2,FALSE)","v":73},-38]
["9Round",112,{"$f":"VLOOKUP(A113,'2018'!A:B,2,FALSE)","v":197},85]
["One Hour Heating & Air Conditioning",113,{"$f":"VLOOKUP(A114,'2018'!A:B,2,FALSE)","v":104},-9]
["Batteries Plus Bulbs",114,{"$f":"VLOOKUP(A115,'2018'!A:B,2,FALSE)","v":118},4]
["Pirtek",115,{"$f":"VLOOKUP(A116,'2018'!A:B,2,FALSE)","v":78},-37]
["Buffalo Wild Wings",116,"NEW",{"$error":"#N/A"}]
["HoneyBaked Ham",117,{"$f":"VLOOKUP(A118,'2018'!A:B,2,FALSE)","v":130},13]
["The Little Gym Int'l.",118,{"$f":"VLOOKUP(A119,'2018'!A:B,2,FALSE)","v":189},71]
["Drybar",119,"NEW",{"$error":"#N/A"}]
{"$rows_left_out":382}
{"sheet":"2018","index":1,"n_rows":501,"n_cols":3,"rows_kept":501,"cut":false,"hidden":false,"merged":[]}
["Franchise","2018 Rankings","2019 Rankings"]
["Wingstop Restaurants Inc.",31,{"$f":"VLOOKUP(A2,'2019'!A:A,1,FALSE)","v":{"$error":"#N/A"}}]
["Denny's Inc.",76,{"$f":"VLOOKUP(A3,'2019'!A:A,1,FALSE)","v":{"$error":"#N/A"}}]
["Ikor Int'l. LLC",86,{"$f":"VLOOKUP(A4,'2019'!A:A,1,FALSE)","v":{"$error":"#N/A"}}]
["Valpak Direct Marketing Systems Inc.",128,{"$f":"VLOOKUP(A5,'2019'!A:A,1,FALSE)","v":{"$error":"#N/A"}}]
["AdvantaClean",148,{"$f":"VLOOKUP(A6,'2019'!A:A,1,FALSE)","v":{"$error":"#N/A"}}]
["1-800 Water Damage",161,{"$f":"VLOOKUP(A7,'2019'!A:A,1,FALSE)","v":{"$error":"#N/A"}}]
["Rockin' Jump",165,{"$f":"VLOOKUP(A8,'2019'!A:A,1,FALSE)","v":{"$error":"#N/A"}}]
["la Madeleine French Bakery & Cafe",167,{"$f":"VLOOKUP(A9,'2019'!A:A,1,FALSE)","v":{"$error":"#N/A"}}]
["Dickey's Barbecue Pit",170,{"$f":"VLOOKUP(A10,'2019'!A:A,1,FALSE)","v":{"$error":"#N/A"}}]
["Jantize America",184,{"$f":"VLOOKUP(A11,'2019'!A:A,1,FALSE)","v":{"$error":"#N/A"}}]
["Buddy's Home Furnishings",190,{"$f":"VLOOKUP(A12,'2019'!A:A,1,FALSE)","v":{"$error":"#N/A"}}]
["Slumberland Franchising Inc.",200,{"$f":"VLOOKUP(A13,'2019'!A:A,1,FALSE)","v":{"$error":"#N/A"}}]
["Farmer Boys Restaurants",206,{"$f":"VLOOKUP(A14,'2019'!A:A,1,FALSE)","v":{"$error":"#N/A"}}]
["milliCare",215,{"$f":"VLOOKUP(A15,'2019'!A:A,1,FALSE)","v":{"$error":"#N/A"}}]
["Bahama Buck's",232,{"$f":"VLOOKUP(A16,'2019'!A:A,1,FALSE)","v":{"$error":"#N/A"}}]
["Best in Class Education Center",248,{"$f":"VLOOKUP(A17,'2019'!A:A,1,FALSE)","v":{"$error":"#N/A"}}]
["Handyman Connection",253,{"$f":"VLOOKUP(A18,'2019'!A:A,1,FALSE)","v":{"$error":"#N/A"}}]
["Seva Beauty",262,{"$f":"VLOOKUP(A19,'2019'!A:A,1,FALSE)","v":{"$error":"#N/A"}}]
["ARCpoint Labs",272,{"$f":"VLOOKUP(A20,'2019'!A:A,1,FALSE)","v":{"$error":"#N/A"}}]
["Boulder Designs",296,{"$f":"VLOOKUP(A21,'2019'!A:A,1,FALSE)","v":{"$error":"#N/A"}}]
["SwimLabs Swim School",301,{"$f":"VLOOKUP(A22,'2019'!A:A,1,FALSE)","v":{"$error":"#N/A"}}]
["Window Genie",302,{"$f":"VLOOKUP(A23,'2019'!A:A,1,FALSE)","v":{"$error":"#N/A"}}]
["Villa Italian Kitchen",316,{"$f":"VLOOKUP(A24,'2019'!A:A,1,FALSE)","v":{"$error":"#N/A"}}]
["Honest-1 Auto Care LLC",319,{"$f":"VLOOKUP(A25,'2019'!A:A,1,FALSE)","v":{"$error":"#N/A"}}]
["Eggs Up Grill",321,{"$f":"VLOOKUP(A26,'2019'!A:A,1,FALSE)","v":{"$error":"#N/A"}}]
["The Entrepreneur's Source",333,{"$f":"VLOOKUP(A27,'2019'!A:A,1,FALSE)","v":{"$error":"#N/A"}}]
["Sit Means Sit Dog Training",340,{"$f":"VLOOKUP(A28,'2019'!A:A,1,FALSE)","v":{"$error":"#N/A"}}]
["Digital Doc",343,{"$f":"VLOOKUP(A29,'2019'!A:A,1,FALSE)","v":{"$error":"#N/A"}}]
["ComForCare Home Care",346,{"$f":"VLOOKUP(A30,'2019'!A:A,1,FALSE)","v":{"$error":"#N/A"}}]
["Nutty Scientists",353,{"$f":"VLOOKUP(A31,'2019'!A:A,1,FALSE)","v":{"$error":"#N/A"}}]
["Storm Guard Roofing & Construction",356,{"$f":"VLOOKUP(A32,'2019'!A:A,1,FALSE)","v":{"$error":"#N/A"}}]
["Paul Davis Emergency Services",362,{"$f":"VLOOKUP(A33,'2019'!A:A,1,FALSE)","v":{"$error":"#N/A"}}]
["Money Mailer Franchise Corp.",364,{"$f":"VLOOKUP(A34,'2019'!A:A,1,FALSE)","v":{"$error":"#N/A"}}]
["HappyFeet Legends Int'l.",368,{"$f":"VLOOKUP(A35,'2019'!A:A,1,FALSE)","v":{"$error":"#N/A"}}]
["Juice It Up!",373,{"$f":"VLOOKUP(A36,'2019'!A:A,1,FALSE)","v":{"$error":"#N/A"}}]
["The Cleaning Authority",374,{"$f":"VLOOKUP(A37,'2019'!A:A,1,FALSE)","v":{"$error":"#N/A"}}]
["Red Lion Hotels",375,{"$f":"VLOOKUP(A38,'2019'!A:A,1,FALSE)","v":{"$error":"#N/A"}}]
["Relocation Strategies",381,{"$f":"VLOOKUP(A39,'2019'!A:A,1,FALSE)","v":{"$error":"#N/A"}}]
["Lapels",382,{"$f":"VLOOKUP(A40,'2019'!A:A,1,FALSE)","v":{"$error":"#N/A"}}]
["Fox's Pizza Den",387,{"$f":"VLOOKUP(A41,'2019'!A:A,1,FALSE)","v":{"$error":"#N/A"}}]
["Handyman Matters Franchise Inc.",393,{"$f":"VLOOKUP(A42,'2019'!A:A,1,FALSE)","v":{"$error":"#N/A"}}]
["WIN Home Inspection",395,{"$f":"VLOOKUP(A43,'2019'!A:A,1,FALSE)","v":{"$error":"#N/A"}}]
["UFC Gym",397,{"$f":"VLOOKUP(A44,'2019'!A:A,1,FALSE)","v":{"$error":"#N/A"}}]
["Marble Slab Creamery",401,{"$f":"VLOOKUP(A45,'2019'!A:A,1,FALSE)","v":{"$error":"#N/A"}}]
["Biggby Coffee",406,{"$f":"VLOOKUP(A46,'2019'!A:A,1,FALSE)","v":{"$error":"#N/A"}}]
["The Flame Broiler Inc.",407,{"$f":"VLOOKUP(A47,'2019'!A:A,1,FALSE)","v":{"$error":"#N/A"}}]
["Zippy Shell Moving and Storage",422,{"$f":"VLOOKUP(A48,'2019'!A:A,1,FALSE)","v":{"$error":"#N/A"}}]
["Realty Executives Intl. Svcs. LLC",424,{"$f":"VLOOKUP(A49,'2019'!A:A,1,FALSE)","v":{"$error":"#N/A"}}]
["AIM Mail Centers",426,{"$f":"VLOOKUP(A50,'2019'!A:A,1,FALSE)","v":{"$error":"#N/A"}}]
["Parcel Plus",427,{"$f":"VLOOKUP(A51,'2019'!A:A,1,FALSE)","v":{"$error":"#N/A"}}]
["Complete Weddings + Events",429,{"$f":"VLOOKUP(A52,'2019'!A:A,1,FALSE)","v":{"$error":"#N/A"}}]
["Snip-Its",430,{"$f":"VLOOKUP(A53,'2019'!A:A,1,FALSE)","v":{"$error":"#N/A"}}]
["Christmas Decor",433,{"$f":"VLOOKUP(A54,'2019'!A:A,1,FALSE)","v":{"$error":"#N/A"}}]
["Colors On Parade",434,{"$f":"VLOOKUP(A55,'2019'!A:A,1,FALSE)","v":{"$error":"#N/A"}}]
["Outdoor Lighting Perspectives",439,{"$f":"VLOOKUP(A56,'2019'!A:A,1,FALSE)","v":{"$error":"#N/A"}}]
["Preferred Care at Home",441,{"$f":"VLOOKUP(A57,'2019'!A:A,1,FALSE)","v":{"$error":"#N/A"}}]
["Dunn Brothers Coffee",442,{"$f":"VLOOKUP(A58,'2019'!A:A,1,FALSE)","v":{"$error":"#N/A"}}]
["The Glass Guru",445,{"$f":"VLOOKUP(A59,'2019'!A:A,1,FALSE)","v":{"$error":"#N/A"}}]
["Papa Murphy's Take 'N' Bake Pizza",446,{"$f":"VLOOKUP(A60,'2019'!A:A,1,FALSE)","v":{"$error":"#N/A"}}]
["Copper Penny",447,{"$f":"VLOOKUP(A61,'2019'!A:A,1,FALSE)","v":{"$error":"#N/A"}}]
["Junk King",448,{"$f":"VLOOKUP(A62,'2019'!A:A,1,FALSE)","v":{"$error":"#N/A"}}]
["Caring Transitions",449,{"$f":"VLOOKUP(A63,'2019'!A:A,1,FALSE)","v":{"$error":"#N/A"}}]
["Sparkle Wash Int'l.",452,{"$f":"VLOOKUP(A64,'2019'!A:A,1,FALSE)","v":{"$error":"#N/A"}}]
["U.S. Lawns",454,{"$f":"VLOOKUP(A65,'2019'!A:A,1,FALSE)","v":{"$error":"#N/A"}}]
["Murphy Business & Financial Corp. LLC",458,{"$f":"VLOOKUP(A66,'2019'!A:A,1,FALSE)","v":{"$error":"#N/A"}}]
["J.D. Byrider",461,{"$f":"VLOOKUP(A67,'2019'!A:A,1,FALSE)","v":{"$error":"#N/A"}}]
["Happy Tax Franchising",462,{"$f":"VLOOKUP(A68,'2019'!A:A,1,FALSE)","v":{"$error":"#N/A"}}]
["Supporting Strategies",466,{"$f":"VLOOKUP(A69,'2019'!A:A,1,FALSE)","v":{"$error":"#N/A"}}]
["Sir Grout Franchising",467,{"$f":"VLOOKUP(A70,'2019'!A:A,1,FALSE)","v":{"$error":"#N/A"}}]
["Cottage Inn Pizza",468,{"$f":"VLOOKUP(A71,'2019'!A:A,1,FALSE)","v":{"$error":"#N/A"}}]
["Yogurtland Franchising Inc.",469,{"$f":"VLOOKUP(A72,'2019'!A:A,1,FALSE)","v":{"$error":"#N/A"}}]
["United Real Estate",471,{"$f":"VLOOKUP(A73,'2019'!A:A,1,FALSE)","v":{"$error":"#N/A"}}]
["Welcomemat Services",472,{"$f":"VLOOKUP(A74,'2019'!A:A,1,FALSE)","v":{"$error":"#N/A"}}]
["Maid Right Franchising LLC",473,{"$f":"VLOOKUP(A75,'2019'!A:A,1,FALSE)","v":{"$error":"#N/A"}}]
["Crowne Plaza Hotels & Resorts",476,{"$f":"VLOOKUP(A76,'2019'!A:A,1,FALSE)","v":{"$error":"#N/A"}}]
["The Grounds Guys LLC",478,{"$f":"VLOOKUP(A77,'2019'!A:A,1,FALSE)","v":{"$error":"#N/A"}}]
["Amramp",479,{"$f":"VLOOKUP(A78,'2019'!A:A,1,FALSE)","v":{"$error":"#N/A"}}]
["LeafSpring Schools",480,{"$f":"VLOOKUP(A79,'2019'!A:A,1,FALSE)","v":{"$error":"#N/A"}}]
["Parisi Speed School",481,{"$f":"VLOOKUP(A80,'2019'!A:A,1,FALSE)","v":{"$error":"#N/A"}}]
["Massage Heights",483,{"$f":"VLOOKUP(A81,'2019'!A:A,1,FALSE)","v":{"$error":"#N/A"}}]
["Archadeck Outdoor Living",484,{"$f":"VLOOKUP(A82,'2019'!A:A,1,FALSE)","v":{"$error":"#N/A"}}]
["Fortune Personnel Consultants (FPC)",486,{"$f":"VLOOKUP(A83,'2019'!A:A,1,FALSE)","v":{"$error":"#N/A"}}]
["Dental Fix RX LLC",487,{"$f":"VLOOKUP(A84,'2019'!A:A,1,FALSE)","v":{"$error":"#N/A"}}]
["Young Rembrandts Franchise Inc.",489,{"$f":"VLOOKUP(A85,'2019'!A:A,1,FALSE)","v":{"$error":"#N/A"}}]
["Clothes Mentor",491,{"$f":"VLOOKUP(A86,'2019'!A:A,1,FALSE)","v":{"$error":"#N/A"}}]
["The Woodhouse Spas",492,{"$f":"VLOOKUP(A87,'2019'!A:A,1,FALSE)","v":{"$error":"#N/A"}}]
["Medi-Weightloss Franchising USA LLC",494,{"$f":"VLOOKUP(A88,'2019'!A:A,1,FALSE)","v":{"$error":"#N/A"}}]
["GarageExperts",495,{"$f":"VLOOKUP(A89,'2019'!A:A,1,FALSE)","v":{"$error":"#N/A"}}]
["Engineering for Kids",496,{"$f":"VLOOKUP(A90,'2019'!A:A,1,FALSE)","v":{"$error":"#N/A"}}]
["Mr. Sandless/Dr. DecknFence",499,{"$f":"VLOOKUP(A91,'2019'!A:A,1,FALSE)","v":{"$error":"#N/A"}}]
["Aire Serv LLC",500,{"$f":"VLOOKUP(A92,'2019'!A:A,1,FALSE)","v":{"$error":"#N/A"}}]
["Zoup! Systems LLC",327,{"$f":"VLOOKUP(A93,'2019'!A:A,1,FALSE)","v":"Zoup! Systems LLC"}]
["Zips Dry Cleaners",135,{"$f":"VLOOKUP(A94,'2019'!A:A,1,FALSE)","v":"Zips Dry Cleaners"}]
["Ziebart",151,{"$f":"VLOOKUP(A95,'2019'!A:A,1,FALSE)","v":"Ziebart"}]
["Zerorez Franchising Systems Inc.",349,{"$f":"VLOOKUP(A96,'2019'!A:A,1,FALSE)","v":"Zerorez Franchising Systems Inc."}]
["Yogi Bear's Jellystone Park Camp-Resorts",265,{"$f":"VLOOKUP(A97,'2019'!A:A,1,FALSE)","v":"Yogi Bear's Jellystone Park Camp-Resorts"}]
["YESCO Sign & Lighting Service",143,{"$f":"VLOOKUP(A98,'2019'!A:A,1,FALSE)","v":"YESCO Sign & Lighting Service"}]
["Workout Anytime 24/7",394,{"$f":"VLOOKUP(A99,'2019'!A:A,1,FALSE)","v":"Workout Anytime 24/7"}]
["Wireless Zone",388,{"$f":"VLOOKUP(A100,'2019'!A:A,1,FALSE)","v":"Wireless Zone"}]
["Window Gang",338,{"$f":"VLOOKUP(A101,'2019'!A:A,1,FALSE)","v":"Window Gang"}]
["Wild Birds Unlimited",218,{"$f":"VLOOKUP(A102,'2019'!A:A,1,FALSE)","v":"Wild Birds Unlimited"}]
["Wienerschnitzel",166,{"$f":"VLOOKUP(A103,'2019'!A:A,1,FALSE)","v":"Wienerschnitzel"}]
["Which Wich Superior Sandwiches",204,{"$f":"VLOOKUP(A104,'2019'!A:A,1,FALSE)","v":"Which Wich Superior Sandwiches"}]
["Wetzel's Pretzels",268,{"$f":"VLOOKUP(A105,'2019'!A:A,1,FALSE)","v":"Wetzel's Pretzels"}]
["Weichert Real Estate Affiliates Inc.",139,{"$f":"VLOOKUP(A106,'2019'!A:A,1,FALSE)","v":"Weichert Real Estate Affiliates Inc."}]
["Weed Man",59,{"$f":"VLOOKUP(A107,'2019'!A:A,1,FALSE)","v":"Weed Man"}]
["Wayback Burgers",463,{"$f":"VLOOKUP(A108,'2019'!A:A,1,FALSE)","v":"Wayback Burgers"}]
["Waxing The City",111,{"$f":"VLOOKUP(A109,'2019'!A:A,1,FALSE)","v":"Waxing The City"}]
["Watermill Express Franchising",244,{"$f":"VLOOKUP(A110,'2019'!A:A,1,FALSE)","v":"Watermill Express Franchising"}]
["Wag N' Wash Natural Food & Bakery",465,{"$f":"VLOOKUP(A111,'2019'!A:A,1,FALSE)","v":"Wag N' Wash Natural Food & Bakery"}]
["Visiting Angels",74,{"$f":"VLOOKUP(A112,'2019'!A:A,1,FALSE)","v":"Visiting Angels"}]
["velofix Group of Companies",106,{"$f":"VLOOKUP(A113,'2019'!A:A,1,FALSE)","v":"velofix Group of Companies"}]
["Vanguard Cleaning Systems",84,{"$f":"VLOOKUP(A114,'2019'!A:A,1,FALSE)","v":"Vanguard Cleaning Systems"}]
["Valvoline Instant Oil Change",34,{"$f":"VLOOKUP(A115,'2019'!A:A,1,FALSE)","v":"Valvoline Instant Oil Change"}]
["USA Insulation",328,{"$f":"VLOOKUP(A116,'2019'!A:A,1,FALSE)","v":"USA Insulation"}]
["Uptown Cheapskate",288,{"$f":"VLOOKUP(A117,'2019'!A:A,1,FALSE)","v":"Uptown Cheapskate"}]
["uBreakiFix",18,{"$f":"VLOOKUP(A118,'2019'!A:A,1,FALSE)","v":"uBreakiFix"}]
["Two Men and a Truck Int'l. Inc.",87,{"$f":"VLOOKUP(A119,'2019'!A:A,1,FALSE)","v":"Two Men and a Truck Int'l. Inc."}]
["Two Maids & A Mop",235,{"$f":"VLOOKUP(A120,'2019'!A:A,1,FALSE)","v":"Two Maids & A Mop"}]
{"$rows_left_out":381}