{"text_format":"1","workbook":"xlsx","n_sheets":12,"sheets":["Instructions","Settings","Table of Contents","Financial Statements and Ratios","Charts","Fundies","Dividends","Price_Vol","Price_Dividend","URL_Builder","account","bugs and notes"],"not_rendered":{"charts":8,"images":3,"macros":1,"external_links":0,"defined_names":48,"comments":0,"pivot_tables":0},"unopened":[],"bounds":{"document_bytes":16777216,"sheet_cells":100000,"rows_first":2000,"rows_last":500,"rows_between":2000,"halvings":0,"cell_chars":16384,"cell_head_chars":4096},"cells_cut":0,"cells_raw":0,"read":"whole","date_system":"1900"}

{"sheet":"Instructions","index":0,"n_rows":26,"n_cols":2,"rows_kept":26,"cut":false,"hidden":false,"merged":[]}
[]
[]
[null,"Source data provided by New Constructs, LLC © All rights reserved.  Delivered by iexcloud.io"]
["This spreadsheet is the personal work of Tim Baker, and is not an official IEX Cloud product. All data is sourced via the IEX Cloud API. "]
["IEX Cloud Services LLC makes no promises or guarantees herein regarding results from particular products and services, and neither the information, nor any opinion expressed here, constitutes a solicitation or offer to buy or sell any securities or provide any investment advice or service."]
["About this spreadsheet","Links"]
["This spreadsheet can be used to analyse the detailed financial statements of US listed companies. This is the personal work of Tim Baker, and is not an official IEX Cloud product. "]
["It is supplied free of charge. Should you make improvements to this spreadsheet, feel free to contribute it back to the excel community at iexcloud.  Here ------------------------------------------------->","community@iexcloud.io "]
["In order to update this spreadsheet with different companies, you will need to sign up for a paid IEX Cloud account by signing up here: --------------------------------------------------------------------------------->","https://iexcloud.io/cloud-login#/register"]
["This spreadhseet is provided \"as is\" and may contain errors or differences to some calculation conventions used in financial analysis.  Do let us know if you have any questions, or corrections."]
["Additional information about our Financial Statements endpoints can be found here: -------------->","data-migration-updates-to-financial-statements"]
["This spreadsheet is formatted for Industrial (ie non-financial/bank) companies."]
["Feel free to share this file with friends and colleagues (remembering to remove your IEX Cloud credentials)"]
["Should you publish your analysis,  please source the data as follows:  “Underlying data provided by New Constructs, LLC © All rights reserved.  iexcloud.io\""]
[]
["Overview & Instructions"]
["Sign up for an iexcloud account.","https://iexcloud.io/cloud-login#/register"]
["Go to the settings tab:"]
[" Enter your iexcloud token into the settings TAB. Select the Ticker of the required company.  "]
["Enter the Ticker into the indicated field, and once the correct company is shown, hit the LOAD button.  If you have macros disabled, you can also hit Data/Refresh instead."]
{"$rows_left_out":7}
{"sheet":"Settings","index":1,"n_rows":52,"n_cols":5,"rows_kept":52,"cut":false,"hidden":false,"merged":[[19,3,19,8],[3,3,3,8],[4,3,4,8],[5,3,5,8],[6,3,6,8],[18,3,18,8]]}
[]
[]
[]
["Ticker","KO",null,"< ----------- Enter Ticker here"]
["Company",{"$f":"_xlfn.WEBSERVICE(\"https://cloud.iexapis.com/stable/stock/\"&Ticker&\"/stats/companyName?token=\"&my_token)","v":{"$error":"#VALUE!"}},null,"If correct company shows here, hit LOAD (below), or Data / Refresh All"]
["Period Type","annual",null,"Select ttm (trailing twelve months, quarterly, or annual (12 months)"]
["# of period",{"$f":"VLOOKUP(period_type,PeriodType[],2,FALSE)","v":"7y"},null,"This is the reccomended # of periods for the period type.  You can over write this, or edit the defaults here-->"]
[]
[]
["Prices Loaded",{"$f":"Price_Vol!D2=Ticker","v":true}]
["Financials Loaded",{"$f":"VLOOKUP(\"symbol\",FetchFundies[],2,FALSE)=Ticker","v":true}]
["Dividends Loaded",{"$f":"IF(Dividends!H23=Ticker,TRUE,\"No Dividends Loaded, ignore Dividend Chart\")","v":true}]
["Annual Ratings and Estimates Loaded",{"$f":"IF(#REF!=Ticker,TRUE,FALSE)","v":{"$error":"#REF!"}}]
[]
["Scale in Millions","Y"]
[null,{"$f":"IF(B15=\"Y\",1000000,1)","v":1000000}]
[]
["Your personal Token"]
["IEX Cloud Token",null,null,"< ----------- Enter your iexcloud token here.  Go to your consolde to copy your token."]
["Secret Token",null,null,"< ----------- Enter your secret iexcloud token here (prefix sk) - OPTIONAL!"]
{"$rows_left_out":33}
{"sheet":"Table of Contents","index":2,"n_rows":19,"n_cols":4,"rows_kept":19,"cut":false,"hidden":false,"merged":[[3,2,3,3],[8,0,8,1],[10,0,10,1],[4,0,4,1],[1,0,1,1],[3,0,3,1],[2,0,2,1]]}
[]
["Table of Contents (links below)"]
["Settings"]
["Income Statement   ",null,"Charts Tab"]
["Balance Sheet - Assets",null,null,"Stock Chart"]
[null,"Current Assets",null,"Growth and Profitability"]
[null,"Fixed Assets",null,"Balance Sheet Makeup"]
[null,"Current/Investment Liabilities",null,"Valuation"]
["Cash Flow Statement",null,null,"Margin Analysis"]
[null,null,null,"Cashflow Trends"]
["Calculated Fields and Ratios",null,null,"Stock Price and Dividends"]
[null,"Per Share Data"]
[null,"Valuation Inputs"]
[null,"Valuation Ratios"]
[null,"Margin Analysis"]
[null,"Growth Analysis"]
[null,"Dupont Analysis"]
[null,"Leverage Ratios"]
[null,"Cash Conversion Cycle"]

{"sheet":"Financial Statements and Ratios","index":3,"n_rows":228,"n_cols":12,"rows_kept":228,"cut":false,"hidden":false,"merged":[[154,1,154,2],[12,1,12,2],[9,10,10,10],[10,1,10,2],[149,1,149,2]]}
[null,null,null,{"$f":"IF(E1>1,E1-1,0)","v":2},3,4,{"$f":"IF(H1>1,H1-1,0)","v":5},{"$f":"IF(I1>1,I1-1,0)","v":6},{"$f":"MATCH(MAX(Fundies!183:183),Fundies!183:183)-1","v":7}]
["date",null,null,{"$f":"IFERROR(VLOOKUP($A2,FetchFundies[],D$1+1,FALSE),0)/86400000+25569","v":"2015-12-31"},{"$f":"IFERROR(VLOOKUP($A2,FetchFundies[],E$1+1,FALSE),0)/86400000+25569","v":"2016-12-31"},{"$f":"IFERROR(VLOOKUP($A2,FetchFundies[],F$1+1,FALSE),0)/86400000+25569","v":"2017-12-31"},{"$f":"IFERROR(VLOOKUP($A2,FetchFundies[],G$1+1,FALSE),0)/86400000+25569","v":"2018-12-31"},{"$f":"IFERROR(VLOOKUP($A2,FetchFundies[],H$1+1,FALSE),0)/86400000+25569","v":"2019-12-31"},{"$f":"MAX(Fundies!183:183)/86400000+25569","v":"2020-12-31"}]
["Year",null,null,{"$f":"YEAR(D2)","v":2015},2016,2017,2018,2019,{"$f":"YEAR(I2)","v":2020}]
["Quarter",null,null,{"$f":"ROUNDUP(MONTH(D2)/3,0)","v":4},4,4,4,4,{"$f":"ROUNDUP(MONTH(I2)/3,0)","v":4}]
["Quarter Lookups (for Dividends)",null,"Last Quarter",null,{"$f":"+E3&\"Q\"&E4","v":"2016Q4"},{"$f":"+F3&\"Q\"&F4","v":"2017Q4"},{"$f":"+G3&\"Q\"&G4","v":"2018Q4"},{"$f":"+H3&\"Q\"&H4","v":"2019Q4"},{"$f":"+I3&\"Q\"&I4","v":"2020Q4"}]
[null,null,"Last Q-1",null,{"$f":"IF(E4=4,E3&\"Q3\",IF(E4=3,E3&\"Q2\",IF(E4=2,E3&\"Q1\",IF(E4=1,E3-1&\"Q4\"))))","v":"2016Q3"},{"$f":"IF(F4=4,F3&\"Q3\",IF(F4=3,F3&\"Q2\",IF(F4=2,F3&\"Q1\",IF(F4=1,F3-1&\"Q4\"))))","v":"2017Q3"},{"$f":"IF(G4=4,G3&\"Q3\",IF(G4=3,G3&\"Q2\",IF(G4=2,G3&\"Q1\",IF(G4=1,G3-1&\"Q4\"))))","v":"2018Q3"},{"$f":"IF(H4=4,H3&\"Q3\",IF(H4=3,H3&\"Q2\",IF(H4=2,H3&\"Q1\",IF(H4=1,H3-1&\"Q4\"))))","v":"2019Q3"},{"$f":"IF(I4=4,I3&\"Q3\",IF(I4=3,I3&\"Q2\",IF(I4=2,I3&\"Q1\",IF(I4=1,I3-1&\"Q4\"))))","v":"2020Q3"}]
[null,null,"Last Q-2",null,{"$f":"IF(E4=4,E3&\"Q2\",IF(E4=3,E3&\"Q1\",IF(E4=2,E3-1&\"Q4\",IF(E4=1,E3-1&\"Q3\"))))","v":"2016Q2"},{"$f":"IF(F4=4,F3&\"Q2\",IF(F4=3,F3&\"Q1\",IF(F4=2,F3-1&\"Q4\",IF(F4=1,F3-1&\"Q3\"))))","v":"2017Q2"},{"$f":"IF(G4=4,G3&\"Q2\",IF(G4=3,G3&\"Q1\",IF(G4=2,G3-1&\"Q4\",IF(G4=1,G3-1&\"Q3\"))))","v":"2018Q2"},{"$f":"IF(H4=4,H3&\"Q2\",IF(H4=3,H3&\"Q1\",IF(H4=2,H3-1&\"Q4\",IF(H4=1,H3-1&\"Q3\"))))","v":"2019Q2"},{"$f":"IF(I4=4,I3&\"Q2\",IF(I4=3,I3&\"Q1\",IF(I4=2,I3-1&\"Q4\",IF(I4=1,I3-1&\"Q3\"))))","v":"2020Q2"}]
[null,null,"Last Q-3",null,{"$f":"IF(E4=4,E3&\"Q1\",IF(E4=3,E3-1&\"Q4\",IF(E4=2,E3-1&\"Q3\",IF(E4=1,E3-1&\"Q2\"))))","v":"2016Q1"},{"$f":"IF(F4=4,F3&\"Q1\",IF(F4=3,F3-1&\"Q4\",IF(F4=2,F3-1&\"Q3\",IF(F4=1,F3-1&\"Q2\"))))","v":"2017Q1"},{"$f":"IF(G4=4,G3&\"Q1\",IF(G4=3,G3-1&\"Q4\",IF(G4=2,G3-1&\"Q3\",IF(G4=1,G3-1&\"Q2\"))))","v":"2018Q1"},{"$f":"IF(H4=4,H3&\"Q1\",IF(H4=3,H3-1&\"Q4\",IF(H4=2,H3-1&\"Q3\",IF(H4=1,H3-1&\"Q2\"))))","v":"2019Q1"},{"$f":"IF(I4=4,I3&\"Q1\",IF(I4=3,I3-1&\"Q4\",IF(I4=2,I3-1&\"Q3\",IF(I4=1,I3-1&\"Q2\"))))","v":"2020Q1"}]
[]
["key",{"$f":"IF(Settings!B11,SUBSTITUTE(Settings!B5,\"\"\"\",\"\"),\"Go to settings and hit Load\")","v":{"$error":"#VALUE!"}},null,null,null,null,null,null,null,null,"Select \"y\" to remove blanks"]
[null,{"$f":"IF(Millions=1000000,\"   Amounts in millions, except per share data\",\"   Amounts in USD\")","v":"   Amounts in millions, except per share data"},null,{"$f":"IFERROR(D2,\"\")","v":"2015-12-31"},"2016-12-31","2017-12-31",{"$f":"IFERROR(G2,\"\")","v":"2018-12-31"},{"$f":"+H2","v":"2019-12-31"},{"$f":"MAX(Fundies!183:183)/86400000+25569","v":"2020-12-31"},null,null,"Notes"]
["periodEndDate",null,{"$f":"\"Period ending: \"&TEXT(DATEVALUE(VLOOKUP($A12,FetchFundies[],I$1+1,FALSE)),\"mmmmmmmm\")&\" / \"&Fundamentals[Period_type]","v":"Period ending: December / annual"}]
[null,"Income Statement   ",null,null,null,null,null,null,null,null,{"$f":"IF(B13<>\"\",\"y\",IF(SUM(E13:I13)=0,\"\",\"y\"))","v":"y"}]
[null,"\nRevenues\n",null,null,null,null,null,null,null,null,{"$f":"IF(B14<>\"\",\"y\",IF(SUM(E14:I14)=0,\"\",\"y\"))","v":"y"}]
["revenueother",null,"Operating Revenue",{"$f":"IFERROR(VLOOKUP($A15,FetchFundies[],D$1+1,FALSE)/Millions,0)","v":44294},{"$f":"IFERROR(VLOOKUP($A15,FetchFundies[],E$1+1,FALSE)/Millions,0)","v":41863},{"$f":"IFERROR(VLOOKUP($A15,FetchFundies[],F$1+1,FALSE)/Millions,0)","v":35410},{"$f":"IFERROR(VLOOKUP($A15,FetchFundies[],G$1+1,FALSE)/Millions,0)","v":31856},{"$f":"IFERROR(VLOOKUP($A15,FetchFundies[],H$1+1,FALSE)/Millions,0)","v":37266},{"$f":"IFERROR(VLOOKUP($A15,FetchFundies[],I$1+1,FALSE)/Millions,0)","v":33014},null,{"$f":"IF(B15<>\"\",\"y\",IF(SUM(E15:I15)=0,\"\",\"y\"))","v":"y"},"Revenue, an item on the income statement."]
["revenueincomeinterest",null,"Interest Income",{"$f":"IFERROR(VLOOKUP($A16,FetchFundies[],D$1+1,FALSE)/Millions,0)","v":0},{"$f":"IFERROR(VLOOKUP($A16,FetchFundies[],E$1+1,FALSE)/Millions,0)","v":0},{"$f":"IFERROR(VLOOKUP($A16,FetchFundies[],F$1+1,FALSE)/Millions,0)","v":0},{"$f":"IFERROR(VLOOKUP($A16,FetchFundies[],G$1+1,FALSE)/Millions,0)","v":0},{"$f":"IFERROR(VLOOKUP($A16,FetchFundies[],H$1+1,FALSE)/Millions,0)","v":0},{"$f":"IFERROR(VLOOKUP($A16,FetchFundies[],I$1+1,FALSE)/Millions,0)","v":0},null,"","Interest income for financials, an item on the income statement."]
["revenuesubsidiaryunconsolidated",null,"Unconsolidated Subsidiary Revenue",{"$f":"IFERROR(VLOOKUP($A17,FetchFundies[],D$1+1,FALSE)/Millions,0)","v":0},{"$f":"IFERROR(VLOOKUP($A17,FetchFundies[],E$1+1,FALSE)/Millions,0)","v":0},{"$f":"IFERROR(VLOOKUP($A17,FetchFundies[],F$1+1,FALSE)/Millions,0)","v":0},{"$f":"IFERROR(VLOOKUP($A17,FetchFundies[],G$1+1,FALSE)/Millions,0)","v":0},{"$f":"IFERROR(VLOOKUP($A17,FetchFundies[],H$1+1,FALSE)/Millions,0)","v":0},{"$f":"IFERROR(VLOOKUP($A17,FetchFundies[],I$1+1,FALSE)/Millions,0)","v":0},null,"","Unconsolidated subsidiary revenue, an item on the income statement."]
["Revenue",null,"Total Revenue",{"$f":"IF(ISERROR(D15+D16+D17),\" \",D15+D16+D17)","v":44294},41863,35410,31856,37266,33014,null,"y","Total revenue as reported on the income statement."]
[null,null,null,null,null,null,null,null,null,null,""]
["incomeOperatingDiscontinuedOperations",null,"Income from Discontinued Operations (Operating)",{"$f":"IFERROR(VLOOKUP($A20,FetchFundies[],D$1+1,FALSE)/Millions,0)","v":0},{"$f":"IFERROR(VLOOKUP($A20,FetchFundies[],E$1+1,FALSE)/Millions,0)","v":0},{"$f":"IFERROR(VLOOKUP($A20,FetchFundies[],F$1+1,FALSE)/Millions,0)","v":0},{"$f":"IFERROR(VLOOKUP($A20,FetchFundies[],G$1+1,FALSE)/Millions,0)","v":0},{"$f":"IFERROR(VLOOKUP($A20,FetchFundies[],H$1+1,FALSE)/Millions,0)","v":0},{"$f":"IFERROR(VLOOKUP($A20,FetchFundies[],I$1+1,FALSE)/Millions,0)","v":0},null,"","Income from discontinued operations, an item on the income statement for REITs."]
{"$rows_left_out":209}
{"sheet":"Charts","index":4,"n_rows":251,"n_cols":13,"rows_kept":251,"cut":false,"hidden":false,"merged":[]}
[{"$f":"+'Financial Statements and Ratios'!B10","v":{"$error":"#VALUE!"}}]
[{"$f":"IF(Millions=1000000,\"   Amounts in millions, except per share data\",\"   Amounts in USD\")","v":"   Amounts in millions, except per share data"}]
[]
[]
[]
[]
[]
[]
[]
[]
[]
[]
[]
[]
[]
[]
[]
[]
[]
[]
{"$rows_left_out":232}
{"sheet":"Fundies","index":5,"n_rows":187,"n_cols":25,"rows_kept":187,"cut":false,"hidden":true,"merged":[]}
["Column1","Column2","Column3","Column4","Column5","Column6","Column7","Column8"]
["accountsPayable",2089000000,2795000000,2682000000,2288000000,2498000000,3804000000,3517000000]
["accountsPayableTurnover",22.019147917664,15.8475849731664,15.6088739746458,15.4763986013986,12.7526020816653,9.7965299684542604,9.3869775376741504]
["accountsReceivable",4466000000,3941000000,3856000000,3667000000,3396000000,3971000000,3144000000]
["accountsReceivableTurnover",10.299596954769401,11.2392793707181,10.8565871369295,9.6563948731933493,9.3804475853945792,9.3845378997733597,10.500636132315501]
["asOfDate","2021-04-28","2021-04-28","2021-04-28","2021-04-28","2021-04-28","2021-04-28","2021-04-28"]
["assetsCurrentCash",21675000000,19900000000,22201000000,20675000000,15964000000,11175000000,10914000000]
["assetsCurrentCashRestricted",0,0,0,0,0,0,0]
["assetsCurrentDeferredCompensation",0,0,0,0,0,0,0]
["assetsCurrentDeferredTax",0,0,0,0,0,0,0]
["assetsCurrentDiscontinuedOperations",679000000,3900000000,2797000000,7548000000,6546000000,0,0]
["assetsCurrentInvestments",0,0,0,0,0,0,0]
["assetsCurrentLeasesOperating",0,0,0,0,0,0,0]
["assetsCurrentLoansNet",0,0,0,0,0,0,0]
["assetsCurrentOther",3066000000,2752000000,2481000000,2000000000,1962000000,1886000000,1916000000]
["assetsCurrentSeparateAccounts",0,0,0,0,0,0,0]
["assetsCurrentUnadjusted",32986000000,33395000000,34010000000,36545000000,30634000000,20411000000,19240000000]
["assetsFixed",59037000000,56698000000,53260000000,51351000000,52582000000,65970000000,68056000000]
["assetsFixedDeferredCompensation",0,0,0,0,0,0,0]
["assetsFixedDeferredTax",0,0,0,0,2667000000,2412000000,2460000000]
{"$rows_left_out":168}
{"sheet":"Dividends","index":6,"n_rows":23,"n_cols":16,"rows_kept":23,"cut":false,"hidden":true,"merged":[]}
["paymentDate","amount","currency","description","flag","frequency","date","symbol","declaredDate","exDate","recordDate","Year","Quarter","DayOfWeek","Month","YearQuarter"]
["2016-04-01",0.35,"USD","Ordinary Shares","Cash","quarterly","2016-03-11","KO","2016-02-18","2016-03-11","2016-03-15",2016,2,5,4,"2016Q2"]
["2016-07-01",0.35,"USD","Ordinary Shares","Cash","quarterly","2016-06-13","KO","2016-04-28","2016-06-13","2016-06-15",2016,3,5,7,"2016Q3"]
["2016-10-03",0.35,"USD","Ordinary Shares","Cash","quarterly","2016-09-13","KO","2016-07-21","2016-09-13","2016-09-15",2016,4,1,10,"2016Q4"]
["2016-12-15",0.35,"USD","Ordinary Shares","Cash","quarterly","2016-11-29","KO","2016-10-20","2016-11-29","2016-12-01",2016,4,4,12,"2016Q4"]
["2017-04-03",0.37,"USD","Ordinary Shares","Cash","quarterly","2017-03-13","KO","2017-02-16","2017-03-13","2017-03-15",2017,2,1,4,"2017Q2"]
["2017-07-03",0.37,"USD","Ordinary Shares","Cash","quarterly","2017-06-13","KO","2017-04-27","2017-06-13","2017-06-15",2017,3,1,7,"2017Q3"]
["2017-10-02",0.37,"USD","Ordinary Shares","Cash","quarterly","2017-09-14","KO","2017-07-20","2017-09-14","2017-09-15",2017,4,1,10,"2017Q4"]
["2017-12-15",0.37,"USD","Ordinary Shares","Cash","quarterly","2017-11-30","KO","2017-10-19","2017-11-30","2017-12-01",2017,4,5,12,"2017Q4"]
["2018-04-02",0.39,"USD","Ordinary Shares","Cash","quarterly","2018-03-14","KO","2018-02-15","2018-03-14","2018-03-15",2018,2,1,4,"2018Q2"]
["2018-07-02",0.39,"USD","Ordinary Shares","Cash","quarterly","2018-06-14","KO","2018-04-26","2018-06-14","2018-06-15",2018,3,1,7,"2018Q3"]
["2018-10-01",0.39,"USD","Ordinary Shares","Cash","quarterly","2018-09-13","KO","2018-07-19","2018-09-13","2018-09-14",2018,4,1,10,"2018Q4"]
["2018-12-14",0.39,"USD","Ordinary Shares","Cash","quarterly","2018-11-29","KO","2018-10-18","2018-11-29","2018-11-30",2018,4,5,12,"2018Q4"]
["2019-04-01",0.4,"USD","Ordinary Shares","Cash","quarterly","2019-03-14","KO","2019-02-21","2019-03-14","2019-03-15",2019,2,1,4,"2019Q2"]
["2019-07-01",0.4,"USD","Ordinary Shares","Cash","quarterly","2019-06-13","KO","2019-04-25","2019-06-13","2019-06-14",2019,3,1,7,"2019Q3"]
["2019-10-01",0.4,"USD","Ordinary Shares","Cash","quarterly","2019-09-13","KO","2019-07-18","2019-09-13","2019-09-16",2019,4,2,10,"2019Q4"]
["2019-12-16",0.4,"USD","Ordinary Shares","Cash","quarterly","2019-11-29","KO","2019-10-17","2019-11-29","2019-12-02",2019,4,1,12,"2019Q4"]
["2020-04-01",0.41,"USD","Ordinary Shares","Cash","quarterly","2020-03-13","KO","2020-02-20","2020-03-13","2020-03-16",2020,2,3,4,"2020Q2"]
["2020-07-01",0.41,"USD","Ordinary Shares","Cash","quarterly","2020-06-12","KO","2020-04-22","2020-06-12","2020-06-15",2020,3,3,7,"2020Q3"]
["2020-10-01",0.41,"USD","Ordinary Shares","Cash","quarterly","2020-09-14","KO","2020-07-16","2020-09-14","2020-09-15",2020,4,4,10,"2020Q4"]
{"$rows_left_out":4}
{"sheet":"Price_Vol","index":7,"n_rows":1989,"n_cols":4,"rows_kept":1989,"cut":false,"hidden":true,"merged":[]}
["date","Price","Volume (m)","symbol"]
["2013-06-27",40.26,11.461349999999999,"KO"]
["2013-06-28",40.11,16.319517999999999,"KO"]
["2013-07-01",40.46,10.754583,"KO"]
["2013-07-02",40.369999999999997,12.248784000000001,"KO"]
["2013-07-03",40.49,5.2648169999999999,"KO"]
["2013-07-04",40.49,5.2648169999999999,"KO"]
["2013-07-05",40.520000000000003,10.40225,"KO"]
["2013-07-08",40.54,9.9369739999999993,"KO"]
["2013-07-09",40.83,8.7621059999999993,"KO"]
["2013-07-10",40.68,9.5415460000000003,"KO"]
["2013-07-11",41.03,13.489716,"KO"]
["2013-07-12",41.03,10.686347,"KO"]
["2013-07-15",41.01,11.423360000000001,"KO"]
["2013-07-16",40.229999999999997,33.581325,"KO"]
["2013-07-17",40.840000000000003,18.516852,"KO"]
["2013-07-18",40.81,9.7088549999999998,"KO"]
["2013-07-19",41.09,11.408605,"KO"]
["2013-07-22",40.840000000000003,9.4276750000000007,"KO"]
["2013-07-23",40.96,9.4056420000000003,"KO"]
{"$rows_left_out":1970}
{"sheet":"Price_Dividend","index":8,"n_rows":1096,"n_cols":12,"rows_kept":1096,"cut":false,"hidden":true,"merged":[]}
["symbol","date","Price","Volume (m)","paymentDate","Dividend","currency","description","frequency","Year","Quarter","DayOfWeek"]
["KO","2017-01-09",41.32,14.822501000000001]
["KO","2017-01-10",41.04,19.706782]
["KO","2017-01-11",41.05,9.2662130000000005]
["KO","2017-01-12",40.950000000000003,8.5411809999999999]
["KO","2017-01-13",40.880000000000003,8.1234940000000009]
["KO","2017-01-17",41.22,12.469431999999999]
["KO","2017-01-18",41.29,10.390485]
["KO","2017-01-19",41.14,10.987072]
["KO","2017-01-20",41.32,14.695409]
["KO","2017-01-23",41.43,11.628909]
["KO","2017-01-24",41.9,17.040102000000001]
["KO","2017-01-25",42.12,12.538163000000001]
["KO","2017-01-26",41.81,8.9771350000000005]
["KO","2017-01-27",41.45,12.967361]
["KO","2017-01-30",41.38,11.626225]
["KO","2017-01-31",41.57,12.677977]
["KO","2017-02-01",41.26,11.136077]
["KO","2017-02-02",41.4,9.4597219999999993]
["KO","2017-02-03",41.54,11.882372999999999]
{"$rows_left_out":1077}
{"sheet":"URL_Builder","index":9,"n_rows":38,"n_cols":9,"rows_kept":38,"cut":false,"hidden":true,"merged":[]}
["Fundamentals"]
["Token","Secret_Token","Source","Ticker","Period_type","No_of_periods","Base_Url","Full_URL"]
[{"$f":"+my_token","v":0},{"$f":"+Secret_Token","v":0},"fundamentals",{"$f":"+Ticker","v":"KO"},{"$f":"period_type","v":"annual"},{"$f":"no_of_periods","v":"7y"},"https://cloud.iexapis.com/stable/time-series/",{"$f":"+Fundamentals[[#This Row],[Base_Url]]&Fundamentals[[#This Row],[Source]]&\"/\"&Fundamentals[[#This Row],[Ticker]]&\"/\"&Fundamentals[[#This Row],[Period_type]]&\"?token=\"&Fundamentals[[#This Row],[Token]]&\"&range=\"&Fundamentals[[#This Row],[No_of_periods]]","v":"https://cloud.iexapis.com/stable/time-series/fundamentals/KO/annual?token=0&range=7y"}]
[]
["Your token'",null,"fundamentals","any US Listed Ticker","quarterly","2q or 5y","Turn on Cloud Cache = TRUE","The iexcloud base URL","The URL used by power query"]
[null,null,null,null,"ttm","4q or 7y"]
[null,null,null,null,"annual","5y"]
["Prices"]
["Token","Secret_Token","Source","Ticker","from","to","Base_Url","Full_URL"]
[{"$f":"+my_token","v":0},{"$f":"+Secret_Token","v":0},"historical_prices",{"$f":"+Ticker","v":"KO"},{"$f":"TEXT(YEAR(PriceRangeSettings[From]),\"0000\")&TEXT(MONTH(PriceRangeSettings[From]),\"00\")&TEXT(DAY(PriceRangeSettings[From]),\"00\")","v":"20130627"},{"$f":"TEXT(YEAR(PriceRangeSettings[To]),\"0000\")&TEXT(MONTH(PriceRangeSettings[To]),\"00\")&TEXT(DAY(PriceRangeSettings[To]),\"00\")","v":"20210516"},"https://cloud.iexapis.com/stable/time-series/",{"$f":"+Prices[[#This Row],[Base_Url]]&Prices[[#This Row],[Source]]&\"/\"&Prices[[#This Row],[Ticker]]&\"?from=\"&Prices[[#This Row],[from]]&\"&to=\"&Prices[[#This Row],[to]]&\"&token=\"&Prices[[#This Row],[Token]]","v":"https://cloud.iexapis.com/stable/time-series/historical_prices/KO?from=20130627&to=20210516&token=0"}]
[]
["Dividends"]
["Token","Secret_Token","Source","Ticker","Period","last","Base_Url","Full_URL"]
[{"$f":"+my_token","v":0},{"$f":"+Secret_Token","v":0},"dividends",{"$f":"+Ticker","v":"KO"},null,"&last=50","https://cloud.iexapis.com/stable/stock/",{"$f":"+Dividends[[#This Row],[Base_Url]]&Dividends[[#This Row],[Ticker]]&\"/\"&Dividends[[#This Row],[Source]]&\"/\"&Dividends[[#This Row],[Period]]&\"?token=\"&Dividends[[#This Row],[Token]]&Dividends[[#This Row],[last]]","v":"https://cloud.iexapis.com/stable/stock/KO/dividends/?token=0&last=50"}]
[]
["Account Data"]
["Token","Secret_Token","Base_Url","Full_URL"]
[{"$f":"+Secret_Token","v":0},{"$f":"+Secret_Token","v":0},"https://cloud.iexapis.com/stable/account/metadata?token=",{"$f":"+account[[#This Row],[Base_Url]]&account[[#This Row],[Secret_Token]]","v":"https://cloud.iexapis.com/stable/account/metadata?token=0"}]
[]
["As Reported"]
{"$rows_left_out":19}
{"sheet":"account","index":10,"n_rows":10,"n_cols":2,"rows_kept":10,"cut":false,"hidden":true,"merged":[]}
["Column1","Column2"]
["payAsYouGoEnabled",false]
["effectiveDate",44232]
["subscriptionTermType","annual"]
["tierName","start"]
["messageLimit",50000]
["creditLimit",50000]
["messagesUsed",50000]
["creditsUsed",50000]
["circuitBreaker",0]

{"sheet":"bugs and notes","index":11,"n_rows":10,"n_cols":2,"rows_kept":10,"cut":false,"hidden":true,"merged":[]}
["On settings, allow company lookup"]
["Can we get fundamaentals end point to deliver LTM financials in last period as well as annuals"]
["macro to automatically apply ticker and cloud credentials to the data query","done"]
["creative commons license?"]
["Improve logic to get the full name, and the chart info","done"]
["Add dividend payments / amounts","done"]
["Add disclaimer, and link to iexcloud terms"]
["Setup community email addresses"]
["Banks version"]
["Include forward estimates and EBITD for valuation","EPS  done.  EBITDA required end point revision"]