{"text_format":"1","workbook":"xlsx","n_sheets":21,"sheets":["Tiedote","Etusivu","Tulot","Oma käyttö","Hank.työ 1","Hank.työ 2","Menot","Poistot","Ajopäiv.","Arvionvaraiset","Velat","Varaukset","Luovutusv.","Vähennys","Metsälahja","Metsätalouden Tulos","Omavero","2C","ALV","Sähköinen ilmoittaminen","Tiliöinti"],"not_rendered":{"charts":0,"images":8,"macros":1,"external_links":0,"defined_names":50,"comments":18,"pivot_tables":0},"unopened":[],"bounds":{"document_bytes":16777216,"sheet_cells":100000,"rows_first":2000,"rows_last":500,"rows_between":2000,"halvings":0,"cell_chars":16384,"cell_head_chars":4096},"cells_cut":0,"cells_raw":0,"read":"whole","date_system":"1900"}

{"sheet":"Tiedote","index":0,"n_rows":448,"n_cols":5,"rows_kept":448,"cut":false,"hidden":false,"merged":[[1,6,1,7],[1,4,1,5]]}
[]
[]
[null,"METSÄTALOUDEN KIRJANPITO-OHJELMA"]
[null,"Versio 25.10"]
[null,"Version päiväys 14.10.2025",null,null,"© Mette järjestelmät Oy"]
[]
[]
[null,"Mette ohjelman saat ladattua verkkokaupastamme www.metsavero.fi"]
[null,"Maksettuasi lisenssimaksun verkkokaupassa, saat latauslinkin, josta voit ladata ohjelman. "]
[null,"Verkkokaupassa oston yhteydessä rekisteröimilläsi käyttäjätunnuksilla voit ladata mahdolliset tulevat saman verovuoden ohjelman päivitysversiot."]
[null,"Päivitykset ovat ladattavissa verkkosivultamme metsavero.fi kohdasta \"Kirjaudu\"."]
[null,"Suosittelemme, että tilaat uutiskerjeemme, jolla kerromme Metteen verovuoden aikana julkaistavista päivityksistä. "]
[null,"Uutiskirjeen voi tilata verkkosivujemme alareunan linkistä tai Metten oston yhteydessä."]
[null,"Yhden käyttäjän lisenssi oikeuttaa käyttämään ohjelmaa yhden verovuoden maksajan metsätiloilla ja kattaa kaikki päivitykset verovuoden ajalta. "]
[]
[null,"Mette metsätalouden kirjanpito-ohjelma on ostettavissa osoitteesta  www.metsavero.fi tai www.mette.fi"]
[]
[null,"Tämän kirjanpitotaulukon käyttäjä käyttää kirjanpitotaulukkoa omalla vastuullaan.  "]
[null,"Mette Järjestelmät Oy ei vastaa tämän Mette metsätalouden kirjanpito-ohjelman mahdollisista virheistä ja puutteista aiheutuvista vahingoista."]
[]
[null,"Kehittämisehdotuksia ja palautetta voi lähettää sähköpostitse osoitteeseen info@metsavero.fi"]
[]
[null,"Yhden käyttäjän lisenssillä ohjelmaa voi käyttää verovuoden ajan seuraavasti:"]
[null," - puolisoiden kaikilla tiloilla, joista tehdään yksi veroilmoitus vaikka puolisot omistaisivat tilat erikseen."]
[null," - kaikilla tiloilla, joissa lisenssin maksajalla on omistusosuuksia"]
[]
[null,"Mette-ohjelma on tekijänoikeuksien alainen, eikä ole muutettavissa ilman lupaa."]
[null,"Kaikissa artikkelissa, jossa tätä työkirjaa esitetään tai lainataan, on mainittava alkuperäinen tiedoston lähde: www.metsavero.fi"]
[null,"Internet -linkityksessä on käytettävä hyperlinkin kohteena verkko-osoitetta metsavero.fi"]
[]
[null,"Ohjelmaan on lisätty ohjeita, jotka on merkitty pienellä punaisella kolmiolla"]
[null,"Ohje tulee näkyville viemällä hiiri merkityn solun päälle."]
[]
[null,"Muutokset edellisistä versioista:"]
[null,"25.10"]
[null," - Pieniä muutoksia sähköisessä ilmoittamisessa."]
[]
[null,"25.00"]
[null," - Verovuoden ensiversio, jossa ei ole vielä verottajan vahvistamaa verolomaketta eikä uusia verotuksessa käytettäviä arvoja (km, hankintatyö ym.)"]
[null," - Vuosilukumuutokset"]
[]
[]
[]
[]
[]
[]
[]
[]
[]
[]
[]
[]
[]
[]
[]
[]
[]
[]
[]
[]
[]
[]
[]
[]
[]
[]
[]
[]
[]
[]
[]
[]
[]
[]
[]
[]
[]
[]
[]
[]
[]
[]
[]
[]
[]
[]
[]
[]
[]
[]
[]
[]
[]
[]
[]
[]
[]
[]
[]
[]
[]
[]
[]
[]
[]
[]
[]
[]
[]
[]
[]
[]
[]
[]
[]
[]
[]
[]
[]
[]
[]
[]
[]
[]
[]
[]
[]
[]
[]
[]
[]
[]
[]
[]
[]
[]
[]
[]
[]
[]
[]
[]
[]
[]
[]
[null,"24.20"]
[null," - Lisätty verottajan vahvistamat hankintatöiden arvot, matkakulujen arvot ja omasta metsästä otetun puutavaran arvot."]
[null," - Lähde: yhtenäistmisohje vuodelta 2024 toimitettavasta verotuksesta."]
[null,"24.11"]
[null," - Alv-prosentin muutoskohtiin, jossa Mette ehdottaa 1.9.2024 alkaen korotettua alv-% on lisätty huomioväri, jonka tarkoitus on ottaa huomioon se, että"]
[null,"alv-prosentti voi olla muutospäivän jälkeenkin 24 %, mikäli tuote tai palvelu on toimitettu ennen 1.9.2024. Kirjaa silloin kuitissa tai laskulla näkyvä alv-prosentti."]
[null,"https://www.vero.fi/yritykset-ja-yhteisot/verot-ja-maksut/arvonlisaverotus/arvonlisaveroprosentit/Yleinen-arvonlisaverokanta-nousee-syyskuussa/ "]
[null,"24.10"]
[null," - Alv-prosentin muutos 1.9.2024 huomioitu. Mette käyttää kuiteille, joiden päiväys on 1.9.2024 tai sen jälkeen automaattisesti korotettua 25,5 % arvonlisäveroa."]
[null,"24.00"]
[null," - Verovuoden ensiversio, jossa ei ole vielä verottajan vahvistamaa verolomaketta."]
[null," - Vuosilukumuutokset"]
[null,"23.21"]
[null," - Korjattu kaavavirhe, jonka vuoksi aiemmin Tulot taulussa riveillä 26-27 syötetyt hankintakauppatulot eivät siirtyneet hankintatyön laskentaan. "]
[null,"23.20"]
[null," - Lisätty metsälahjavähennyksen laskentaan 2023 verotuksessa käytettävät arvot."]
[null,"23.10"]
[null," - Lisätty verovuoden vahvistetut hankintatyön arvot, omaan käyttöön otetun puun arvot, työhuonevähennyksen arvot."]
[null," - Ajopäiväkirjan arvot on muutettu vastaamaan 2023 vuoden yhtenäistämisohjeita ja verohallinnon päätöstä verovapaista matkakustannusten korvauksista."]
[null," -2C-lomake päivitetty vastaamaan 2023 verovuoden lomaketta."]
[null," - Uinuvat hankintatyöt osiossa ollut vika korjattu."]
[null,"23.00"]
[null," - Verovuoden ensiversio, jossa ei ole vielä verottajan vahvistamaa verolomaketta."]
[null," - Ulkoasumuutokset "]
[null,"22.20"]
[null,"Lisätty verovuoden 2022 yhtenäistämistohjeiden mukaiset hankintatyön arvot ja matkakulujen arvot sekä omaan käyttöön otetun puun arvot."]
[null,"22.10"]
[null,"Metteen on lisätty tiliönnin mahdollisuus. Sen avulla menoja ja tuloja voi ryhmitellä aiempaa tarkemmin oman tarpeen mukaan. (Käyttäjävinkki)"]
[null,"Metteen on lisätty ja ohjeistettu mahdollisuus liittää tulo- ja menokutit upotettuina objekteina mukaan tiedostoon. Tällä tavoin sähköiset kuitit säilyvät kirjanpidon mukana. (EXCEL) (Käyttäjävinkki)"]
[null,"Vuodenvaihteen siirtyvien tietojen siirto on ohjeistettu etusivulla helpottamaan tietojen siirtoa. "]
[null,"Metsälahjavähennyksen taulukossa muutettu seurantataulukon toimintaa."]
[null,"Vahvistus hankintatyön arvoiksi, matkakulujen määrät ja työhuonevähennys tulee verottajalta vasta vuoden lopussa. "]
[null,"22.00"]
[null,"Verovuoden ensiversio, jossa ei ole vielä verottajan vahvistamaa verolomaketta."]
[null,"Metteen on lisätty omavero -välilehti, jolle 2C ja Alv:n verotiedot kootaan samaan järjestykseen, kuin niitä käsitellään omaverossa. "]
[null,"Poistot-taulukkoon on tehty mahdollisuus muuttaa poistettavaa määrää Euro-määrään tai prosenttimäärään perustuvaksi."]
[null,"Hankintatyön arvot, omaan käyttöön oton arvot, ajopäiväkirjan arvot ym ovat vielä 2021 mukaisia tässä versiossa"]
[null,"21.24"]
[null,"Kauneusvirheiden korjailua. Mm poistojen ohjetekstit, hankintamenotaulukon tekstejä, metsälahjan seuranta, ym pientä."]
[null,"21.23"]
[null,"Metsävähennyksen laskentaan, ennen verovuotta 2021 luovutusvoittoihin lisätyn metsävähennyksen määrä muutettu niin että tilakohtainen kohdetaminen on taas mahdollista."]
[null,"21.22"]
[null,"Sähköisen alv ilmoittamisen verosuosi oli väärä. Arvo korjattu 2021."]
[null,"21.21"]
[null,"Metsätalouden tulos välilehdellä ollut virhe korjattu. Ohjelma laski kahteen kertaan tuloutetun menovarauksen tulokseen."]
[null,"21.20"]
[null,"Hankintatyön ja omaan käyttöön otettavan puutaran arvoiksi on muutettu verottajan yhtenäistämisohjeiden  mukaiset arvot verovuodelle 2021."]
[null,"Työhuonevähennyksen 2021 vuoden arvo on lisätty arvionvaraiset sivulle ohjeeseen."]
[null,"21.10"]
[null,"Muotoilullisia muutoksia tehty kaikilla sivuilla."]
[null,"Puun oma käyttö eritelty omalle välilehdelle."]
[null,"Ohjetekstejä lisätty taulukoihin."]
[null,"Metsälahjavähennyksen metsämaan tuottoluvut päivitetty 2021 verotuksen mukaisiksi."]
[null,"Pieniä korjauksia taulukoihin."]
[null,"Meno- ja tuhovarausten ksittelyä selkeytetty."]
[null,"Tulostusasetuksia määritetty sopimaan A4 tulosteisiin."]
[null,"21.00"]
[null,"Verovuoden ensiversio, jossa ei ole vielä verottajan vahvistamaa verolomaketta."]
[null,"Lisätty hankintatyön tekijöiden tietojen tallennus etusivulle."]
[null,"Tuloslaskelmaan lisätty ennakkoverojen palautuksen määrä."]
[null,"Taulukoiden tulostusasetuksia parannettu."]
[null,"Mette poistaa alle 600 euron menojäännökset kerralla verottajan uuden ohjeen mukaisesti."]
[null,"20.03"]
[null,"Menovarauksen laskennassa ilmennyt virhe korjattu. Vaikutusta metsävähennyksen käytön yhteydessä."]
[null,"20.02"]
[null,"Poistot taulukko palautetettu alkuperäiseksi. Omaveron 2C-lomakkeen puutteista johtuen verottaja suositteli välillä kirjaamaan alle 200 e poistot suoraan menokirjauksena."]
[null,"20.00"]
[null,"Verovuoden ensiversio, jossa ei ole vielä verottajan vahvistamaa verolomaketta."]
[null,"Lisätty mahdollisuus kirjata metsätalouden sivutuloja ja niihin liittyviä menoja, jotka ilmoitetaan maatalouden verolomakkeella 2."]
[null,"Korjattu harvinaisessa tilanteessa esiintulevat kaavavirheet menovarauksen laskennassa ja hankintatyön laskennassa."]
[null,"Muutettu metsätalouden tuloksen laskennassa tulojen ja hankintatöiden kulujen esittämistapa."]
[null,"19.21"]
[null,"Tietuekuvausmuutoksen takia muutettu hankintatyön määrät kokonaisluvuiksi. "]
[null,"19.20"]
[null,"Verohallinnon ythtenäistämisohjeiden mukaiset hankintatyön arvot, matkakustannukset ja työhuonevähennys lisätty."]
[null,"Maatalouteen käytetyn omasta metsästä otetun puun arvot päivitetty."]
[null,"Lisätty Poistot taulukkoon koneille lisää erittelyrivejä ja Menot taulukkoon menokirjausrivejä (piilotetut-toiminnot). "]
[null,"19.10"]
[null,"Pieniä muutoksia 2C -verolomakkeella"]
[null,"Metsälahjavähennyksen laskennassa käytettävät metsän keskimääräisen vuotuisen tuoton arvot päivitetty."]
[null,"19.00"]
[null,"Verovuoden ensiversio, jossa ei ole vialä verottajan vahvistamaa verolomaketta."]
[null,"Lisätty tuloslaskelmaan yhteisomistustilojen verovaikutusten laskenta niin, että laskelma huomioi tulojen todellisen jakautumisen osakkaille ja sen vaikutuksen veroprogressioon ja siten kokonaisveron määrään."]
[null,"Muutettu uinumaan jäävän hankintatyn kaavaa niin, että se tulee huomioiduksi menovarauksen laskennasa."]
[null,"18.21"]
[null,"Menovarauksen laskentakaavaa muutettu. Ottaa huomioon myös uinuvista hankintatöistä tulevat hankintatöiden arvot."]
[null,"18.20"]
[null,"Verotuksen yhtenäistämisohjeiden mukaiset arvot lisätty"]
[null," - mm. hankintatyön arvot, kilometrikorvausten arvot, päivärahat, työhuonevähennyksen arvo, maataloudessa käytetyn omasta metsästä otetun puutavaran arvot."]
[null,"Arvonlisäveron sähköisen siirtiedoston tietuekuvausmuutos alarajahuojennuksen osalta. "]
[null,"18.10"]
[null,"Merkittäviä muutoksia 2C -verolomakkeeseen"]
[null,"Merkittäviä muutoksia sähköisen ilmoittamisen tietueiden muodostamiseen"]
[null,"Metsälahjavähennyksen laskentaan lisätty 2L-verolomakkeen koontitiedot ja uudet metsätalouden tuottoluvut kunnittain"]
[null,"18.00"]
[null,"Verovuoden 2018 ensiversio. Tässä versiossa on vielä verovuoden 2017 2C-lomake. "]
[null,"Syksyllä verottajan julkaistua uuden 2C lomakkeen, Mettestä julkaistaan päivitys."]
[null,"17.21"]
[null,"Alv siirtotiedoston tekoon lisätty siirtotiedoston tekoaika"]
[null,"17.20"]
[null,"Yhtenäistämisohjeiden mukaiset arvot lisätty hankintatyön laskentaan ja työhuonevähennykseen."]
[null,"Muita pieniä kauneusvirhekorjauksia"]
[null,"17.10"]
[null,"Verovuoden 2017 2C-lomake ja siihen liittyvät tarkastukset tehty Metteen."]
[null,"17.00"]
[null,"Verovuoden 2017 ensiversio. Tässä versiossa on vielä verovuoden 2016 2C-lomake. "]
[null,"Syksyllä verottajan julkaistua uuden 2C lomakkeen, Mettestä julkaistaan päivitys."]
[null,"Ulkoasua on uudistettu, mukaan on otettu metsälahjavähennyksen laskeminen ja menoihin on lisätty tuotteen erittelymahdollisuus."]
[null,"Menovarauksen voi kaavaa rikkomatta pakottaa haluamaansa alle 15% euromääräiseen arvoon."]
[null,"16.21"]
[null,"Alv sähköisen siirtotiedoston tietuekuvauksen muutoksen vuoksi tietueen muotoa korjattu."]
[null,"16.20"]
[null,"Kilometrikorvaus ja hankintatyön arvot muutettu vastaamaan 2.1.2017 julkaistun verottajan yhtenäistämisohjeen arvoja."]
[null,"Ohjeistuksia muutettu verotilipalvelun muututua omaveropalveluksi."]
[null,"16.10"]
[null,"Verolomake 2C on muutettu vastaamaan verottajan vahvistamaa 2016 vuoden lomakketta."]
[null,"16.00"]
[null,"Verovuoden 2016 ensiversio. Tässä versiossa on vielä verovuoden 2015 2C-lomake. "]
[null,"Syksyllä verottajan julkaistua uuden 2C lomakkeen, Mettestä julkaistaan päivitys."]
[null,"15.12"]
[null,"Hankintatyö 2 osiosta korjattu kaavavirhe solusta E9. Kaava laski virheellisesti maatilalle 2 maatilan 1 hakkuumäärän."]
[null,"Sähköiestä ilmoittamisesta poistettu rivit joilla saattoi ilmoittaa asianhoitajan ja ulkomaan nimen. Ko tietokohdat eivät ole enää 2015 käytössä."]
[null,"15.11"]
[null,"Hankintatyön arvot 2015, matkakustannusten arvot, Maataloudessa käytetyn puun arvot."]
[null,"Työhuonevähennyksen arvon tarkistus."]
[null,"15.10"]
[null,"Tässä versiossa on uusi 2C verolomake verovuodelle 2015"]
[null,"Alv-kausiveroilmoitukseen lisätty sähköisen siirtotiedoston tekemisen mahdollisuus."]
[null,"15.00"]
[null,"Verovuoden 2015 ensiversio. Tässä versiossa on vielä verovuoden 2014 2C-lomake. "]
[null,"Syksyllä verottajan julkaistua uuden 2C lomakkeen, Mettestä lulkaistaan päivitys."]
[null,"14.21"]
[null,"Metsävähennyksen laskentaan lisätty kohta, jossa käyttäjä voi määritellä käytettävän metsävähennyksen maksimivähennystä pienemmäksi."]
[null,"Pieniä kauneusvirheitä korjattu."]
[null,"14.20"]
[null,"Sisältää 9.1.2015 verottajan julkaiseman yhtenäistämisohjeen sisältämät hankintatyön arvon, kilometrikorvaukset, maatalouden käyttöön otetun puun arvostuksen"]
[null,"14.10"]
[null,"Sisältää 2014 vuoden 2C-lomakkeen"]
[null,"Päivämäärien automaattinen kelpoisuuden tarkastaminen poistettu."]
[null,"14.00"]
[null,"Verovuoden ensiversio. Sisältää vielä vanhan 2C-lomakkeen"]
[null,"Uinumaan jätetyn hankintatyön arvon laskentaa tarkennettu ja lisätty oma laskenta-alue."]
[null,"Ajopäiväkirjaan on lisätty traktorin tuntihinta"]
[null,"13.16"]
[null,"Hankintatyön uinumaan jäävän ja uinumassa olleen arvon laskenta korjattu. Lisätty sitä varten uusia taulukoita hankintatyön laskentojen välilehdille."]
[null,"13.15"]
[null,"Menovarauksen laskennassa ilmennyt virhe korjattu. Koskee vain Pohjois-Suomen osaa, jos tuloutettavaa vuodelta 2007 sekä 2008. "]
[null,"13.14"]
[null,"Sähköisen ilmoittamisen taulukkoon lisätty puuttuvat kaavat soluihin O67-O76."]
[null,"13.13"]
[null,"Menot tauluun lisätty alv-% sarakkeeseen pudotusvalikko 24%, 10% ja 0% verokannoille."]
[null,"Käytetyn metsävähennyksen laskentaa korjattu, tilanteessa, jossa osa metsävähennystiloista luovutettu verovuoden aikana."]
[null,"13.12"]
[null,"Lisätty hankintatyön ja konekustannusarvot. "]
[null,"13.11"]
[null,"Tuhovarauksen siirtyminen oikein 2C-lomakkeelle korjattu."]
[null,"13.10"]
[null,"Sisältää verottajan julkaiseman uuden 2C -verolomakkeen 2013."]
[null,"13.00"]
[null,"Verovuoden ensiversio. Sisältää vielä vanhan 2C-lomakkeen"]
[null,"Meno- ja tuhovaraustaulukkoa muutettu selkeämmäksi ja automaattisemmaksi"]
[null,"Metsävähennystaulukossa tiloittainen erittely otetty uudelleen näkyville"]
[null,"12.11"]
[null,"Hankintatyön arvot muutettu 2012 arvoiksi ja laskentaan tehty korjaus, joka voi vaikuttaa yli 125 m3 hankintatyötä tehneillä."]
[null,"Metsävähennyksen osalta muutettu lomaketta selkeämmäksi. Vaikuttaa, jos metsävähennystila luovutettu ja metsävähennysmetsää jää vielä omistukseen."]
[null,"Kilometrikorvaukset 2012 verottajan yhtenäistämisohjeista (julkaistu 10.1.2013)"]
[null,"12.10"]
[null,"Verovuoden 2012 2C-lomake"]
[null,"Tulot lomakkeelle lisätty poltto-ja joulupuiden hankintakaupan erottelu"]
[null,"Lisätty \"Hankintatyö 2\" -lomake poltto-ja joulupuiden hankintatyön erottelua varten"]
[null,"Muotoilumuutoksia"]
[null,"12.01"]
[null,"Ajopäiväkirjassa ollut kaavavirhe korjattu."]
[null,"12.00"]
[null,"Verovuoden ensiversio. Sisältää vieä vanhan 2C-lomakkeen"]
[null,"Kemera välilehti poistettu. "]
[null,"Hankintatyön laskentaan lisätty maatilakohtainen laskentamahdollisuus 5:lle maatilalle."]
[null,"Lisätty uinumaan jätetyn hankintatyön kirjausmahdollisuus."]
[null,"11.12"]
[null,"Lisätty Yhtenäisätmisohjeen mukaiset hankintatyön hinnat ja km-korvausarvot."]
[null,"11.11"]
[null,"Metsätalouden tuloslaskelmasta korjattu kaava solusta C21 ja tarkennettu kaavaa solussa C9"]
[null,"11.10"]
[null,"Lisätty 2011 verolomake"]
[null,"11.00"]
[null,"Verovuoden ensiversio, ei sisällä vielä 2011 verolomakkeita"]
[null,"10.31"]
[null,"Korjattu kemera-oja- ja tiehankkeiden kohdalla ollut alv:n kirjautumisen virhe. "]
[null,"10.30"]
[null,"Alv-lomake muutettu alv-kausiverolomakkeeksi"]
[null,"10.20"]
[null," - Vuoden 2010 verolomake 2C ja sen vaatimat muutokset ohjelmaan"]
[null,"10.10"]
[null," - Arvonlisäveromuutoksen 1.7. edellyttämät kaavamuutokset "]
[null,"10.00"]
[null," - Vuoden 2010 ohjelman ensiversio. Ohjelmaan tulee päivitys verottajan julkaistessa syksyllä uuden 2C-lomakkeen"]
[null," - Ohjelman sisältämä verolomake 2C on vielä 2009 mallia"]
[null," - Ajopäiväkirjaan on lisätty kirjausrivejä"]
[null," - Kaikilla ohjelma-alustoilla käytetään samaa Mette versiota (Microsoft Excel ja Openoffice Calc Windows ja Mac käyttöjärjestelmät)"]
[null,"9.11"]
[null," - Tulokirjausrivejä lisätty"]
[null," - Konepoistoihin lisätty rivejä "]
[null," - Hankintatyön- ja kuljetuksen arvot 2009 täyttöohjeesta"]
[null," - Matkakulujen ja päivärahojen arvot 2009 täyttöohjeesta ja yhtenäistämisohjeesta"]
[null," - Kemerarahotteisten tie ja ojahankkeiden poistokirjausmenettelyä uudistettu metsänomistajan kannalta edullisemmaksi"]
[null," - Kemera-lomakkeelle muutoksia aiemmin verotuksessa vähennettyjen menojen kirjautumisessa"]
[null,"9.10"]
[null," - Lisätty uusi 2C-lomake"]
[null," - Metsävähennysmenettelyn muutoksien vuoksi metsävähennyslomaketta on muutettu "]
[null," - Hankintatyö-lomakkeelle on lisätty puutavaralajeja"]
[null," - Lisätty de minimis tukien laskentataulukko"]
[null," - Kaavoja sisältävät solut suojattu lukitsemalla ne.  Lukituksen voi tarvittaessa purkaa poistamalla taulukon suojauksen. (Excel 2007 Tarkista - Poista taulukon suojaus,   Ei salasanaa)"]
[null," - Arvonlisäverovelvollisuus ilmoitetaan Etusivun tiedoissa, josta ohjelma tulkitsee sen tarvittaviin paikkoihin"]
[null,"9.00"]
[null," - Vuoden 2009 ohjelman ensiversio. Ohjelmaan tulee päivitys verottajan julkaistessa syksyllä uuden 2C-lomakkeen"]
[null," - Ohjelman sisältämä verolomake 2C on vielä 2008 mallia"]
[null," - Lisätty tilojen erittely 18 tilaa varten"]
[null,"8.23"]
[null," - Hankintatyön määrän ja arvon siirtyminen 2C-lomakkeelle korjattu"]
[null," - Korjattu virhe 2C-lomakkeella kohdassa käytetty metsävähennys yhteensä ja sähköisessä ilmoittamisessa."]
[null,"8.22"]
[null," - Metsätalouden tukien kirjautuminen muutettu 2C-lomakkeella, sekä tulot välilehdellä"]
[null," - Ajopäiväkirjaan päivitetty yhtenäistämisohjeiden mukaiset matkakustannukset"]
[null,"8.21"]
[null," - Pieni muutos 2C-lomakkeella ja Menot välilehdellä"]
[null,"8.20"]
[null," - Verolain muutoksen vaatimat mittavat muutokset lähes koko ohjelmassa"]
[null,"8.11"]
[null," - Korjattu alv virhe arvionvaraiset lomakkeella"]
[null,"8.10"]
[null," - Korjattu Kemera-lomakkeella käsiteltävien monojen ja tukien kirjauksia. Kemera-hankkeiden menokirjaukset eivät summautunet oikein menoiksi. Tämä puute on korjattu. Lisäksi poistomenettelynä seurattavien kemera-hankkeiden osalta on muutettu toimintoa siten, että poistoihin tulee vain hankkeen menojen ja tuen erotus. Tukea ei kirjata enää ollenkaan tältä osin 2C-lomakkeelle. "]
[null," - Tulot välilehdelle on lisätty omasta metsästä otetun puutavaran määrän ja arvon laskenta."]
[null," - Menoihin on lisätty kirjausrivejä"]
[null," - Kirjanpitoon sisältyvien muun toiminnan menojen erittely lisätty menot  ja poistot tauluun"]
[null," - Ajopäiväkirjaa on uudistettu siten, että kilometrikorvaukset voidaan helposti laskea myös muille kuin autolle."]
[null," - Arvionvaraiset välilehti on palautettu käyttäjien toivomuksesta takaisin käyttöön"]
[null," - Etelä- ja Pohjois-Suomen versiot yhdistetty"]
[null,"8.00"]
[null," - Vuoden 2008 ensiversio. Päivityksiä julkaistaan todennäköisesti ainakin syksyllä, kun verottaja ilmoittaa muutokset verotukseen."]
[null," - Hankintatyönarvon laskenta on eriytetty omaksi välilehdekseen."]
[null," 7.24"]
[null," - Kaavavirhe poistot taulussa korjattu"]
[null," 7.23 "]
[null," - Metsätalouden menoihin sisältyvät muun tulonlähteen menot muutettu manuaaliseksi virheellisen käytön riskin välttämiseksi"]
[null," 7.22"]
[null," - Ohjelma nimetty Mette metsätalouden kirjanpito-ohjelmaksi"]
[null," - 2C lomakkeen sähköinen tiedonsiirto verohallinnolle"]
[null," - kk alv"]
[null," - arvionvaraiset välilehti poistettu"]
[null," - menot tauluun ja kemera-tauluun on lisätty menorivejä"]
[null," - Lapin ja Oulun Lapin lääniläisille tehty oma versio, jossa varaukset 6 vuodeksi"]
[null," 7.01"]
[null," - 2C-lomakkeen kaavavirhe korjattu, joka koskee lapinläänissä asuvien meno- ja tuhovarauksien siirtymistä lomakkeelle."]
[null,"7.00"]
[null," - Verovuoden muutos"]
[null," - lisätty arvionvaraisiin menoihin sähkökulut"]
[null," 6.20"]
[null," - 2-lomake tehty uudelleen verottajan tekemien muutosten mukaiseksi"]
[null," - tulot-lomakkeelle tehty värikoodauksia selventämään taulukkoa"]
[null,"6.12."]
[null," - Kameraosasta korjattu kaavavirheitä ja lisätty ohjetekstejä."]
[null," - Menot taulukon solusta D77 on muutettu kommenttitekstiä"]
[null,"6.11."]
[null," - Poistoina seurattavien kemera-hankkeiden seuranta automatisoitu."]
[null," - Poistettu alv-kaava kemera-hankkeen koostetuontiriviltä tulot taulukosta."]
[null," - Yksi kaavavirhe korjattu kemera-taulukosta solu (D36)."]
[null," 6.10"]
[null," - Lisätty poistojen automatisoitu hyödykekohtainen seuranta."]
[null," - Muutettu muotoiluja omistan nimen ja tilan nimen osalta taulukoissa."]
[null," - Lisätty Kemera-hankkeiden seuranta. Jos menot kemera-avustuksia isommat, tulee avustukset ja menot näkyviin."]
[null," - Lisätty menokirjanpitoon Muut menot sarakkeita. Ovat piilossa voi ottaa tarvittaessa esiin näytä toiminnalla, ja nimetä haluamakseen."]
[null," - Luovutuksen kohteita on lisätty kahdesta neljään."]
[null," - Metsävähennys automatisoitu. Seurattavia tiloja valmiina 6 kpl."]
[null," 6.00"]
[null," - Lisätty Velat taulukko "]
[null," - Vuoden 2006 versio, joka päivitetään tarvittaessa syksyllä uuden tiedoston ja makron avulla. Käyttömaksu kattaa verovuoden 2006 päivitykset."]
[null," 5.00"]
[null," - Lisätty tulostuskelpoinen ALV-lomake, 2C lomake on muutettu vastaamaan vuoden 2005 muotoilua (vuosiluvut) (ver 5.00)"]
[null," - Käyttömaksu lisätty."]
[null," - Työkirjanoikeudet omistaa Forwood. Muutoksia vain tiedotesivulla (ver 4.02)"]
[null," - Pieniä kaavakorjauksia esim. arvionvaraiset taulussa kaava ei ollut huomioinut %-määrän muutosta (ver 4.01)"]
[null,"4.00"]
[null," - 2C lomake on muutettu vastaamaan vuoden 2004 muotoilua (vuosiluvut) (ver 4.00)"]
[null," - Ajopäiväkirjaan on lisätty päivärahan kirjauspaikka (ver 3.57)"]
[null," - 2C lomake on muutettu vastaamaan uutta muotoilua ja se voidaan tulostaa veroilmoitukseksi"]
[null," - Lomakkeen muuttumisesta johtuen tulot taulukkoon on tehty vastaavat muutokset em. kohtien erittelyä varten"]
[null," - Metsävähennyksen laskentataulukossa korjattu kaavavirhe kohdasta 28. (ver.3.51)"]
[null," - Varaukset taulun solussa C13 olevan kaavan virhe korjattu (ver.3.52)"]
[null," - 2C-lomakkeen eräitä soluja on yhdistetty, jotta pitkät luvut mahtuvat niihin. (ver.3.53)"]
[null," - 2c-Lomakkeen solujen muotoilua on korjattu. Eräisiin soluihin luvut tallentuivat päivämääränä. (ver. 3.54)"]
[null," - Ajopäiväkirjaan on muutettu kilometrikustannukseksi verottajan suositus 0,21 eur/km oletukseksi (ver. 3.54)"]
[null," - korjattu virhe 2C-lomakkeen kohdassa 18. Tila 3 koskeva kaavavirhe korjattu (ver 3.55)"]
[null," - korjattu virhe Metsätalouden tulos taulussa kohta tulot (ver 3.55)"]
[null," - 2c-Lomakkeen solujen muotoilua on vielä korjattu. Eräisiin soluihin luvut tallentuivat vielä päivämääränä. (ver. 3.56)"]
[null," - Metsävähennystaulukossa hankintakaupan pääomatuloksi muodostui arvo, josta ei ollut vähennetty hankintatyön arvoa. Virhe on korjattu versiossa 3.57"]
[null," - 2C-lomakkeen eräitä soluja on yhdistetty, jotta pitkät luvut mahtuvat niihin. (ver.3.53)"]
[null," - 2c-Lomakkeen solujen muotoilua on korjattu. Eräisiin soluihin luvut tallentuivat päivämääränä. (ver. 3.54)"]
[null," - Ajopäiväkirjaan on muutettu kilometrikustannukseksi verottajan suositus 0,21 eur/km oletukseksi (ver. 3.54)"]
[null," - korjattu virhe 2C-lomakkeen kohdassa 18. Tila 3 koskeva kaavavirhe korjattu (ver 3.55)"]
[null," - korjattu virhe Metsätalouden tulos taulussa kohta tulot (ver 3.55)"]
[null," - 2c-Lomakkeen solujen muotoilua on vielä korjattu. Eräisiin soluihin luvut tallentuivat vielä päivämääränä. (ver. 3.56)"]
[null," - Metsävähennystaulukossa hankintakaupan pääomatuloksi muodostui arvo, josta ei ollut vähennetty hankintatyön arvoa. Virhe on korjattu versiossa 3.57"]
[null,"3.00"]

{"sheet":"Etusivu","index":1,"n_rows":46,"n_cols":25,"rows_kept":46,"cut":false,"hidden":false,"merged":[[32,5,34,7],[22,6,22,7],[35,5,42,7],[8,10,9,11]]}
[17]
[]
[null,"METSÄTALOUDEN KIRJANPITO"]
[null,"Mette 25.10 Mette Järjestelmät Oy"]
[]
[null,{"$f":"vuosi","v":2025}]
[]
[null,"Verovuosi",2025,null,null,"Metsätilat "]
[null,"HENKILÖTIEDOT",null,null,null,"METSÄTILAT",null,null,null,null,"OHJEITA",null,null,null,null,null,null,null,null,null,null,null,null,"Kyllä","Kerran vuodessa"]
[null,"Omistaja(t) / yhtymän nimi","Matti Metsänen",null,null,"Nimet päivittyvät metsävähennyksen laskentaan tästä",null,null,null,null,null,null,null,null,null,null,null,null,null,null,null,null,null,"Ei","4 kertaa vuodessa"]
[null,"Puoliso",null,null,1,"Mäntynen",10,null,null,null,"o Edellisen vuoden Mettestä siirrettäviä tietoja:",null,null,null,null,null,null,null,null,null,null,null,null,null,"Kuukausittain"]
[null,"Oma erillinen ilmoitus (puoliso)","Ei",null,2,null,11,null,null,null,"     o Etusivun tiedot",null,null,null,null,null,null,null,null,null,null,null,null,"Ei","Ei"]
[null,"Osoite",null,null,3,null,12,null,null,null,"     o Uinumaan jääneet hankintatyöt (Soluista Y16-AC16 soluihin Y7-AC7)",null,null,null,null,null,null,null,null,null,null,null,null,"Kyllä"]
[null,"Postinumero",100,null,4,null,13,null,null,null,"     o Poistojen menojäännökset (Sarakkelta L sarakkeelle E)"]
[null,"Postitoimipaikka",null,null,5,null,14,null,null,null,"     o Menovaraukset (Saman vuosiluvun kohdalle soluihin C20-C25)"]
[null,"Henkilö- tai Y-tunnus","123456-7",null,6,null,15,null,null,null,"     o Tuhovaraukset (Saman vuosiluvun kohdalle soluihin H20-H25)"]
[null,null,null,null,7,null,16,null,null,null,"     o Metsävähennyksen tiedot (Tilatiedot sarakkeille E-V. Käytettävissä olevan metsävähennyksen määrä tilakohtaisesti riviltä 26 riville 16)"]
[null,null,null,null,8,null,17,null,null,null,"     o Metsälahjavähennyksen tiedot (Lahjoitusvuosi, metsävähennyspohja ja käyttötiedot)"]
[null,"TÄYDENTÄVIÄ TIETOJA",null,null,9,null,18,null,null,null,"o Tietoja voi kopioda niiltä alueilta, joille itse on tietoja kirjannut. Kaavojen tuottamia arvioja ei tule suoraan kopioida."]
[null,"Tietoja tarvitaan mm. sähköisessä ilmoittamisessa ja tuloksen laskennassa",null,null,{"$f":"IF(C22=\"ei\",\"\",IF(C22=\"kyllä\",\"\",\"<- tarkista\"))","v":""},null,null,null,{"$f":"IF(C23=\"kerran vuodessa\",\"V\",IF(C23=\"4 kertaa vuodessa\",\"Q\",IF(C23=\"kuukausittain\",\"K\",\"\")))","v":"V"},{"$f":"IF(C22=\"ei\",\"\",IF(C22=\"kyllä\",\"\",\"<- tarkista  arvonlisäverovelvollisuus, Kyllä tai Ei\"))","v":""}]
[null,null,null,null,null,null,null,null,null,{"$f":"IF(C23=\"kerran vuodessa\",\"\",IF(C23=\"4 kertaa vuodessa\",\"\",IF(C23=\"kuukausittain\",\"\",\"<- tarkista alv ilmoitusten ilmoitusjakson pituus\")))","v":""},"DEMON tällä sivulla voit tallentaa muut henkilötiedot paitsi nimeä ja y-tunnusta. Metsätiloissa tilat 2 ja kolme muokattavissa. "]
[null,"Arvonlisäverovelvollinen","Kyllä",null,null,"YHTYMÄN OSAKKAAT JA OMISTUSOSUUDET",null,null,null,null,null,"Täydentävät tiedot ja hankintatyöntekijätiedot muokattavissa"]
[null,"ALV-ilmoituksen jaksot","Kerran vuodessa",null,null,"Osakkaan nimi","Omistusosuus",null,null,{"$f":"IF(C25=\"ei\",\"\",IF(C25=\"kyllä\",\"\",\"<- tarkista verotusyhtymä, sallitut arvot Kyllä tai Ei\"))","v":""}]
[null,{"$f":"CONCATENATE(\"Kotikunta 31.12.\",C8-1)","v":"Kotikunta 31.12.2024"},null,null,1,null,null,"%",null,{"$f":"IF(C25=\"kyllä\",\"\",IF(C26+C27<1,\"<- tarkista omistusosuuksien prosenntimäärä\",IF(C26+C27>1,\"<- tarkista omistusosuuksien prosenntimäärä\",IF(C26+C27=1,\"\",IF(C25=\"kyllä\",\"-\",)))))","v":""}]
[null,"Verotusyhtymä","Ei",null,2,null,null,"%"]
[null,"Tilan omistus: Verovelvollinen, %",1,null,3,null,null,"%"]
[null,"                          Puoliso, %",0,null,4,null,null,"%"]
[null,null,null,null,5,null,null,"%"]
[null,"Veroilmoituksen viimeinen \njättöpäivä",28022026,null,6,null,null,"%"]
[null,"Veroilmoituksen allekirjoituspäivä\nmuodossa PPKKVVVV","28022026",null,7,null,null,"%"]
[null,"Veroilmoitusta täydentäviä tietoja antavan nimi",null,null,null,null,{"$f":"SUM(G24:G30)","v":0},"%"]
[null,"Veroilmoitusta täydentäviä tietoja antavan puhelinnumero"]
[null,"Veroilmoitusta täydentäviä tietoja antavan sähköpostiosoite",null,null,null,"\nMetten taulukot on suojattu vahingossa tapahtuvalta kaavojen muuttamiselta. Tarvittaessa suojauksen saa poistettua. Salasanaa ei tarvita."]
[]
[null,"HANKINTATYÖNTEKIJÄT"]
[null,"Hankintatyöntekijä 1 nimi",null,null,null,"\nSuojauksen poistaminen eri ohjelmistoissa:\nExcel 365, 2016 2013, 2010 ja 2007\nTarkista - Poista taulukon suojaus tai alareunasta välilehteä hiiden oikealla \nklikkaamalla. Valikosta valitaan \"Poista taulukon suojaus\".\nExcelelin verkkoselainversiossa tai Tems-versiossa suojausta ei voi poistaa\nPoista suojaus Mettestä Excelin työpöytäsovelluksessa.\nLibreOffice (Windows ja Mac)\nTyökalut - Suojaa taulukko tai alareunan välilehdestä hiiren oikealla klikkaamalla\nja valitsemalla \"Suojaa taulukko\". "]
[null,"Hankintatyöntekijä 1 henkilötunnus"]
[null,"Hankintatyöntekijä 2 nimi"]
[null,"Hankintatyöntekijä 2 henkilötunnus"]
[null,"Hankintatyöntekijä 3 nimi"]
[null,"Hankintatyöntekijä 3 henkilötunnus"]
[null,"Hankintatyöntekijä 4 nimi"]
[null,"Hankintatyöntekijä 4 henkilötunnus"]
[]
[null,null,"© Mette ohjelmistot Oy"]
[null,null,"www.metsavero.fi"]

{"sheet":"Tulot","index":2,"n_rows":167,"n_cols":56,"rows_kept":167,"cut":false,"hidden":false,"merged":[[10,25,11,26],[25,25,26,31],[5,23,8,23],[0,1,0,4],[2,1,2,4],[5,25,5,26],[5,2,5,3],[5,11,5,12],[4,11,4,12],[5,6,5,8],[6,19,8,19],[12,25,13,28]]}
[]
[null,{"$f":"Etusivu!C10","v":"Matti Metsänen"},null,null,null,null,"DEMOSSA voit testata riviä 1.",null,null,null,null,null,null,null,null,null,null,null,null,null,null,null,null,null,null,null,null,null,null,null,null,null,null,null,{"$f":"LARGE(AI4:AQ4,1)","v":0},"Suurin maatilan numero",null,null,null,null,null,null,null,null,null,{"$f":"LARGE(AT4:BB4,1)","v":0},"Suurin maatilan numero"]
[null,{"$f":"Etusivu!C16","v":"123456-7"}]
[null,null,null,null,null,null,null,null,null,null,null,null,null,null,null,null,null,null,null,null,null,null,null,null,null,null,null,null,null,null,null,null,null,null,{"$f":"IF(AI5>0,1,0)","v":0},null,{"$f":"IF(AK5>0,2,0)","v":0},null,{"$f":"IF(AM5>0,3,0)","v":0},null,{"$f":"IF(AO5>0,4,0)","v":0},null,{"$f":"IF(AQ5>0,5,0)","v":0},null,null,{"$f":"IF(AT5>0,1,0)","v":0},null,{"$f":"IF(AV5>0,2,0)","v":0},null,{"$f":"IF(AX5>0,3,0)","v":0},null,{"$f":"IF(AZ5>0,4,0)","v":0},null,{"$f":"IF(BB5>0,5,0)","v":0}]
[null,"METSÄTALOUDEN TULOT",null,null,null,null,null,null,null,null,null,{"$f":"IF(Etusivu!$C$22=\"kyllä\",\"Arvonlisäverovelvollinen\",\"Ei arvonlisäverovelvollinen\")","v":"Arvonlisäverovelvollinen"},null,null,null,null,null,null,null,null,null,null,null,null,null,null,null,null,null,null,null,null,null,null,{"$f":"SUM(AJ9:AK9)","v":0},null,{"$f":"SUM(AL9:AM9)","v":0},null,{"$f":"SUM(AN9:AO9)","v":0},null,{"$f":"SUM(AP9:AQ9)","v":0},null,{"$f":"SUM(AR9:AS9)","v":0},null,null,{"$f":"SUM(AU9:AV9)","v":0},null,{"$f":"SUM(AW9:AX9)","v":0},null,{"$f":"SUM(AY9:AZ9)","v":0},null,{"$f":"SUM(BA9:BB9)","v":0},null,{"$f":"SUM(BC9:BD9)","v":0}]
[null,"Kuitti","päiväys",null,null,null,"Puunmyyntitulot, alv 0%",null,null,"Hankintatyö","Metsävähen-","ALV",null,"Ennakon- ","Vakuutus","Hirvi-","Metsä-","Muut",null,"Tiliöinti",null,"Maatalouden ",null,"Lisää kuitti upotettuna objektina",null,"Apulaskuri: alv:t pois",null,null,null,null,null,null,null,null,null,"Aputaulukko hankintatyötulon siirtämiseksi hankintatyön (1) laskentaan. Normaali hankintatyö 1.2.",null,null,null,null,null,null,null,null,null,null,"Aputaulukko hankintatyötulon siirtämiseksi hankintatyön (2) laskentaan. Poltto- ja joulupuiden hankintatyö 1.3."]
[null,null,null,null,null,null,"Pystykaupat","Hankinta-","Poltto- ja","maatila","nys oikeus",null,null,"pidätykset","korvaukset","vahinko","tal. tuet ","tulot ",null,"Voit halutessasi seurata tuloja tarkemmin tiliöimällä ne",null,"tuloihin kuuluva",null,null,null,"ALV %",0.24]
[null,"N:o","pv","kk"," Selite",null,null,"kaupat","joulupuukaupat","nro (1-5)","Kyllä / Ei","%","eur",null,null,"korvaukset","(verolliset)","(alv 0%)",null,null,null,"tulo (alv 0%)",null,null,null,"Summa ","Summa",null,null,null,"Valikoiden arvoja",null,null,null,null,"T1Mei","T1Mkyllä","T2Mei","T2MKyllä","T3Mei","T3Mkyllä","T4Mei","T4Mkyllä","T5Mei","T5MKyllä",null,"T1M0","T1M1","T2M0","T2M1","T3M0","T3M1","T4M0","T4M1","T5M0","T5M1"]
[null,"YHTEENSÄ",null,null,null,null,{"$f":"SUM(G11:G165)","v":15400},{"$f":"SUM(H11:H165)","v":0},{"$f":"SUM(I11:I165)","v":0},null,null,null,{"$f":"SUM(M11:M166)","v":3927},2926,0,0,400,0,null,null,null,{"$f":"SUM(V11:V166)","v":0},null,null,null,{"$f":"CONCATENATE(\"Alv \",(AA7*100),\" %\")","v":"Alv 24 %"},"alv 0%",null,null,null,null,null,null,null,null,{"$f":"SUM(AI11:AI166)","v":0},0,0,0,0,{"$f":"SUM(AN11:AN166)","v":0},0,0,0,0,null,{"$f":"SUM(AT11:AT166)","v":0},0,0,0,0,0,0,0,0,0]
[null,"OHJE",null,null,null,null,"Puunmyyntitulot yhteensä",null,{"$f":"SUM(G9:I9)","v":15400},null,null,null,null,null,null,null,null,null,null,null,null,null,null,null,null,0,{"$f":"Z10/(1+AA7)","v":0}]
[null,1,null,null,null,null,null,null,null,1,"Ei",{"$f":"IF(Etusivu!$C$22=\"kyllä\",25.5%,0%)","v":0.255},{"$f":"IF(R11>0,R11*L11,G11*L11+H11*L11+I11*L11+L11*V11)","v":0},null,null,null,null,null,null,null,{"$f":"SUM(G11:I11)+SUM(O11:R11)","v":0},null,null,null,null,"OHJEITA",null,null,null,1,"Ei",1,1,null,{"$f":"IF($J11=1,IF($K11=\"Ei\",$H11,0),0)","v":0},{"$f":"IF($J11=1,IF($K11=\"Kyllä\",$H11,0),0)","v":0},{"$f":"IF($J11=2,IF($K11=\"Ei\",$H11,0),0)","v":0},{"$f":"IF($J11=2,IF($K11=\"Kyllä\",$H11,0),0)","v":0},{"$f":"IF($J11=3,IF($K11=\"Ei\",$H11,0),0)","v":0},{"$f":"IF($J11=3,IF($K11=\"kyllä\",$H11,0),0)","v":0},{"$f":"IF($J11=4,IF($K11=\"ei\",$H11,0),0)","v":0},{"$f":"IF($J11=4,IF($K11=\"Kyllä\",$H11,0),0)","v":0},{"$f":"IF($J11=5,IF($K11=\"ei\",$H11,0),0)","v":0},{"$f":"IF($J11=5,IF($K11=\"kyllä\",$H11,0),0)","v":0},null,{"$f":"IF($J11=1,IF($K11=\"Ei\",$I11,0),0)","v":0},{"$f":"IF($J11=1,IF($K11=\"Kyllä\",$I11,0),0)","v":0},{"$f":"IF($J11=2,IF($K11=\"Ei\",$I11,0),0)","v":0},{"$f":"IF($J11=2,IF($K11=\"Kyllä\",$I11,0),0)","v":0},{"$f":"IF($J11=3,IF($K11=\"Ei\",$I11,0),0)","v":0},{"$f":"IF($J11=3,IF($K11=\"Kyllä\",$I11,0),0)","v":0},{"$f":"IF($J11=4,IF($K11=\"Ei\",$I11,0),0)","v":0},{"$f":"IF($J11=4,IF($K11=\"Kyllä\",$I11,0),0)","v":0},{"$f":"IF($J11=5,IF($K11=\"Ei\",$I11,0),0)","v":0},{"$f":"IF($J11=5,IF($K11=\"Kyllä\",$I11,0),0)","v":0}]
[null,{"$f":"B11+1","v":2},null,null,null,null,null,null,null,1,"Ei",{"$f":"IF(Etusivu!$C$22=\"kyllä\",25.5%,0%)","v":0.255},{"$f":"IF(R12>0,R12*L12,G12*L12+H12*L12+I12*L12+V12*L12)","v":0},null,null,null,null,null,null,null,{"$f":"SUM(G12:I12)+SUM(O12:R12)","v":0},null,null,null,null,null,null,null,null,2,"Kyllä",2,2,null,{"$f":"IF($J12=1,IF($K12=\"Ei\",$H12,0),0)","v":0},{"$f":"IF($J12=1,IF($K12=\"Kyllä\",$H12,0),0)","v":0},{"$f":"IF($J12=2,IF($K12=\"Ei\",$H12,0),0)","v":0},{"$f":"IF($J12=2,IF($K12=\"Kyllä\",$H12,0),0)","v":0},{"$f":"IF($J12=3,IF($K12=\"Ei\",$H12,0),0)","v":0},{"$f":"IF($J12=3,IF($K12=\"kyllä\",$H12,0),0)","v":0},{"$f":"IF($J12=4,IF($K12=\"ei\",$H12,0),0)","v":0},{"$f":"IF($J12=4,IF($K12=\"Kyllä\",$H12,0),0)","v":0},{"$f":"IF($J12=5,IF($K12=\"ei\",$H12,0),0)","v":0},{"$f":"IF($J12=5,IF($K12=\"kyllä\",$H12,0),0)","v":0},null,{"$f":"IF($J12=1,IF($K12=\"Ei\",$I12,0),0)","v":0},{"$f":"IF($J12=1,IF($K12=\"Kyllä\",$I12,0),0)","v":0},{"$f":"IF($J12=2,IF($K12=\"Ei\",$I12,0),0)","v":0},{"$f":"IF($J12=2,IF($K12=\"Kyllä\",$I12,0),0)","v":0},{"$f":"IF($J12=3,IF($K12=\"Ei\",$I12,0),0)","v":0},{"$f":"IF($J12=3,IF($K12=\"Kyllä\",$I12,0),0)","v":0},{"$f":"IF($J12=4,IF($K12=\"Ei\",$I12,0),0)","v":0},{"$f":"IF($J12=4,IF($K12=\"Kyllä\",$I12,0),0)","v":0},{"$f":"IF($J12=5,IF($K12=\"Ei\",$I12,0),0)","v":0},{"$f":"IF($J12=5,IF($K12=\"Kyllä\",$I12,0),0)","v":0}]
[null,3,2,3,"Puukauppa firma X:n kanssa",null,15400,null,null,1,"Kyllä",{"$f":"IF(Etusivu!$C$22=\"kyllä\",25.5%,0%)","v":0.255},{"$f":"IF(R13>0,R13*L13,G13*L13+H13*L13+I13*L13+V13*L13)","v":3927},{"$f":"G13*0.19","v":2926},null,null,null,null,null,null,{"$f":"SUM(G13:I13)+SUM(O13:R13)","v":15400},null,null,null,null,"o Muista kirjata tulon päiväys. Sen perusteella Mette laskee ALV:n oikealle kuukaudelle ja vie tulon sisältävän arvonlisveron jatkolaskentaan.",null,null,null,3,null,3,3,null,0,0,0,0,0,0,0,0,0,0,null,0,0,0,0,0,0,0,0,0,0]
[null,4,6,7,"Metkatuki",null,null,null,null,1,"Kyllä",{"$f":"IF(Etusivu!$C$22=\"kyllä\",25.5%,0%)","v":0.255},{"$f":"IF(R14>0,R14*L14,G14*L14+H14*L14+I14*L14+V14*L14)","v":0},null,null,null,400,null,null,null,{"$f":"SUM(G14:I14)+SUM(O14:R14)","v":400},null,null,null,null,null,null,null,null,4,null,4,4,null,0,0,0,0,0,0,0,0,0,0,null,0,0,0,0,0,0,0,0,0,0]
[null,5,null,null,null,null,null,null,null,1,"Ei",{"$f":"IF(Etusivu!$C$22=\"kyllä\",25.5%,0%)","v":0.255},0,null,null,null,null,null,null,null,0,null,null,null,null,"o Puunmyyntitulot kirjataan ilman arvonlisäveroa.",null,null,null,5,null,5,5,null,0,0,0,0,0,0,0,0,0,0,null,0,0,0,0,0,0,0,0,0,0]
[null,6,null,null,null,null,null,null,null,1,"Ei",{"$f":"IF(Etusivu!$C$22=\"kyllä\",25.5%,0%)","v":0.255},0,null,null,null,null,null,null,null,0,null,null,null,null,null,null,null,null,null,null,6,6,null,0,0,0,0,0,0,0,0,0,0,null,0,0,0,0,0,0,0,0,0,0]
[null,7,null,null,null,null,null,null,null,1,"Ei",{"$f":"IF(Etusivu!$C$22=\"kyllä\",25.5%,0%)","v":0.255},0,null,null,null,null,null,null,null,0,null,null,null,null,"o Hankintakauppojen osalta valitse hankintatyömaatila. Mettellä voidaan eritellä viiden maatilan hankintatyöt.",null,null,null,null,null,7,7,null,0,0,0,0,0,0,0,0,0,0,null,0,0,0,0,0,0,0,0,0,0]
[null,8,null,null,null,null,null,null,null,1,"Ei",{"$f":"IF(Etusivu!$C$22=\"kyllä\",25.5%,0%)","v":0.255},0,null,null,null,null,null,null,null,0,null,null,null,null,null,null,null,null,null,null,8,8,null,0,0,0,0,0,0,0,0,0,0,null,0,0,0,0,0,0,0,0,0,0]
[null,{"$f":"B18+1","v":9},null,null,null,null,null,null,null,1,"Ei",{"$f":"IF(Etusivu!$C$22=\"kyllä\",25.5%,0%)","v":0.255},0,null,null,null,null,null,null,null,0,null,null,null,null,"o Metsävähennykseen oikeutettujen myyntien osalta valitse pudotusvalikosta \"Kyllä\" metsävähennysoikeuden kohdalle",null,null,null,null,null,9,9,null,0,0,0,0,0,0,0,0,0,0,null,0,0,0,0,0,0,0,0,0,0]
[null,10,null,null,null,null,null,null,null,1,"Ei",{"$f":"IF(Etusivu!$C$22=\"kyllä\",25.5%,0%)","v":0.255},0,null,null,null,null,null,null,null,0,null,null,null,null,"    - Metsävähennystä saa myös Vakuutuskorvauksista, hirvivahinkokorvauksista ja metsätalouden tuista esim. Kemeratuesta.",null,null,null,null,null,10,10,null,0,0,0,0,0,0,0,0,0,0,null,0,0,0,0,0,0,0,0,0,0]
[null,11,null,null,null,null,null,null,null,1,"Ei",{"$f":"IF(Etusivu!$C$22=\"kyllä\",25.5%,0%)","v":0.255},0,null,null,null,null,null,null,null,0,null,null,null,null,null,null,null,null,null,null,11,11,null,0,0,0,0,0,0,0,0,0,0,null,0,0,0,0,0,0,0,0,0,0]
[null,12,null,null,null,null,null,null,null,1,"Ei",{"$f":"IF(Etusivu!$C$22=\"kyllä\",25.5%,0%)","v":0.255},0,null,null,null,null,null,null,null,0,null,null,null,null,"o Mikäli kirjaat ennakonpidätyksen määrän, tuloksen laskennassa lasketaan lisäveron tai palautuksenmäärä.",null,null,null,null,null,12,12,null,0,0,0,0,0,0,0,0,0,0,null,0,0,0,0,0,0,0,0,0,0]
[null,13,null,null,null,null,null,null,null,1,"Ei",{"$f":"IF(Etusivu!$C$22=\"kyllä\",25.5%,0%)","v":0.255},0,null,null,null,null,null,null,null,0,null,null,null,null,null,null,null,null,null,null,13,null,null,0,0,0,0,0,0,0,0,0,0,null,0,0,0,0,0,0,0,0,0,0]
[null,14,null,null,null,null,null,null,null,1,"Ei",{"$f":"IF(Etusivu!$C$22=\"kyllä\",25.5%,0%)","v":0.255},0,null,null,null,null,null,null,null,0,null,null,null,null,"o Maatalouden tuloihin kuuluvia tuloja voi vähäisessä määrin laskea Mettellä. Niihin liittyvät arvonlisäverot lasketaan mukaan alv:n laskentaan.",null,null,null,null,null,14,null,null,0,0,0,0,0,0,0,0,0,0,null,0,0,0,0,0,0,0,0,0,0]
[null,15,null,null,null,null,null,null,null,1,"Ei",{"$f":"IF(Etusivu!$C$22=\"kyllä\",25.5%,0%)","v":0.255},0,null,null,null,null,null,null,null,0,null,null,null,null,null,null,null,null,null,null,15,null,null,0,0,0,0,0,0,0,0,0,0,null,0,0,0,0,0,0,0,0,0,0]
[null,16,null,null,null,null,null,null,null,1,"Ei",{"$f":"IF(Etusivu!$C$22=\"kyllä\",25.5%,0%)","v":0.255},0,null,null,null,null,null,null,null,0,null,null,null,null,"o Kuitin upottaminen: Valitse Excelin valikkoriviltä kohta Lisää ja sieltä ryhmässä Teksti oleva \"Objekti kuvake\". Avautuvassa ikkunassa valitse välilehti Luo tiedostosta. Hae kuitti selaa-napista. Rastita kohta Näytä kuvakkena.  Voit halutessasi kutistaa kuvaketta rivin korkuiseksi.",null,null,null,null,null,null,null,null,0,0,0,0,0,0,0,0,0,0,null,0,0,0,0,0,0,0,0,0,0]
[null,17,null,null,null,null,null,null,null,1,"Ei",{"$f":"IF(Etusivu!$C$22=\"kyllä\",25.5%,0%)","v":0.255},0,null,null,null,null,null,null,null,0,null,null,null,null,null,null,null,null,null,null,null,null,null,0,0,0,0,0,0,0,0,0,0,null,0,0,0,0,0,0,0,0,0,0]
[null,18,null,null,null,null,null,null,null,1,"Ei",{"$f":"IF(Etusivu!$C$22=\"kyllä\",25.5%,0%)","v":0.255},0,null,null,null,null,null,null,null,0,null,null,null,null,null,null,null,null,null,null,18,null,null,0,0,0,0,0,0,0,0,0,0,null,0,0,0,0,0,0,0,0,0,0]
[null,19,null,null,null,null,null,null,null,1,"Ei",{"$f":"IF(Etusivu!$C$22=\"kyllä\",25.5%,0%)","v":0.255},0,null,null,null,null,null,null,null,0,null,null,null,null,null,null,null,null,null,null,19,null,null,0,0,0,0,0,0,0,0,0,0,null,0,0,0,0,0,0,0,0,0,0]
[null,20,null,null,null,null,null,null,null,1,"Ei",{"$f":"IF(Etusivu!$C$22=\"kyllä\",25.5%,0%)","v":0.255},0,null,null,null,null,null,null,null,0,null,null,null,null,null,null,null,null,null,null,20,null,null,0,0,0,0,0,0,0,0,0,0,null,0,0,0,0,0,0,0,0,0,0]
[null,21,null,null,null,null,null,null,null,1,"Ei",{"$f":"IF(Etusivu!$C$22=\"kyllä\",25.5%,0%)","v":0.255},0,null,null,null,null,null,null,null,0,null,null,null,null,null,null,null,null,null,null,21,null,null,0,0,0,0,0,0,0,0,0,0,null,0,0,0,0,0,0,0,0,0,0]
[null,22,null,null,null,null,null,null,null,1,"Ei",{"$f":"IF(Etusivu!$C$22=\"kyllä\",25.5%,0%)","v":0.255},0,null,null,null,null,null,null,null,0,null,null,null,null,null,null,null,null,null,null,22,null,null,0,0,0,0,0,0,0,0,0,0,null,0,0,0,0,0,0,0,0,0,0]
[null,23,null,null,null,null,null,null,null,1,"Ei",{"$f":"IF(Etusivu!$C$22=\"kyllä\",25.5%,0%)","v":0.255},0,null,null,null,null,null,null,null,0,null,null,null,null,null,null,null,null,null,null,23,null,null,0,0,0,0,0,0,0,0,0,0,null,0,0,0,0,0,0,0,0,0,0]
[null,24,null,null,null,null,null,null,null,1,"Ei",{"$f":"IF(Etusivu!$C$22=\"kyllä\",25.5%,0%)","v":0.255},0,null,null,null,null,null,null,null,0,null,null,null,null,null,null,null,null,null,null,24,null,null,0,0,0,0,0,0,0,0,0,0,null,0,0,0,0,0,0,0,0,0,0]
[null,25,null,null,null,null,null,null,null,1,"Ei",{"$f":"IF(Etusivu!$C$22=\"kyllä\",25.5%,0%)","v":0.255},0,null,null,null,null,null,null,null,0,null,null,null,null,null,null,null,null,null,null,25,null,null,0,0,0,0,0,0,0,0,0,0,null,0,0,0,0,0,0,0,0,0,0]
[null,26,null,null,null,null,null,null,null,1,"Ei",{"$f":"IF(Etusivu!$C$22=\"kyllä\",25.5%,0%)","v":0.255},0,null,null,null,null,null,null,null,0,null,null,null,null,null,null,null,null,null,null,26,null,null,0,0,0,0,0,0,0,0,0,0,null,0,0,0,0,0,0,0,0,0,0]
[null,27,null,null,null,null,null,null,null,1,"Ei",{"$f":"IF(Etusivu!$C$22=\"kyllä\",25.5%,0%)","v":0.255},0,null,null,null,null,null,null,null,0,null,null,null,null,null,null,null,null,null,null,27,null,null,0,0,0,0,0,0,0,0,0,0,null,0,0,0,0,0,0,0,0,0,0]
[null,28,null,null,null,null,null,null,null,1,"Ei",{"$f":"IF(Etusivu!$C$22=\"kyllä\",25.5%,0%)","v":0.255},0,null,null,null,null,null,null,null,0,null,null,null,null,null,null,null,null,null,null,28,null,null,0,0,0,0,0,0,0,0,0,0,null,0,0,0,0,0,0,0,0,0,0]
[null,29,null,null,null,null,null,null,null,1,"Ei",{"$f":"IF(Etusivu!$C$22=\"kyllä\",25.5%,0%)","v":0.255},0,null,null,null,null,null,null,null,0,null,null,null,null,null,null,null,null,null,null,29,null,null,0,0,0,0,0,0,0,0,0,0,null,0,0,0,0,0,0,0,0,0,0]
[null,30,null,null,null,null,null,null,null,1,"Ei",{"$f":"IF(Etusivu!$C$22=\"kyllä\",25.5%,0%)","v":0.255},0,null,null,null,null,null,null,null,0,null,null,null,null,null,null,null,null,null,null,30,null,null,0,0,0,0,0,0,0,0,0,0,null,0,0,0,0,0,0,0,0,0,0]
[null,31,null,null,null,null,null,null,null,1,"Ei",{"$f":"IF(Etusivu!$C$22=\"kyllä\",25.5%,0%)","v":0.255},0,null,null,null,null,null,null,null,0,null,null,null,null,null,null,null,null,null,null,31,null,null,0,0,0,0,0,0,0,0,0,0,null,0,0,0,0,0,0,0,0,0,0]
[null,32,null,null,null,null,null,null,null,1,"Ei",{"$f":"IF(Etusivu!$C$22=\"kyllä\",25.5%,0%)","v":0.255},0,null,null,null,null,null,null,null,0,null,null,null,null,null,null,null,null,null,null,null,null,null,0,0,0,0,0,0,0,0,0,0,null,0,0,0,0,0,0,0,0,0,0]
[null,33,null,null,null,null,null,null,null,1,"Ei",{"$f":"IF(Etusivu!$C$22=\"kyllä\",25.5%,0%)","v":0.255},0,null,null,null,null,null,null,null,0,null,null,null,null,null,null,null,null,null,null,null,null,null,0,0,0,0,0,0,0,0,0,0,null,0,0,0,0,0,0,0,0,0,0]
[null,34,null,null,null,null,null,null,null,1,"Ei",{"$f":"IF(Etusivu!$C$22=\"kyllä\",25.5%,0%)","v":0.255},0,null,null,null,null,null,null,null,0,null,null,null,null,null,null,null,null,null,null,null,null,null,0,0,0,0,0,0,0,0,0,0,null,0,0,0,0,0,0,0,0,0,0]
[null,35,null,null,null,null,null,null,null,1,"Ei",{"$f":"IF(Etusivu!$C$22=\"kyllä\",25.5%,0%)","v":0.255},0,null,null,null,null,null,null,null,0,null,null,null,null,null,null,null,null,null,null,null,null,null,0,0,0,0,0,0,0,0,0,0,null,0,0,0,0,0,0,0,0,0,0]
[null,36,null,null,null,null,null,null,null,1,"Ei",{"$f":"IF(Etusivu!$C$22=\"kyllä\",25.5%,0%)","v":0.255},0,null,null,null,null,null,null,null,0,null,null,null,null,null,null,null,null,null,null,null,null,null,0,0,0,0,0,0,0,0,0,0,null,0,0,0,0,0,0,0,0,0,0]
[null,37,null,null,null,null,null,null,null,1,"Ei",{"$f":"IF(Etusivu!$C$22=\"kyllä\",25.5%,0%)","v":0.255},0,null,null,null,null,null,null,null,0,null,null,null,null,null,null,null,null,null,null,null,null,null,0,0,0,0,0,0,0,0,0,0,null,0,0,0,0,0,0,0,0,0,0]
[null,38,null,null,null,null,null,null,null,1,"Ei",{"$f":"IF(Etusivu!$C$22=\"kyllä\",25.5%,0%)","v":0.255},0,null,null,null,null,null,null,null,0,null,null,null,null,null,null,null,null,null,null,null,null,null,0,0,0,0,0,0,0,0,0,0,null,0,0,0,0,0,0,0,0,0,0]
[null,39,null,null,null,null,null,null,null,1,"Ei",{"$f":"IF(Etusivu!$C$22=\"kyllä\",25.5%,0%)","v":0.255},0,null,null,null,null,null,null,null,0,null,null,null,null,null,null,null,null,null,null,null,null,null,0,0,0,0,0,0,0,0,0,0,null,0,0,0,0,0,0,0,0,0,0]
[null,40,null,null,null,null,null,null,null,1,"Ei",{"$f":"IF(Etusivu!$C$22=\"kyllä\",25.5%,0%)","v":0.255},0,null,null,null,null,null,null,null,0,null,null,null,null,null,null,null,null,null,null,null,null,null,0,0,0,0,0,0,0,0,0,0,null,0,0,0,0,0,0,0,0,0,0]
[null,41,null,null,null,null,null,null,null,1,"Ei",{"$f":"IF(Etusivu!$C$22=\"kyllä\",25.5%,0%)","v":0.255},0,null,null,null,null,null,null,null,0,null,null,null,null,null,null,null,null,null,null,null,null,null,0,0,0,0,0,0,0,0,0,0,null,0,0,0,0,0,0,0,0,0,0]
[null,42,null,null,null,null,null,null,null,1,"Ei",{"$f":"IF(Etusivu!$C$22=\"kyllä\",25.5%,0%)","v":0.255},0,null,null,null,null,null,null,null,0,null,null,null,null,null,null,null,null,null,null,null,null,null,0,0,0,0,0,0,0,0,0,0,null,0,0,0,0,0,0,0,0,0,0]
[null,43,null,null,null,null,null,null,null,1,"Ei",{"$f":"IF(Etusivu!$C$22=\"kyllä\",25.5%,0%)","v":0.255},0,null,null,null,null,null,null,null,0,null,null,null,null,null,null,null,null,null,null,null,null,null,0,0,0,0,0,0,0,0,0,0,null,0,0,0,0,0,0,0,0,0,0]
[null,44,null,null,null,null,null,null,null,1,"Ei",{"$f":"IF(Etusivu!$C$22=\"kyllä\",25.5%,0%)","v":0.255},0,null,null,null,null,null,null,null,0,null,null,null,null,null,null,null,null,null,null,null,null,null,0,0,0,0,0,0,0,0,0,0,null,0,0,0,0,0,0,0,0,0,0]
[null,45,null,null,null,null,null,null,null,1,"Ei",{"$f":"IF(Etusivu!$C$22=\"kyllä\",25.5%,0%)","v":0.255},0,null,null,null,null,null,null,null,0,null,null,null,null,null,null,null,null,null,null,null,null,null,0,0,0,0,0,0,0,0,0,0,null,0,0,0,0,0,0,0,0,0,0]
[null,46,null,null,null,null,null,null,null,1,"Ei",{"$f":"IF(Etusivu!$C$22=\"kyllä\",25.5%,0%)","v":0.255},0,null,null,null,null,null,null,null,0,null,null,null,null,null,null,null,null,null,null,null,null,null,0,0,0,0,0,0,0,0,0,0,null,0,0,0,0,0,0,0,0,0,0]
[null,47,null,null,null,null,null,null,null,1,"Ei",{"$f":"IF(Etusivu!$C$22=\"kyllä\",25.5%,0%)","v":0.255},0,null,null,null,null,null,null,null,0,null,null,null,null,null,null,null,null,null,null,null,null,null,0,0,0,0,0,0,0,0,0,0,null,0,0,0,0,0,0,0,0,0,0]
[null,48,null,null,null,null,null,null,null,1,"Ei",{"$f":"IF(Etusivu!$C$22=\"kyllä\",25.5%,0%)","v":0.255},0,null,null,null,null,null,null,null,0,null,null,null,null,null,null,null,null,null,null,null,null,null,0,0,0,0,0,0,0,0,0,0,null,0,0,0,0,0,0,0,0,0,0]
[null,49,null,null,null,null,null,null,null,1,"Ei",{"$f":"IF(Etusivu!$C$22=\"kyllä\",25.5%,0%)","v":0.255},0,null,null,null,null,null,null,null,0,null,null,null,null,null,null,null,null,null,null,null,null,null,0,0,0,0,0,0,0,0,0,0,null,0,0,0,0,0,0,0,0,0,0]
[null,50,null,null,null,null,null,null,null,1,"Ei",{"$f":"IF(Etusivu!$C$22=\"kyllä\",25.5%,0%)","v":0.255},0,null,null,null,null,null,null,null,0,null,null,null,null,null,null,null,null,null,null,null,null,null,0,0,0,0,0,0,0,0,0,0,null,0,0,0,0,0,0,0,0,0,0]
[null,51,null,null,null,null,null,null,null,1,"Ei",{"$f":"IF(Etusivu!$C$22=\"kyllä\",25.5%,0%)","v":0.255},0,null,null,null,null,null,null,null,0,null,null,null,null,null,null,null,null,null,null,null,null,null,0,0,0,0,0,0,0,0,0,0,null,0,0,0,0,0,0,0,0,0,0]
[null,52,null,null,null,null,null,null,null,1,"Ei",{"$f":"IF(Etusivu!$C$22=\"kyllä\",25.5%,0%)","v":0.255},0,null,null,null,null,null,null,null,0,null,null,null,null,null,null,null,null,null,null,null,null,null,0,0,0,0,0,0,0,0,0,0,null,0,0,0,0,0,0,0,0,0,0]
[null,53,null,null,null,null,null,null,null,1,"Ei",{"$f":"IF(Etusivu!$C$22=\"kyllä\",25.5%,0%)","v":0.255},0,null,null,null,null,null,null,null,0,null,null,null,null,null,null,null,null,null,null,null,null,null,0,0,0,0,0,0,0,0,0,0,null,0,0,0,0,0,0,0,0,0,0]
[null,54,null,null,null,null,null,null,null,1,"Ei",{"$f":"IF(Etusivu!$C$22=\"kyllä\",25.5%,0%)","v":0.255},0,null,null,null,null,null,null,null,0,null,null,null,null,null,null,null,null,null,null,null,null,null,0,0,0,0,0,0,0,0,0,0,null,0,0,0,0,0,0,0,0,0,0]
[null,55,null,null,null,null,null,null,null,1,"Ei",{"$f":"IF(Etusivu!$C$22=\"kyllä\",25.5%,0%)","v":0.255},0,null,null,null,null,null,null,null,0,null,null,null,null,null,null,null,null,null,null,null,null,null,0,0,0,0,0,0,0,0,0,0,null,0,0,0,0,0,0,0,0,0,0]
[null,56,null,null,null,null,null,null,null,1,"Ei",{"$f":"IF(Etusivu!$C$22=\"kyllä\",25.5%,0%)","v":0.255},0,null,null,null,null,null,null,null,0,null,null,null,null,null,null,null,null,null,null,null,null,null,0,0,0,0,0,0,0,0,0,0,null,0,0,0,0,0,0,0,0,0,0]
[null,57,null,null,null,null,null,null,null,1,"Ei",{"$f":"IF(Etusivu!$C$22=\"kyllä\",25.5%,0%)","v":0.255},0,null,null,null,null,null,null,null,0,null,null,null,null,null,null,null,null,null,null,null,null,null,0,0,0,0,0,0,0,0,0,0,null,0,0,0,0,0,0,0,0,0,0]
[null,58,null,null,null,null,null,null,null,1,"Ei",{"$f":"IF(Etusivu!$C$22=\"kyllä\",25.5%,0%)","v":0.255},0,null,null,null,null,null,null,null,0,null,null,null,null,null,null,null,null,null,null,null,null,null,0,0,0,0,0,0,0,0,0,0,null,0,0,0,0,0,0,0,0,0,0]
[null,59,null,null,null,null,null,null,null,1,"Ei",{"$f":"IF(Etusivu!$C$22=\"kyllä\",25.5%,0%)","v":0.255},0,null,null,null,null,null,null,null,0,null,null,null,null,null,null,null,null,null,null,null,null,null,0,0,0,0,0,0,0,0,0,0,null,0,0,0,0,0,0,0,0,0,0]
[null,60,null,null,null,null,null,null,null,1,"Ei",{"$f":"IF(Etusivu!$C$22=\"kyllä\",25.5%,0%)","v":0.255},0,null,null,null,null,null,null,null,0,null,null,null,null,null,null,null,null,null,null,null,null,null,0,0,0,0,0,0,0,0,0,0,null,0,0,0,0,0,0,0,0,0,0]
[null,61,null,null,null,null,null,null,null,1,"Ei",{"$f":"IF(Etusivu!$C$22=\"kyllä\",25.5%,0%)","v":0.255},0,null,null,null,null,null,null,null,0,null,null,null,null,null,null,null,null,null,null,null,null,null,0,0,0,0,0,0,0,0,0,0,null,0,0,0,0,0,0,0,0,0,0]
[null,62,null,null,null,null,null,null,null,1,"Ei",{"$f":"IF(Etusivu!$C$22=\"kyllä\",25.5%,0%)","v":0.255},0,null,null,null,null,null,null,null,0,null,null,null,null,null,null,null,null,null,null,null,null,null,0,0,0,0,0,0,0,0,0,0,null,0,0,0,0,0,0,0,0,0,0]
[null,63,null,null,null,null,null,null,null,1,"Ei",{"$f":"IF(Etusivu!$C$22=\"kyllä\",25.5%,0%)","v":0.255},0,null,null,null,null,null,null,null,0,null,null,null,null,null,null,null,null,null,null,null,null,null,0,0,0,0,0,0,0,0,0,0,null,0,0,0,0,0,0,0,0,0,0]
[null,64,null,null,null,null,null,null,null,1,"Ei",{"$f":"IF(Etusivu!$C$22=\"kyllä\",25.5%,0%)","v":0.255},0,null,null,null,null,null,null,null,0,null,null,null,null,null,null,null,null,null,null,null,null,null,0,0,0,0,0,0,0,0,0,0,null,0,0,0,0,0,0,0,0,0,0]
[null,65,null,null,null,null,null,null,null,1,"Ei",{"$f":"IF(Etusivu!$C$22=\"kyllä\",25.5%,0%)","v":0.255},0,null,null,null,null,null,null,null,0,null,null,null,null,null,null,null,null,null,null,null,null,null,0,0,0,0,0,0,0,0,0,0,null,0,0,0,0,0,0,0,0,0,0]
[null,66,null,null,null,null,null,null,null,1,"Ei",{"$f":"IF(Etusivu!$C$22=\"kyllä\",25.5%,0%)","v":0.255},0,null,null,null,null,null,null,null,0,null,null,null,null,null,null,null,null,null,null,null,null,null,{"$f":"IF($J76=1,IF($K76=\"Ei\",$H76,0),0)","v":0},{"$f":"IF($J76=1,IF($K76=\"Kyllä\",$H76,0),0)","v":0},{"$f":"IF($J76=2,IF($K76=\"Ei\",$H76,0),0)","v":0},{"$f":"IF($J76=2,IF($K76=\"Kyllä\",$H76,0),0)","v":0},{"$f":"IF($J76=3,IF($K76=\"Ei\",$H76,0),0)","v":0},{"$f":"IF($J76=3,IF($K76=\"kyllä\",$H76,0),0)","v":0},{"$f":"IF($J76=4,IF($K76=\"ei\",$H76,0),0)","v":0},{"$f":"IF($J76=4,IF($K76=\"Kyllä\",$H76,0),0)","v":0},{"$f":"IF($J76=5,IF($K76=\"ei\",$H76,0),0)","v":0},{"$f":"IF($J76=5,IF($K76=\"kyllä\",$H76,0),0)","v":0},null,{"$f":"IF($J76=1,IF($K76=\"Ei\",$I76,0),0)","v":0},{"$f":"IF($J76=1,IF($K76=\"Kyllä\",$I76,0),0)","v":0},{"$f":"IF($J76=2,IF($K76=\"Ei\",$I76,0),0)","v":0},{"$f":"IF($J76=2,IF($K76=\"Kyllä\",$I76,0),0)","v":0},{"$f":"IF($J76=3,IF($K76=\"Ei\",$I76,0),0)","v":0},{"$f":"IF($J76=3,IF($K76=\"Kyllä\",$I76,0),0)","v":0},{"$f":"IF($J76=4,IF($K76=\"Ei\",$I76,0),0)","v":0},{"$f":"IF($J76=4,IF($K76=\"Kyllä\",$I76,0),0)","v":0},{"$f":"IF($J76=5,IF($K76=\"Ei\",$I76,0),0)","v":0},{"$f":"IF($J76=5,IF($K76=\"Kyllä\",$I76,0),0)","v":0}]
[null,67,null,null,null,null,null,null,null,1,"Ei",{"$f":"IF(Etusivu!$C$22=\"kyllä\",25.5%,0%)","v":0.255},0,null,null,null,null,null,null,null,0,null,null,null,null,null,null,null,null,null,null,null,null,null,0,0,0,0,0,0,0,0,0,0,null,0,0,0,0,0,0,0,0,0,0]
[null,68,null,null,null,null,null,null,null,1,"Ei",{"$f":"IF(Etusivu!$C$22=\"kyllä\",25.5%,0%)","v":0.255},{"$f":"IF(R78>0,R78*L78,G78*L78+H78*L78+I78*L78+V78*L78)","v":0},null,null,null,null,null,null,null,{"$f":"SUM(G78:I78)+SUM(O78:R78)","v":0},null,null,null,null,null,null,null,null,null,null,null,null,null,0,0,0,0,0,0,0,0,0,0,null,0,0,0,0,0,0,0,0,0,0]
[null,69,null,null,null,null,null,null,null,1,"Ei",{"$f":"IF(Etusivu!$C$22=\"kyllä\",25.5%,0%)","v":0.255},0,null,null,null,null,null,null,null,0,null,null,null,null,null,null,null,null,null,null,null,null,null,0,0,0,0,0,0,0,0,0,0,null,0,0,0,0,0,0,0,0,0,0]
[null,70,null,null,null,null,null,null,null,1,"Ei",{"$f":"IF(Etusivu!$C$22=\"kyllä\",25.5%,0%)","v":0.255},0,null,null,null,null,null,null,null,0,null,null,null,null,null,null,null,null,null,null,null,null,null,0,0,0,0,0,0,0,0,0,0,null,0,0,0,0,0,0,0,0,0,0]
[null,71,null,null,null,null,null,null,null,1,"Ei",{"$f":"IF(Etusivu!$C$22=\"kyllä\",25.5%,0%)","v":0.255},0,null,null,null,null,null,null,null,0,null,null,null,null,null,null,null,null,null,null,null,null,null,0,0,0,0,0,0,0,0,0,0,null,0,0,0,0,0,0,0,0,0,0]
[null,72,null,null,null,null,null,null,null,1,"Ei",{"$f":"IF(Etusivu!$C$22=\"kyllä\",25.5%,0%)","v":0.255},0,null,null,null,null,null,null,null,0,null,null,null,null,null,null,null,null,null,null,null,null,null,0,0,0,0,0,0,0,0,0,0,null,0,0,0,0,0,0,0,0,0,0]
[null,{"$f":"B82+1","v":73},null,null,null,null,null,null,null,1,"Ei",{"$f":"IF(Etusivu!$C$22=\"kyllä\",25.5%,0%)","v":0.255},0,null,null,null,null,null,null,null,0,null,null,null,null,null,null,null,null,null,null,null,null,null,0,0,0,0,0,0,0,0,0,0,null,0,0,0,0,0,0,0,0,0,0]
[null,74,null,null,null,null,null,null,null,1,"Ei",{"$f":"IF(Etusivu!$C$22=\"kyllä\",25.5%,0%)","v":0.255},0,null,null,null,null,null,null,null,0,null,null,null,null,null,null,null,null,null,null,null,null,null,0,0,0,0,0,0,0,0,0,0,null,0,0,0,0,0,0,0,0,0,0]
[null,75,null,null,null,null,null,null,null,1,"Ei",{"$f":"IF(Etusivu!$C$22=\"kyllä\",25.5%,0%)","v":0.255},0,null,null,null,null,null,null,null,0,null,null,null,null,null,null,null,null,null,null,null,null,null,0,0,0,0,0,0,0,0,0,0,null,0,0,0,0,0,0,0,0,0,0]
[null,76,null,null,null,null,null,null,null,1,"Ei",{"$f":"IF(Etusivu!$C$22=\"kyllä\",25.5%,0%)","v":0.255},0,null,null,null,null,null,null,null,0,null,null,null,null,null,null,null,null,null,null,null,null,null,0,0,0,0,0,0,0,0,0,0,null,0,0,0,0,0,0,0,0,0,0]
[null,77,null,null,null,null,null,null,null,1,"Ei",{"$f":"IF(Etusivu!$C$22=\"kyllä\",25.5%,0%)","v":0.255},0,null,null,null,null,null,null,null,0,null,null,null,null,null,null,null,null,null,null,null,null,null,0,0,0,0,0,0,0,0,0,0,null,0,0,0,0,0,0,0,0,0,0]
[null,78,null,null,null,null,null,null,null,1,"Ei",{"$f":"IF(Etusivu!$C$22=\"kyllä\",25.5%,0%)","v":0.255},0,null,null,null,null,null,null,null,0,null,null,null,null,null,null,null,null,null,null,null,null,null,0,0,0,0,0,0,0,0,0,0,null,0,0,0,0,0,0,0,0,0,0]
[null,79,null,null,null,null,null,null,null,1,"Ei",{"$f":"IF(Etusivu!$C$22=\"kyllä\",25.5%,0%)","v":0.255},0,null,null,null,null,null,null,null,0,null,null,null,null,null,null,null,null,null,null,null,null,null,0,0,0,0,0,0,0,0,0,0,null,0,0,0,0,0,0,0,0,0,0]
[null,80,null,null,null,null,null,null,null,1,"Ei",{"$f":"IF(Etusivu!$C$22=\"kyllä\",25.5%,0%)","v":0.255},0,null,null,null,null,null,null,null,0,null,null,null,null,null,null,null,null,null,null,null,null,null,0,0,0,0,0,0,0,0,0,0,null,0,0,0,0,0,0,0,0,0,0]
[null,81,null,null,null,null,null,null,null,1,"Ei",{"$f":"IF(Etusivu!$C$22=\"kyllä\",25.5%,0%)","v":0.255},0,null,null,null,null,null,null,null,0,null,null,null,null,null,null,null,null,null,null,null,null,null,0,0,0,0,0,0,0,0,0,0,null,0,0,0,0,0,0,0,0,0,0]
[null,82,null,null,null,null,null,null,null,1,"Ei",{"$f":"IF(Etusivu!$C$22=\"kyllä\",25.5%,0%)","v":0.255},0,null,null,null,null,null,null,null,0,null,null,null,null,null,null,null,null,null,null,null,null,null,0,0,0,0,0,0,0,0,0,0,null,0,0,0,0,0,0,0,0,0,0]
[null,83,null,null,null,null,null,null,null,1,"Ei",{"$f":"IF(Etusivu!$C$22=\"kyllä\",25.5%,0%)","v":0.255},0,null,null,null,null,null,null,null,0,null,null,null,null,null,null,null,null,null,null,null,null,null,0,0,0,0,0,0,0,0,0,0,null,0,0,0,0,0,0,0,0,0,0]
[null,84,null,null,null,null,null,null,null,1,"Ei",{"$f":"IF(Etusivu!$C$22=\"kyllä\",25.5%,0%)","v":0.255},0,null,null,null,null,null,null,null,0,null,null,null,null,null,null,null,null,null,null,null,null,null,0,0,0,0,0,0,0,0,0,0,null,0,0,0,0,0,0,0,0,0,0]
[null,85,null,null,null,null,null,null,null,1,"Ei",{"$f":"IF(Etusivu!$C$22=\"kyllä\",25.5%,0%)","v":0.255},0,null,null,null,null,null,null,null,0,null,null,null,null,null,null,null,null,null,null,null,null,null,0,0,0,0,0,0,0,0,0,0,null,0,0,0,0,0,0,0,0,0,0]
[null,86,null,null,null,null,null,null,null,1,"Ei",{"$f":"IF(Etusivu!$C$22=\"kyllä\",25.5%,0%)","v":0.255},0,null,null,null,null,null,null,null,0,null,null,null,null,null,null,null,null,null,null,null,null,null,0,0,0,0,0,0,0,0,0,0,null,0,0,0,0,0,0,0,0,0,0]
[null,87,null,null,null,null,null,null,null,1,"Ei",{"$f":"IF(Etusivu!$C$22=\"kyllä\",25.5%,0%)","v":0.255},0,null,null,null,null,null,null,null,0,null,null,null,null,null,null,null,null,null,null,null,null,null,0,0,0,0,0,0,0,0,0,0,null,0,0,0,0,0,0,0,0,0,0]
[null,88,null,null,null,null,null,null,null,1,"Ei",{"$f":"IF(Etusivu!$C$22=\"kyllä\",25.5%,0%)","v":0.255},0,null,null,null,null,null,null,null,0,null,null,null,null,null,null,null,null,null,null,null,null,null,0,0,0,0,0,0,0,0,0,0,null,0,0,0,0,0,0,0,0,0,0]
[null,89,null,null,null,null,null,null,null,1,"Ei",{"$f":"IF(Etusivu!$C$22=\"kyllä\",25.5%,0%)","v":0.255},0,null,null,null,null,null,null,null,0,null,null,null,null,null,null,null,null,null,null,null,null,null,0,0,0,0,0,0,0,0,0,0,null,0,0,0,0,0,0,0,0,0,0]
[null,90,null,null,null,null,null,null,null,1,"Ei",{"$f":"IF(Etusivu!$C$22=\"kyllä\",25.5%,0%)","v":0.255},0,null,null,null,null,null,null,null,0,null,null,null,null,null,null,null,null,null,null,null,null,null,0,0,0,0,0,0,0,0,0,0,null,0,0,0,0,0,0,0,0,0,0]
[null,91,null,null,null,null,null,null,null,1,"Ei",{"$f":"IF(Etusivu!$C$22=\"kyllä\",25.5%,0%)","v":0.255},0,null,null,null,null,null,null,null,0,null,null,null,null,null,null,null,null,null,null,null,null,null,0,0,0,0,0,0,0,0,0,0,null,0,0,0,0,0,0,0,0,0,0]
[null,92,null,null,null,null,null,null,null,1,"Ei",{"$f":"IF(Etusivu!$C$22=\"kyllä\",25.5%,0%)","v":0.255},0,null,null,null,null,null,null,null,0,null,null,null,null,null,null,null,null,null,null,null,null,null,0,0,0,0,0,0,0,0,0,0,null,0,0,0,0,0,0,0,0,0,0]
[null,93,null,null,null,null,null,null,null,1,"Ei",{"$f":"IF(Etusivu!$C$22=\"kyllä\",25.5%,0%)","v":0.255},0,null,null,null,null,null,null,null,0,null,null,null,null,null,null,null,null,null,null,null,null,null,0,0,0,0,0,0,0,0,0,0,null,0,0,0,0,0,0,0,0,0,0]
[null,94,null,null,null,null,null,null,null,1,"Ei",{"$f":"IF(Etusivu!$C$22=\"kyllä\",25.5%,0%)","v":0.255},0,null,null,null,null,null,null,null,0,null,null,null,null,null,null,null,null,null,null,null,null,null,0,0,0,0,0,0,0,0,0,0,null,0,0,0,0,0,0,0,0,0,0]
[null,95,null,null,null,null,null,null,null,1,"Ei",{"$f":"IF(Etusivu!$C$22=\"kyllä\",25.5%,0%)","v":0.255},0,null,null,null,null,null,null,null,0,null,null,null,null,null,null,null,null,null,null,null,null,null,0,0,0,0,0,0,0,0,0,0,null,0,0,0,0,0,0,0,0,0,0]
[null,96,null,null,null,null,null,null,null,1,"Ei",{"$f":"IF(Etusivu!$C$22=\"kyllä\",25.5%,0%)","v":0.255},0,null,null,null,null,null,null,null,0,null,null,null,null,null,null,null,null,null,null,null,null,null,0,0,0,0,0,0,0,0,0,0,null,0,0,0,0,0,0,0,0,0,0]
[null,97,null,null,null,null,null,null,null,1,"Ei",{"$f":"IF(Etusivu!$C$22=\"kyllä\",25.5%,0%)","v":0.255},0,null,null,null,null,null,null,null,0,null,null,null,null,null,null,null,null,null,null,null,null,null,0,0,0,0,0,0,0,0,0,0,null,0,0,0,0,0,0,0,0,0,0]
[null,98,null,null,null,null,null,null,null,1,"Ei",{"$f":"IF(Etusivu!$C$22=\"kyllä\",25.5%,0%)","v":0.255},0,null,null,null,null,null,null,null,0,null,null,null,null,null,null,null,null,null,null,null,null,null,0,0,0,0,0,0,0,0,0,0,null,0,0,0,0,0,0,0,0,0,0]
[null,99,null,null,null,null,null,null,null,1,"Ei",{"$f":"IF(Etusivu!$C$22=\"kyllä\",25.5%,0%)","v":0.255},0,null,null,null,null,null,null,null,0,null,null,null,null,null,null,null,null,null,null,null,null,null,0,0,0,0,0,0,0,0,0,0,null,0,0,0,0,0,0,0,0,0,0]
[null,100,null,null,null,null,null,null,null,1,"Ei",{"$f":"IF(Etusivu!$C$22=\"kyllä\",25.5%,0%)","v":0.255},0,null,null,null,null,null,null,null,0,null,null,null,null,null,null,null,null,null,null,null,null,null,0,0,0,0,0,0,0,0,0,0,null,0,0,0,0,0,0,0,0,0,0]
[null,101,null,null,null,null,null,null,null,1,"Ei",{"$f":"IF(Etusivu!$C$22=\"kyllä\",25.5%,0%)","v":0.255},0,null,null,null,null,null,null,null,0,null,null,null,null,null,null,null,null,null,null,null,null,null,0,0,0,0,0,0,0,0,0,0,null,0,0,0,0,0,0,0,0,0,0]
[null,102,null,null,null,null,null,null,null,1,"Ei",{"$f":"IF(Etusivu!$C$22=\"kyllä\",25.5%,0%)","v":0.255},0,null,null,null,null,null,null,null,0,null,null,null,null,null,null,null,null,null,null,null,null,null,0,0,0,0,0,0,0,0,0,0,null,0,0,0,0,0,0,0,0,0,0]
[null,103,null,null,null,null,null,null,null,1,"Ei",{"$f":"IF(Etusivu!$C$22=\"kyllä\",25.5%,0%)","v":0.255},0,null,null,null,null,null,null,null,0,null,null,null,null,null,null,null,null,null,null,null,null,null,0,0,0,0,0,0,0,0,0,0,null,0,0,0,0,0,0,0,0,0,0]
[null,104,null,null,null,null,null,null,null,1,"Ei",{"$f":"IF(Etusivu!$C$22=\"kyllä\",25.5%,0%)","v":0.255},0,null,null,null,null,null,null,null,0,null,null,null,null,null,null,null,null,null,null,null,null,null,0,0,0,0,0,0,0,0,0,0,null,0,0,0,0,0,0,0,0,0,0]
[null,105,null,null,null,null,null,null,null,1,"Ei",{"$f":"IF(Etusivu!$C$22=\"kyllä\",25.5%,0%)","v":0.255},0,null,null,null,null,null,null,null,0,null,null,null,null,null,null,null,null,null,null,null,null,null,0,0,0,0,0,0,0,0,0,0,null,0,0,0,0,0,0,0,0,0,0]
[null,106,null,null,null,null,null,null,null,1,"Ei",{"$f":"IF(Etusivu!$C$22=\"kyllä\",25.5%,0%)","v":0.255},0,null,null,null,null,null,null,null,0,null,null,null,null,null,null,null,null,null,null,null,null,null,0,0,0,0,0,0,0,0,0,0,null,0,0,0,0,0,0,0,0,0,0]
[null,107,null,null,null,null,null,null,null,1,"Ei",{"$f":"IF(Etusivu!$C$22=\"kyllä\",25.5%,0%)","v":0.255},0,null,null,null,null,null,null,null,0,null,null,null,null,null,null,null,null,null,null,null,null,null,0,0,0,0,0,0,0,0,0,0,null,0,0,0,0,0,0,0,0,0,0]
[null,108,null,null,null,null,null,null,null,1,"Ei",{"$f":"IF(Etusivu!$C$22=\"kyllä\",25.5%,0%)","v":0.255},0,null,null,null,null,null,null,null,0,null,null,null,null,null,null,null,null,null,null,null,null,null,0,0,0,0,0,0,0,0,0,0,null,0,0,0,0,0,0,0,0,0,0]
[null,109,null,null,null,null,null,null,null,1,"Ei",{"$f":"IF(Etusivu!$C$22=\"kyllä\",25.5%,0%)","v":0.255},0,null,null,null,null,null,null,null,0,null,null,null,null,null,null,null,null,null,null,null,null,null,0,0,0,0,0,0,0,0,0,0,null,0,0,0,0,0,0,0,0,0,0]
[null,110,null,null,null,null,null,null,null,1,"Ei",{"$f":"IF(Etusivu!$C$22=\"kyllä\",25.5%,0%)","v":0.255},0,null,null,null,null,null,null,null,0,null,null,null,null,null,null,null,null,null,null,null,null,null,0,0,0,0,0,0,0,0,0,0,null,0,0,0,0,0,0,0,0,0,0]
[null,111,null,null,null,null,null,null,null,1,"Ei",{"$f":"IF(Etusivu!$C$22=\"kyllä\",25.5%,0%)","v":0.255},0,null,null,null,null,null,null,null,0,null,null,null,null,null,null,null,null,null,null,null,null,null,0,0,0,0,0,0,0,0,0,0,null,0,0,0,0,0,0,0,0,0,0]
[null,112,null,null,null,null,null,null,null,1,"Ei",{"$f":"IF(Etusivu!$C$22=\"kyllä\",25.5%,0%)","v":0.255},0,null,null,null,null,null,null,null,0,null,null,null,null,null,null,null,null,null,null,null,null,null,0,0,0,0,0,0,0,0,0,0,null,0,0,0,0,0,0,0,0,0,0]
[null,113,null,null,null,null,null,null,null,1,"Ei",{"$f":"IF(Etusivu!$C$22=\"kyllä\",25.5%,0%)","v":0.255},0,null,null,null,null,null,null,null,0,null,null,null,null,null,null,null,null,null,null,null,null,null,0,0,0,0,0,0,0,0,0,0,null,0,0,0,0,0,0,0,0,0,0]
[null,114,null,null,null,null,null,null,null,1,"Ei",{"$f":"IF(Etusivu!$C$22=\"kyllä\",25.5%,0%)","v":0.255},0,null,null,null,null,null,null,null,0,null,null,null,null,null,null,null,null,null,null,null,null,null,0,0,0,0,0,0,0,0,0,0,null,0,0,0,0,0,0,0,0,0,0]
[null,115,null,null,null,null,null,null,null,1,"Ei",{"$f":"IF(Etusivu!$C$22=\"kyllä\",25.5%,0%)","v":0.255},0,null,null,null,null,null,null,null,0,null,null,null,null,null,null,null,null,null,null,null,null,null,0,0,0,0,0,0,0,0,0,0,null,0,0,0,0,0,0,0,0,0,0]
[null,116,null,null,null,null,null,null,null,1,"Ei",{"$f":"IF(Etusivu!$C$22=\"kyllä\",25.5%,0%)","v":0.255},0,null,null,null,null,null,null,null,0,null,null,null,null,null,null,null,null,null,null,null,null,null,0,0,0,0,0,0,0,0,0,0,null,0,0,0,0,0,0,0,0,0,0]
[null,117,null,null,null,null,null,null,null,1,"Ei",{"$f":"IF(Etusivu!$C$22=\"kyllä\",25.5%,0%)","v":0.255},0,null,null,null,null,null,null,null,0,null,null,null,null,null,null,null,null,null,null,null,null,null,0,0,0,0,0,0,0,0,0,0,null,0,0,0,0,0,0,0,0,0,0]
[null,118,null,null,null,null,null,null,null,1,"Ei",{"$f":"IF(Etusivu!$C$22=\"kyllä\",25.5%,0%)","v":0.255},0,null,null,null,null,null,null,null,0,null,null,null,null,null,null,null,null,null,null,null,null,null,0,0,0,0,0,0,0,0,0,0,null,0,0,0,0,0,0,0,0,0,0]
[null,119,null,null,null,null,null,null,null,1,"Ei",{"$f":"IF(Etusivu!$C$22=\"kyllä\",25.5%,0%)","v":0.255},0,null,null,null,null,null,null,null,0,null,null,null,null,null,null,null,null,null,null,null,null,null,0,0,0,0,0,0,0,0,0,0,null,0,0,0,0,0,0,0,0,0,0]
[null,120,null,null,null,null,null,null,null,1,"Ei",{"$f":"IF(Etusivu!$C$22=\"kyllä\",25.5%,0%)","v":0.255},0,null,null,null,null,null,null,null,0,null,null,null,null,null,null,null,null,null,null,null,null,null,0,0,0,0,0,0,0,0,0,0,null,0,0,0,0,0,0,0,0,0,0]
[null,121,null,null,null,null,null,null,null,1,"Ei",{"$f":"IF(Etusivu!$C$22=\"kyllä\",25.5%,0%)","v":0.255},0,null,null,null,null,null,null,null,0,null,null,null,null,null,null,null,null,null,null,null,null,null,0,0,0,0,0,0,0,0,0,0,null,0,0,0,0,0,0,0,0,0,0]
[null,122,null,null,null,null,null,null,null,1,"Ei",{"$f":"IF(Etusivu!$C$22=\"kyllä\",25.5%,0%)","v":0.255},0,null,null,null,null,null,null,null,0,null,null,null,null,null,null,null,null,null,null,null,null,null,0,0,0,0,0,0,0,0,0,0,null,0,0,0,0,0,0,0,0,0,0]
[null,123,null,null,null,null,null,null,null,1,"Ei",{"$f":"IF(Etusivu!$C$22=\"kyllä\",25.5%,0%)","v":0.255},0,null,null,null,null,null,null,null,0,null,null,null,null,null,null,null,null,null,null,null,null,null,0,0,0,0,0,0,0,0,0,0,null,0,0,0,0,0,0,0,0,0,0]
[null,124,null,null,null,null,null,null,null,1,"Ei",{"$f":"IF(Etusivu!$C$22=\"kyllä\",25.5%,0%)","v":0.255},0,null,null,null,null,null,null,null,0,null,null,null,null,null,null,null,null,null,null,null,null,null,0,0,0,0,0,0,0,0,0,0,null,0,0,0,0,0,0,0,0,0,0]
[null,125,null,null,null,null,null,null,null,1,"Ei",{"$f":"IF(Etusivu!$C$22=\"kyllä\",25.5%,0%)","v":0.255},0,null,null,null,null,null,null,null,0,null,null,null,null,null,null,null,null,null,null,null,null,null,0,0,0,0,0,0,0,0,0,0,null,0,0,0,0,0,0,0,0,0,0]
[null,126,null,null,null,null,null,null,null,1,"Ei",{"$f":"IF(Etusivu!$C$22=\"kyllä\",25.5%,0%)","v":0.255},0,null,null,null,null,null,null,null,0,null,null,null,null,null,null,null,null,null,null,null,null,null,0,0,0,0,0,0,0,0,0,0,null,0,0,0,0,0,0,0,0,0,0]
[null,127,null,null,null,null,null,null,null,1,"Ei",{"$f":"IF(Etusivu!$C$22=\"kyllä\",25.5%,0%)","v":0.255},0,null,null,null,null,null,null,null,0,null,null,null,null,null,null,null,null,null,null,null,null,null,0,0,0,0,0,0,0,0,0,0,null,0,0,0,0,0,0,0,0,0,0]
[null,128,null,null,null,null,null,null,null,1,"Ei",{"$f":"IF(Etusivu!$C$22=\"kyllä\",25.5%,0%)","v":0.255},0,null,null,null,null,null,null,null,0,null,null,null,null,null,null,null,null,null,null,null,null,null,0,0,0,0,0,0,0,0,0,0,null,0,0,0,0,0,0,0,0,0,0]
[null,129,null,null,null,null,null,null,null,1,"Ei",{"$f":"IF(Etusivu!$C$22=\"kyllä\",25.5%,0%)","v":0.255},0,null,null,null,null,null,null,null,0,null,null,null,null,null,null,null,null,null,null,null,null,null,0,0,0,0,0,0,0,0,0,0,null,0,0,0,0,0,0,0,0,0,0]
[null,130,null,null,null,null,null,null,null,1,"Ei",{"$f":"IF(Etusivu!$C$22=\"kyllä\",25.5%,0%)","v":0.255},0,null,null,null,null,null,null,null,0,null,null,null,null,null,null,null,null,null,null,null,null,null,{"$f":"IF($J140=1,IF($K140=\"Ei\",$H140,0),0)","v":0},{"$f":"IF($J140=1,IF($K140=\"Kyllä\",$H140,0),0)","v":0},{"$f":"IF($J140=2,IF($K140=\"Ei\",$H140,0),0)","v":0},{"$f":"IF($J140=2,IF($K140=\"Kyllä\",$H140,0),0)","v":0},{"$f":"IF($J140=3,IF($K140=\"Ei\",$H140,0),0)","v":0},{"$f":"IF($J140=3,IF($K140=\"kyllä\",$H140,0),0)","v":0},{"$f":"IF($J140=4,IF($K140=\"ei\",$H140,0),0)","v":0},{"$f":"IF($J140=4,IF($K140=\"Kyllä\",$H140,0),0)","v":0},{"$f":"IF($J140=5,IF($K140=\"ei\",$H140,0),0)","v":0},{"$f":"IF($J140=5,IF($K140=\"kyllä\",$H140,0),0)","v":0},null,{"$f":"IF($J140=1,IF($K140=\"Ei\",$I140,0),0)","v":0},{"$f":"IF($J140=1,IF($K140=\"Kyllä\",$I140,0),0)","v":0},{"$f":"IF($J140=2,IF($K140=\"Ei\",$I140,0),0)","v":0},{"$f":"IF($J140=2,IF($K140=\"Kyllä\",$I140,0),0)","v":0},{"$f":"IF($J140=3,IF($K140=\"Ei\",$I140,0),0)","v":0},{"$f":"IF($J140=3,IF($K140=\"Kyllä\",$I140,0),0)","v":0},{"$f":"IF($J140=4,IF($K140=\"Ei\",$I140,0),0)","v":0},{"$f":"IF($J140=4,IF($K140=\"Kyllä\",$I140,0),0)","v":0},{"$f":"IF($J140=5,IF($K140=\"Ei\",$I140,0),0)","v":0},{"$f":"IF($J140=5,IF($K140=\"Kyllä\",$I140,0),0)","v":0}]
[null,131,null,null,null,null,null,null,null,1,"Ei",{"$f":"IF(Etusivu!$C$22=\"kyllä\",25.5%,0%)","v":0.255},0,null,null,null,null,null,null,null,0,null,null,null,null,null,null,null,null,null,null,null,null,null,0,0,0,0,0,0,0,0,0,0,null,0,0,0,0,0,0,0,0,0,0]
[null,132,null,null,null,null,null,null,null,1,"Ei",{"$f":"IF(Etusivu!$C$22=\"kyllä\",25.5%,0%)","v":0.255},{"$f":"IF(R142>0,R142*L142,G142*L142+H142*L142+I142*L142+V142*L142)","v":0},null,null,null,null,null,null,null,{"$f":"SUM(G142:I142)+SUM(O142:R142)","v":0},null,null,null,null,null,null,null,null,null,null,null,null,null,0,0,0,0,0,0,0,0,0,0,null,0,0,0,0,0,0,0,0,0,0]
[null,133,null,null,null,null,null,null,null,1,"Ei",{"$f":"IF(Etusivu!$C$22=\"kyllä\",25.5%,0%)","v":0.255},0,null,null,null,null,null,null,null,0,null,null,null,null,null,null,null,null,null,null,null,null,null,0,0,0,0,0,0,0,0,0,0,null,0,0,0,0,0,0,0,0,0,0]
[null,134,null,null,null,null,null,null,null,1,"Ei",{"$f":"IF(Etusivu!$C$22=\"kyllä\",25.5%,0%)","v":0.255},0,null,null,null,null,null,null,null,0,null,null,null,null,null,null,null,null,null,null,null,null,null,0,0,0,0,0,0,0,0,0,0,null,0,0,0,0,0,0,0,0,0,0]
[null,135,null,null,null,null,null,null,null,1,"Ei",{"$f":"IF(Etusivu!$C$22=\"kyllä\",25.5%,0%)","v":0.255},0,null,null,null,null,null,null,null,0,null,null,null,null,null,null,null,null,null,null,null,null,null,0,0,0,0,0,0,0,0,0,0,null,0,0,0,0,0,0,0,0,0,0]
[null,136,null,null,null,null,null,null,null,1,"Ei",{"$f":"IF(Etusivu!$C$22=\"kyllä\",25.5%,0%)","v":0.255},0,null,null,null,null,null,null,null,0,null,null,null,null,null,null,null,null,null,null,null,null,null,0,0,0,0,0,0,0,0,0,0,null,0,0,0,0,0,0,0,0,0,0]
[null,{"$f":"B146+1","v":137},null,null,null,null,null,null,null,1,"Ei",{"$f":"IF(Etusivu!$C$22=\"kyllä\",25.5%,0%)","v":0.255},0,null,null,null,null,null,null,null,0,null,null,null,null,null,null,null,null,null,null,null,null,null,0,0,0,0,0,0,0,0,0,0,null,0,0,0,0,0,0,0,0,0,0]
[null,138,null,null,null,null,null,null,null,1,"Ei",{"$f":"IF(Etusivu!$C$22=\"kyllä\",25.5%,0%)","v":0.255},0,null,null,null,null,null,null,null,0,null,null,null,null,null,null,null,null,null,null,null,null,null,0,0,0,0,0,0,0,0,0,0,null,0,0,0,0,0,0,0,0,0,0]
[null,139,null,null,null,null,null,null,null,1,"Ei",{"$f":"IF(Etusivu!$C$22=\"kyllä\",25.5%,0%)","v":0.255},0,null,null,null,null,null,null,null,0,null,null,null,null,null,null,null,null,null,null,null,null,null,0,0,0,0,0,0,0,0,0,0,null,0,0,0,0,0,0,0,0,0,0]
[null,140,null,null,null,null,null,null,null,1,"Ei",{"$f":"IF(Etusivu!$C$22=\"kyllä\",25.5%,0%)","v":0.255},0,null,null,null,null,null,null,null,0,null,null,null,null,null,null,null,null,null,null,null,null,null,0,0,0,0,0,0,0,0,0,0,null,0,0,0,0,0,0,0,0,0,0]
[null,141,null,null,null,null,null,null,null,1,"Ei",{"$f":"IF(Etusivu!$C$22=\"kyllä\",25.5%,0%)","v":0.255},0,null,null,null,null,null,null,null,0,null,null,null,null,null,null,null,null,null,null,null,null,null,0,0,0,0,0,0,0,0,0,0,null,0,0,0,0,0,0,0,0,0,0]
[null,142,null,null,null,null,null,null,null,1,"Ei",{"$f":"IF(Etusivu!$C$22=\"kyllä\",25.5%,0%)","v":0.255},0,null,null,null,null,null,null,null,0,null,null,null,null,null,null,null,null,null,null,null,null,null,0,0,0,0,0,0,0,0,0,0,null,0,0,0,0,0,0,0,0,0,0]
[null,143,null,null,null,null,null,null,null,1,"Ei",{"$f":"IF(Etusivu!$C$22=\"kyllä\",25.5%,0%)","v":0.255},0,null,null,null,null,null,null,null,0,null,null,null,null,null,null,null,null,null,null,null,null,null,0,0,0,0,0,0,0,0,0,0,null,0,0,0,0,0,0,0,0,0,0]
[null,144,null,null,null,null,null,null,null,1,"Ei",{"$f":"IF(Etusivu!$C$22=\"kyllä\",25.5%,0%)","v":0.255},0,null,null,null,null,null,null,null,0,null,null,null,null,null,null,null,null,null,null,null,null,null,0,0,0,0,0,0,0,0,0,0,null,0,0,0,0,0,0,0,0,0,0]
[null,145,null,null,null,null,null,null,null,1,"Ei",{"$f":"IF(Etusivu!$C$22=\"kyllä\",25.5%,0%)","v":0.255},0,null,null,null,null,null,null,null,0,null,null,null,null,null,null,null,null,null,null,null,null,null,0,0,0,0,0,0,0,0,0,0,null,0,0,0,0,0,0,0,0,0,0]
[null,146,null,null,null,null,null,null,null,1,"Ei",{"$f":"IF(Etusivu!$C$22=\"kyllä\",25.5%,0%)","v":0.255},0,null,null,null,null,null,null,null,0,null,null,null,null,null,null,null,null,null,null,null,null,null,0,0,0,0,0,0,0,0,0,0,null,0,0,0,0,0,0,0,0,0,0]
[null,147,null,null,null,null,null,null,null,1,"Ei",{"$f":"IF(Etusivu!$C$22=\"kyllä\",25.5%,0%)","v":0.255},0,null,null,null,null,null,null,null,0,null,null,null,null,null,null,null,null,null,null,null,null,null,0,0,0,0,0,0,0,0,0,0,null,0,0,0,0,0,0,0,0,0,0]
[null,148,null,null,null,null,null,null,null,1,"Ei",{"$f":"IF(Etusivu!$C$22=\"kyllä\",25.5%,0%)","v":0.255},0,null,null,null,null,null,null,null,0,null,null,null,null,null,null,null,null,null,null,null,null,null,0,0,0,0,0,0,0,0,0,0,null,0,0,0,0,0,0,0,0,0,0]
[null,149,null,null,null,null,null,null,null,1,"Ei",{"$f":"IF(Etusivu!$C$22=\"kyllä\",25.5%,0%)","v":0.255},0,null,null,null,null,null,null,null,0,null,null,null,null,null,null,null,null,null,null,null,null,null,0,0,0,0,0,0,0,0,0,0,null,0,0,0,0,0,0,0,0,0,0]
[null,150,null,null,null,null,null,null,null,1,"Ei",{"$f":"IF(Etusivu!$C$22=\"kyllä\",25.5%,0%)","v":0.255},0,null,null,null,null,null,null,null,0,null,null,null,null,null,null,null,null,null,null,null,null,null,0,0,0,0,0,0,0,0,0,0,null,0,0,0,0,0,0,0,0,0,0]
[null,151,null,null,null,null,null,null,null,1,"Ei",{"$f":"IF(Etusivu!$C$22=\"kyllä\",25.5%,0%)","v":0.255},0,null,null,null,null,null,null,null,0,null,null,null,null,null,null,null,null,null,null,null,null,null,0,0,0,0,0,0,0,0,0,0,null,0,0,0,0,0,0,0,0,0,0]
[null,152,null,null,null,null,null,null,null,1,"Ei",{"$f":"IF(Etusivu!$C$22=\"kyllä\",25.5%,0%)","v":0.255},0,null,null,null,null,null,null,null,0,null,null,null,null,null,null,null,null,null,null,null,null,null,0,0,0,0,0,0,0,0,0,0,null,0,0,0,0,0,0,0,0,0,0]
[null,153,null,null,null,null,null,null,null,1,"Ei",{"$f":"IF(Etusivu!$C$22=\"kyllä\",25.5%,0%)","v":0.255},0,null,null,null,null,null,null,null,0,null,null,null,null,null,null,null,null,null,null,null,null,null,0,0,0,0,0,0,0,0,0,0,null,0,0,0,0,0,0,0,0,0,0]
[null,154,null,null,null,null,null,null,null,1,"Ei",{"$f":"IF(Etusivu!$C$22=\"kyllä\",25.5%,0%)","v":0.255},0,null,null,null,null,null,null,null,0,null,null,null,null,null,null,null,null,null,null,null,null,null,0,0,0,0,0,0,0,0,0,0,null,0,0,0,0,0,0,0,0,0,0]
[null,155,null,null,null,null,null,null,null,1,"Ei",{"$f":"IF(Etusivu!$C$22=\"kyllä\",25.5%,0%)","v":0.255},0,null,null,null,null,null,null,null,0,null,null,null,null,null,null,null,null,null,null,null,null,null,0,0,0,0,0,0,0,0,0,0,null,0,0,0,0,0,0,0,0,0,0]
[null,156,null,null,null,null,null,null,null,1,"Ei",{"$f":"IF(Etusivu!$C$22=\"kyllä\",25.5%,0%)","v":0.255},0,null,null,null,null,null,null,null,0,null,null,null,null,null,null,null,null,null,null,null,null,null,0,0,0,0,0,0,0,0,0,0,null,0,0,0,0,0,0,0,0,0,0]
[null,null,null,null,null,null,null,null,null,null,null,null,null,null,null,null,null,null,null,null,0]

{"sheet":"Oma käyttö","index":3,"n_rows":39,"n_cols":13,"rows_kept":39,"cut":false,"hidden":false,"merged":[[6,5,6,7],[6,8,6,10],[18,12,19,22],[0,1,0,4],[2,1,2,4],[4,11,4,12]]}
[]
[null,{"$f":"Etusivu!C10","v":"Matti Metsänen"}]
[null,{"$f":"Etusivu!C16","v":"123456-7"}]
[]
[null,"OMASTA METSÄSTÄ OTETTU PUUTAVARA"]
[]
[null,null,null,null,null,"Tilat, joilla ei metsävähennysoikeutta",null,null,"Tilat, joilla on metsävähennysoikeus"]
[null,"Määrä\nm3","Arvo\neur/m3 ","Kuvaus käytetystä puusta","KÄYTTÖKOHDE \nValitse käyttökohde luettelosta","3.1 maatalous-toiminnan käyttö","3.2 elinkeino-toiminnan käyttö","3.3 \nyksityis-käyttö","3.1  maatalous-toiminnan käyttö","3.2 \nelinkeino-toinnon\nkäyttö","3.3 \nyksityis-\nkäyttö"]
[null,{"$f":"SUM(B10:B39)","v":0},null,null,null,{"$f":"SUM(F10:F39)","v":0},0,0,0,0,0,{"$f":"SUM(I9:K9)","v":0},"ARVOSTUS"]
[null,null,null,null,"Yksityiskäyttö",{"$f":"IF(E10=\"Maataloustoiminnan käyttö\",B10*C10,\"\")","v":""},{"$f":"IF(E10=\"Elinkeinotoiminnan käyttö\",B10*C10,\"\")","v":""},{"$f":"IF($E10=\"Yksityiskäyttö\",$B10*$C10,\"\")","v":0},{"$f":"IF($E10=\"Maataloustoiminnan käyttö, metsävähennys\",$B10*$C10,\"\")","v":""},{"$f":"IF($E10=\"Elinkeinotoiminnan käyttö, metsävähennys\",$B10*$C10,\"\")","v":""},{"$f":"IF($E10=\"Yksityiskäyttö, metsävähennys\",$B10*$C10,\"\")","v":""},"Maataloustoiminnan käyttö","Maatalouskäyttö: pystykauppa-arvon mukaan"]
[null,null,null,null,null,{"$f":"IF(E11=\"Maataloustoiminnan käyttö\",B11*C11,\"\")","v":""},{"$f":"IF(E11=\"Elinkeinotoiminnan käyttö\",B11*C11,\"\")","v":""},"","","","","Elinkeinotoiminnan käyttö","Elinkeinokäyttö: hankintakauppahinnan mukaan"]
[null,null,null,null,null,{"$f":"IF(E12=\"Maataloustoiminnan käyttö\",B12*C12,\"\")","v":""},{"$f":"IF(E12=\"Elinkeinotoiminnan käyttö\",B12*C12,\"\")","v":""},"","","","","Yksityiskäyttö","Yksityiskäyttö: pystykauppa-arvon mukaan"]
[null,null,null,null,null,{"$f":"IF(E13=\"Maataloustoiminnan käyttö\",B13*C13,\"\")","v":""},{"$f":"IF(E13=\"Elinkeinotoiminnan käyttö\",B13*C13,\"\")","v":""},"","","","","Maataloustoiminnan käyttö, metsävähennys"]
[null,null,null,null,null,"","","","","","","Elinkeinotoiminnan käyttö, metsävähennys","Poikkeukset:"]
[null,null,null,null,null,"","","","","","","Yksityiskäyttö, metsävähennys","Maatalous tai elinkeinokäyttö tuotantorakennuksiin, sovelletaan \"hiljaista kuittausta\". Ei tuloa metsätaloudessa, mutta ei myöskään menoa käyttökohteessa."]
[null,null,null,null,null,"","","","","","",null,"Yksityiskäyttö tarve- ja polttopuuna on verovapaata."]
[null,null,null,null,null,"","","","","",""]
[null,null,null,null,null,"","","","","","",null,"Maataloudessa käytetyn omasta metsästä otetun puun arvo 2024"]
[null,null,null,null,null,"","","","","","",null,"Oman tilan metsästä maatalouden käyttöön otetun puun arvoa vahvistettaessa voidaan muun selvityksen puuttuessa perusteena käyttää seuraavia eri puutavaralajien keskimääräisistä hankintahinnoista johdettuja kantohintoja:"]
[null,null,null,null,null,"","","","","",""]
[null,null,null,null,null,"","","","","","",null,"Mäntytukki 64 €/m3"]
[null,null,null,null,null,"","","","","","",null,"Kuusitukki 68 €/m3"]
[null,null,null,null,null,"","","","","","",null,"Koivutukki 59 €/m3"]
[null,null,null,null,null,"","","","","","",null,"Mäntykuitu 25 €/m3"]
[null,null,null,null,null,"","","","","","",null,"Kuusikuitu 26 €/m3"]
[null,null,null,null,null,"","","","","","",null,"Koivukuitu 26 €/m3"]
[null,null,null,null,null,"","","","","","",null,"Polttohakkeen (rankahake) kantoraha-arvona voidaan käyttää 1,70 €/m3 tai 0,68 €/irto-m3"]
[null,null,null,null,null,"","","","","",""]
[null,null,null,null,null,"","","","","",""]
[null,null,null,null,null,"","","","","",""]
[null,null,null,null,null,"","","","","",""]
[null,null,null,null,null,"","","","","",""]
[null,null,null,null,null,"","","","","",""]
[null,null,null,null,null,"","","","","",""]
[null,null,null,null,null,"","","","","",""]
[null,null,null,null,null,"","","","","",""]
[null,null,null,null,null,"","","","","",""]
[null,null,null,null,null,"","","","","",""]
[null,null,null,null,null,"","","","","",""]

{"sheet":"Hank.työ 1","index":4,"n_rows":196,"n_cols":33,"rows_kept":196,"cut":false,"hidden":false,"merged":[[164,27,165,28],[96,13,97,14],[129,13,130,14],[164,2,165,3],[164,5,165,6],[164,8,165,9],[164,10,165,11],[164,13,165,14],[164,16,165,17],[131,3,131,4],[131,6,131,7],[131,8,131,9],[131,11,131,12],[131,14,131,15],[131,16,131,17],[98,16,98,17],[98,14,98,15],[96,27,97,28],[98,8,98,9],[98,11,98,12],[131,22,131,23],[131,25,131,26],[131,27,131,28],[98,22,98,23],[28,3,28,4],[28,11,28,12],[63,11,63,12],[63,6,63,7],[63,8,63,9],[45,8,45,9],[28,6,28,7],[80,8,80,9],[28,8,28,9],[61,2,62,3],[28,16,28,17],[28,48,28,49],[28,66,28,67],[62,69,62,70],[62,66,62,67],[62,117,62,118],[61,27,62,28],[62,53,62,54],[62,50,62,51],[28,77,28,78],[62,80,62,81],[28,112,28,113],[28,104,28,105],[28,106,28,107],[28,109,28,110],[28,80,28,81],[97,40,97,41],[97,42,97,43],[62,61,62,62],[62,42,62,43],[62,34,62,35],[62,64,62,65],[28,155,28,156],[62,56,62,57],[62,58,62,59],[62,48,62,49],[62,45,62,46],[28,42,28,43],[28,50,28,51],[28,53,28,54],[28,45,28,46],[62,122,62,123],[28,122,28,123],[28,82,28,83],[28,85,28,86],[28,88,28,89],[28,101,28,102],[28,98,28,99],[28,93,28,94],[62,98,62,99],[97,45,97,46],[97,48,97,49],[97,50,97,51],[97,53,97,54],[97,56,97,57],[62,77,62,78],[62,82,62,83],[62,85,62,86],[62,88,62,89],[62,120,62,121],[62,106,62,107],[62,109,62,110],[62,112,62,113],[28,90,28,91],[28,114,28,115],[62,101,62,102],[62,114,62,115],[62,104,62,105],[62,96,62,97],[62,90,62,91],[62,93,62,94],[28,96,28,97],[28,117,28,118],[28,120,28,121],[28,152,28,153],[28,141,28,142],[28,146,28,147],[62,149,62,150],[62,152,62,153],[28,144,28,145],[62,144,62,145],[62,146,62,147],[28,125,28,126],[28,128,28,129],[28,130,28,131],[28,133,28,134],[28,136,28,137],[28,138,28,139],[62,133,62,134],[62,130,62,131],[28,149,28,150],[62,125,62,126],[62,138,62,139],[62,141,62,142],[62,128,62,129],[62,136,62,137],[16,21,16,28],[97,32,97,33],[97,34,97,35],[97,37,97,38],[59,21,60,28],[94,21,95,28],[28,34,28,35],[28,37,28,38],[98,27,98,28],[62,32,62,33],[28,32,28,33],[129,27,130,28],[63,27,63,28],[63,22,63,23],[63,25,63,26],[2,1,2,4],[26,16,27,17],[26,8,27,9],[14,17,15,17],[26,10,27,11],[6,1,7,1],[6,6,7,8],[24,21,25,28],[18,21,21,28],[26,27,27,28],[26,13,27,14],[5,21,5,28],[8,21,9,28],[26,2,27,3],[26,5,27,6],[23,1,24,1],[6,15,7,17],[8,15,9,16],[10,15,11,16],[12,15,13,16],[8,17,9,17],[10,17,11,17],[12,17,13,17],[61,13,62,14],[28,74,28,75],[28,56,28,57],[28,64,28,65],[28,22,28,23],[28,25,28,26],[28,27,28,28],[28,58,28,59],[28,61,28,62],[28,14,28,15],[28,69,28,70],[62,74,62,75],[62,72,62,73],[62,37,62,38],[62,40,62,41],[28,40,28,41],[28,72,28,73],[26,21,27,22],[26,24,27,25],[23,20,24,20],[45,16,45,17],[97,138,97,139],[97,141,97,142],[97,144,97,145],[97,146,97,147],[97,149,97,150],[97,152,97,153],[115,8,115,9],[115,16,115,17],[97,112,97,113],[97,114,97,115],[97,117,97,118],[97,120,97,121],[97,122,97,123],[97,125,97,126],[97,128,97,129],[97,130,97,131],[97,133,97,134],[97,88,97,89],[97,90,97,91],[97,93,97,94],[97,96,97,97],[97,98,97,99],[97,101,97,102],[97,58,97,59],[97,136,97,137],[97,61,97,62],[97,104,97,105],[97,106,97,107],[97,109,97,110],[97,64,97,65],[97,66,97,67],[97,69,97,70],[97,72,97,73],[97,74,97,75],[97,77,97,78],[97,80,97,81],[97,82,97,83],[97,85,97,86],[131,32,131,33],[131,34,131,35],[131,37,131,38],[131,40,131,41],[131,42,131,43],[131,45,131,46],[131,48,131,49],[131,50,131,51],[131,53,131,54],[131,56,131,57],[131,58,131,59],[131,61,131,62],[131,64,131,65],[131,66,131,67],[131,69,131,70],[131,72,131,73],[131,74,131,75],[131,77,131,78],[131,125,131,126],[131,80,131,81],[131,82,131,83],[131,85,131,86],[131,88,131,89],[131,90,131,91],[131,93,131,94],[131,96,131,97],[131,98,131,99],[131,101,131,102],[161,1,162,1],[183,8,183,9],[183,16,183,17],[131,152,131,153],[131,155,131,156],[148,8,148,9],[148,16,148,17],[131,128,131,129],[131,130,131,131],[131,133,131,134],[131,136,131,137],[131,138,131,139],[131,141,131,142],[131,144,131,145],[131,146,131,147],[131,149,131,150],[131,104,131,105],[131,106,131,107],[131,109,131,110],[131,112,131,113],[131,114,131,115],[131,117,131,118],[131,120,131,121],[131,122,131,123],[58,1,59,1],[58,20,59,20],[93,1,94,1],[93,20,94,20],[126,1,127,1],[126,20,127,20],[127,21,128,28],[96,2,97,3],[96,5,97,6],[63,14,63,15],[96,8,97,9],[96,10,97,11],[96,16,97,17],[61,5,62,6],[61,8,62,9],[61,10,62,11],[61,16,62,17],[80,16,80,17],[98,3,98,4],[98,6,98,7],[98,25,98,26],[63,16,63,17],[63,3,63,4],[166,3,166,4],[166,6,166,7],[166,8,166,9],[166,11,166,12],[166,14,166,15],[166,16,166,17],[61,21,62,22],[61,24,62,25],[96,21,97,22],[96,24,97,25],[129,21,130,22],[129,24,130,25],[162,21,163,28],[164,21,165,22],[164,24,165,25],[166,22,166,23],[166,25,166,26],[166,27,166,28],[161,20,162,20],[129,2,130,3],[129,5,130,6],[129,8,130,9],[129,10,130,11],[129,16,130,17]]}
[]
[null,{"$f":"Etusivu!C10","v":"Matti Metsänen"}]
[null,{"$f":"Etusivu!C16","v":"123456-7"}]
[]
[null,"HANKINTATYÖN ARVON LASKENTA",null,null,null,null,null,null,null,null,null,null,null,null,null,"ohje","#### - ohje"]
[null,"Normaali hankintatyö (1.2.)",null,null,null,null,null,null,null,null,null,null,null,null,null,null,null,null,null,null,null,{"$f":"CONCATENATE(\"Verovuodelta \",Etusivu!B6-1,\" uinumaan jätetyn hankintatyön arvo\")","v":"Verovuodelta 2024 uinumaan jätetyn hankintatyön arvo"}]
[null,"TAKSAT",null,null,null,null,"YHTEENVETO",null,null,null,null,null,null,null,null,"SIVUN ASETUKSET",null,null,null,null,null,"Hankintatyön arvo, €",null,{"$f":"SUM(Y7:AC7)","v":0},null,null,0,0,0]
[null,null,"Valmistus","Kuljetus","Kulj. Konekust.",null,null,null,null,"Maatila 1","Maatila 2","Maatila 3","Maatila 4","Maatila 5"]
[null,"Mäntykuitu",14.76,2.59,{"$f":"IF(R$9=\"kyllä\",F9,0)","v":0},3.88,"Hankintakauppatulot maatilalta",null,null,{"$f":"D25+L25","v":0},{"$f":"D60+L60","v":0},{"$f":"D95+L95","v":0},{"$f":"D128+L128","v":0},{"$f":"D163+L163","v":0},null,"Kuljetuksen konekustan-\nnukset käytössä",null,"Ei",null,null,null,{"$f":"CONCATENATE(\"Verovuoden \",Etusivu!B$6,\" uinumaan jäävä hankintatyö\")","v":"Verovuoden 2025 uinumaan jäävä hankintatyö"},null,null,null,null,null,null,null,null,null,null,"Ei"]
[null,"Kuusikuitu",15.44,2.75,0,4.12,"Puutavaran verollinen arvo",null,null,{"$f":"IF(C52>=0,C52,\"- arvo tarkista\")","v":0},{"$f":"IF(C87>=0,C87,\"- arvo tarkista\")","v":0},{"$f":"IF(C122>=0,C122,\"- arvo tarkista\")","v":0},{"$f":"IF(C155>=0,C155,\"- arvo tarkista\")","v":0},{"$f":"IF(C190>=0,C190,\"- arvo tarkista\")","v":0},null,null,null,null,null,null,null,null,null,null,null,null,null,null,null,null,null,null,"Kyllä"]
[null,"Koivukuitu",13.65,3.02,0,4.54,"Konekustannusosuus (vuosimenoa)",null,null,{"$f":"+C49+AC49","v":0},{"$f":"+C84+AC84","v":0},{"$f":"+C119+AC119","v":0},{"$f":"+C152+AC152","v":0},{"$f":"+C187+AC187","v":0},null,"Näytä uinuvat hankintatyöt",null,"Ei",null,null,null,null,null,null,"Maatila 1","Maatila 2","Maatila 3","Maatila 4","Maatila 5"]
[null,"Mäntytukki",6.39,2.5099999999999998,0,3.77,"Valmistettu määrä yhteensä",null,null,{"$f":"+C50+AC50","v":0},{"$f":"+C85+AC85","v":0},{"$f":"+C120+AC120","v":0},{"$f":"+C153+AC153","v":0},{"$f":"+C188+AC188","v":0},null,null,null,null,null,null,null,"Valmistettu määrä yhteensä, m3",null,null,{"$f":"AC50","v":0},{"$f":"AC85","v":0},{"$f":"AC120","v":0},{"$f":"AC153","v":0},{"$f":"AC188","v":0}]
[null,"Kuusitukki",8.25,2.54,0,3.8,"Valmistuksen arvo yhteensä",null,null,{"$f":"+C47","v":0},{"$f":"+C82","v":0},{"$f":"+C117","v":0},{"$f":"+C150","v":0},{"$f":"+C185","v":0},null,"Näytettävien maatilojen määrä ",null,1,null,null,null,"Valmistuksen arvo yhteensä, €",null,null,{"$f":"AC47","v":0},{"$f":"AC82","v":0},{"$f":"AC117","v":0},{"$f":"AC150","v":0},{"$f":"AC185","v":0}]
[null,"Koivutukki",6.09,2.88,0,4.32,"Valmistuksen verollinen arvo (125 m3 verovapaata)",null,null,{"$f":"IF(J12+'Hank.työ 2'!J12=0,0,IF((J12+'Hank.työ 2'!J12-125)/(J12+'Hank.työ 2'!J12)*J13>0,(J12+'Hank.työ 2'!J12-125)/(J12+'Hank.työ 2'!J12)*J13,0))","v":0},{"$f":"IF(K12+'Hank.työ 2'!K12=0,0,IF((K12+'Hank.työ 2'!K12-125)/(K12+'Hank.työ 2'!K12)*K13>0,(K12+'Hank.työ 2'!K12-125)/(K12+'Hank.työ 2'!K12)*K13,0))","v":0},{"$f":"IF(L12+'Hank.työ 2'!L12=0,0,IF((L12+'Hank.työ 2'!L12-125)/(L12+'Hank.työ 2'!L12)*L13>0,(L12+'Hank.työ 2'!L12-125)/(L12+'Hank.työ 2'!L12)*L13,0))","v":0},{"$f":"IF(M12+'Hank.työ 2'!M12=0,0,IF((M12+'Hank.työ 2'!M12-125)/(M12+'Hank.työ 2'!M12)*M13>0,(M12+'Hank.työ 2'!M12-125)/(M12+'Hank.työ 2'!M12)*M13,0))","v":0},{"$f":"IF(N12+'Hank.työ 2'!N12=0,0,IF((N12+'Hank.työ 2'!N12-125)/(N12+'Hank.työ 2'!N12)*N13>0,(N12+'Hank.työ 2'!N12-125)/(N12+'Hank.työ 2'!N12)*N13,0))","v":0},null,null,null,null,null,null,null,"Kuljetuksen määrä yhteensä, m3",null,null,{"$f":"AC51","v":0},{"$f":"AC86","v":0},{"$f":"AC121","v":0},{"$f":"AC154","v":0},{"$f":"AC189","v":0}]
[null,"Lahopuu",null,null,0,null,"Kuljetuksen määrä yhteensä",null,null,{"$f":"+C51+AC51","v":0},{"$f":"+C86+AC86","v":0},{"$f":"+C121+AC121","v":0},{"$f":"+C154+AC154","v":0},{"$f":"+C189+AC189","v":0},"Näytettävien maatilojen määrä tulee automaattisesti",null,null,"",null,null,null,"kuljetuksen arvo yhteensä, €",null,null,{"$f":"AC48","v":0},{"$f":"AC83","v":0},{"$f":"AC118","v":0},{"$f":"AC151","v":0},{"$f":"AC186","v":0}]
[null,"Erikoispuu",null,null,0,null,"kuljetuksen arvo yhteensä",null,null,{"$f":"+C48","v":0},{"$f":"+C83","v":0},{"$f":"+C118","v":0},{"$f":"+C151","v":0},{"$f":"+C186","v":0},null,null,null,null,null,null,null,"HANKINTATYÖN ARVO YHTEENSÄ, €",null,null,{"$f":"Y13+Y15","v":0},{"$f":"Z13+Z15","v":0},{"$f":"AA13+AA15","v":0},{"$f":"AB13+AB15","v":0},{"$f":"AC13+AC15","v":0}]
[null,"Energiapuu (kokopuu)",9.1,4.72,0,7.07,"Kuljetuksen verollinen arvo (125 m3 verovapaata)",null,null,{"$f":"IF(J15+'Hank.työ 2'!J15=0,0,IF((J15+'Hank.työ 2'!J15-125)/(J15+'Hank.työ 2'!J15)*J16>0,(J15+'Hank.työ 2'!J15-125)/(J15+'Hank.työ 2'!J15)*J16,0))","v":0},{"$f":"IF(K15+'Hank.työ 2'!K15=0,0,IF((K15+'Hank.työ 2'!K15-125)/(K15+'Hank.työ 2'!K15)*K16>0,(K15+'Hank.työ 2'!K15-125)/(K15+'Hank.työ 2'!K15)*K16,0))","v":0},{"$f":"IF(L15+'Hank.työ 2'!L15=0,0,IF((L15+'Hank.työ 2'!L15-125)/(L15+'Hank.työ 2'!L15)*L16>0,(L15+'Hank.työ 2'!L15-125)/(L15+'Hank.työ 2'!L15)*L16,0))","v":0},{"$f":"IF(M15+'Hank.työ 2'!M15=0,0,IF((M15+'Hank.työ 2'!M15-125)/(M15+'Hank.työ 2'!M15)*M16>0,(M15+'Hank.työ 2'!M15-125)/(M15+'Hank.työ 2'!M15)*M16,0))","v":0},{"$f":"IF(N15+'Hank.työ 2'!N15=0,0,IF((N15+'Hank.työ 2'!N15-125)/(N15+'Hank.työ 2'!N15)*N16>0,(N15+'Hank.työ 2'!N15-125)/(N15+'Hank.työ 2'!N15)*N16,0))","v":0},null,null,null,null,null,null,null,"Siirrä nämä alarivin summat seuraavan vuoden verotukseen uinumaan jätettyinä hankintatyön arvoina."]
[null,"Halot ja klapit (tukkumyynti)",30.94,3.02,0,4.54,"Hankintatyön arvo yhteensä",null,null,{"$f":"J13+J16","v":0},{"$f":"K13+K16","v":0},{"$f":"L13+L16","v":0},{"$f":"M13+M16","v":0},{"$f":"N13+N16","v":0}]
[null,"Haketus",4.83,null,0,null,"Hankintatyön verollinen arvo yhteensä",null,null,{"$f":"(J14+J17)","v":0},{"$f":"(K14+K17)","v":0},{"$f":"(L14+L17)","v":0},{"$f":"(M14+M17)","v":0},{"$f":"(N14+N17)","v":0},null,null,null,null,null,null,null,"TÄHÄN ALLE VAIN NE KUUTIOMÄÄRÄT JOTKA ON TEHTY VEROVUONNA, \nMUTTA MYYDÄÄN TULEVANA VEROVUONNA\nSiirrä seuraavan vuoden veroilmoitukseen hankintatyön arvoon (lomake 2C kohta 2.1)"]
[null,"Hake ",null,3.02,{"$f":"IF(R$9=\"kyllä\",F20,0)","v":0},4.54,"Hakkuumäärä yht. verovuonna (sis. hank.työ 1 ja 2)",null,null,{"$f":"J12+'Hank.työ 2'!J12","v":0},{"$f":"K12+'Hank.työ 2'!K12","v":0},{"$f":"L12+'Hank.työ 2'!L12","v":0},{"$f":"M12+'Hank.työ 2'!M12","v":0},{"$f":"N12+'Hank.työ 2'!N12","v":0}]
[null,"Joulupuut (tukkumyynti)",null,null,{"$f":"IF(R$9=\"kyllä\",F21,0)","v":0},null,"Ajomäärä yht verovuonna (sis. hank.työ 1 ja 2)",null,null,{"$f":"J15+'Hank.työ 2'!J15","v":0},{"$f":"K15+'Hank.työ 2'!K15","v":0},{"$f":"L15+'Hank.työ 2'!L15","v":0},{"$f":"M15+'Hank.työ 2'!M15","v":0},{"$f":"N15+'Hank.työ 2'!N15","v":0}]
[]
[]
[null,"MAATILA 1","Ei metsävähennysoikeutta",null,null,null,null,null,null,null,"Metsävähennysoikeus",null,null,null,null,null,null,null,null,null,"MAATILA 1"]
[null,null,"Hankintatyötulot",{"$f":"Tulot!AJ9","v":0},null,null,null,null,null,null,"Hankintatyötulot",{"$f":"Tulot!AK9","v":0},null,null,null,null,null,null,null,null,null,"Uinumaan jäävä hakkuumäärä"]
[]
[null,null,"HAKKUU",null,null,"KULJETUS",null,null,"KONEKULJETUS",null,"HAKKUU",null,null,"KULJETUS",null,null,"KONEKULJETUS",null,null,null,null,"HAKKUU",null,null,"KULJETUS",null,null,"KONEKULJETUS"]
[]
[null,null,null,"Valmistuksen arvo",null,"Määrä","Kuljetustyön arvo",null,"Konekustannus",null,null,"Valmistuksen arvo",null,"Määrä","Kuljetustyön arvo",null,"Konekustannus",null,null,null,null,null,"valmistuksen arvo",null,"Määrä","Kuljetustyön arvo",null,"Konekustannus"]
[null,null,"m3","€/m3","€","m3","€/m3"," \n€","€/m3","\n€","m3","€/m3","€","m3","€/m3"," \n€","€/m3","\n€",null,null,null,"m3","€/m3","€","m3","€/m3"," \n€","€/m3","\n€"]
[null,"Mäntykuitu",null,{"$f":"$C$9","v":14.76},{"$f":"C31*D31","v":0},null,{"$f":"      $D$9","v":2.59},{"$f":"F31*G31","v":0},{"$f":"$E$9","v":0},{"$f":"I31*F31","v":0},null,{"$f":"$C$9","v":14.76},{"$f":"K31*L31","v":0},0,{"$f":"      $D$9","v":2.59},{"$f":"N31*O31","v":0},{"$f":"$E$9","v":0},{"$f":"Q31*N31","v":0},null,null,"Mäntykuitu",null,{"$f":"$C$9","v":14.76},{"$f":"V31*W31","v":0},null,{"$f":"      $D$9","v":2.59},{"$f":"Y31*Z31","v":0},{"$f":"$E$9","v":0},{"$f":"AB31*Y31","v":0}]
[null,"Kuusikuitu",null,{"$f":"$C$10","v":15.44},0,null,{"$f":"      $D$10","v":2.75},{"$f":"F32*G32","v":0},{"$f":"$E$10","v":0},{"$f":"I32*F32","v":0},null,{"$f":"$C$10","v":15.44},0,null,{"$f":"      $D$10","v":2.75},0,{"$f":"$E$10","v":0},{"$f":"Q32*N32","v":0},null,null,"Kuusikuitu",null,{"$f":"$C$10","v":15.44},0,null,{"$f":"      $D$10","v":2.75},0,{"$f":"$E$10","v":0},{"$f":"AB32*Y32","v":0}]
[null,"Koivukuitu",null,{"$f":"$C$11","v":13.65},0,0,{"$f":"      $D$11","v":3.02},0,{"$f":"$E$11","v":0},0,null,{"$f":"$C$11","v":13.65},0,null,{"$f":"      $D$11","v":3.02},0,{"$f":"$E$11","v":0},0,null,null,"Koivukuitu",null,{"$f":"$C$11","v":13.65},0,0,{"$f":"      $D$11","v":3.02},0,{"$f":"$E$11","v":0},0]
[null,"Mäntytukki",null,{"$f":"$C$12","v":6.39},0,0,{"$f":"      $D$12","v":2.5099999999999998},0,{"$f":"$E$12","v":0},0,null,{"$f":"$C$12","v":6.39},0,null,{"$f":"      $D$12","v":2.5099999999999998},0,{"$f":"$E$12","v":0},0,null,null,"Mäntytukki",0,{"$f":"$C$12","v":6.39},0,0,{"$f":"      $D$12","v":2.5099999999999998},0,{"$f":"$E$12","v":0},0]
[null,"Kuusitukki",null,{"$f":"$C$13","v":8.25},0,0,{"$f":"      $D$13","v":2.54},0,{"$f":"$E$13","v":0},0,null,{"$f":"$C$13","v":8.25},0,null,{"$f":"      $D$13","v":2.54},0,{"$f":"$E$13","v":0},0,null,null,"Kuusitukki",null,{"$f":"$C$13","v":8.25},0,0,{"$f":"      $D$13","v":2.54},0,{"$f":"$E$13","v":0},0]
[null,"Koivutukki",null,{"$f":"$C$14","v":6.09},0,0,{"$f":"      $D$14","v":2.88},0,{"$f":"$E$14","v":0},0,null,{"$f":"$C$14","v":6.09},0,null,{"$f":"      $D$14","v":2.88},0,{"$f":"$E$14","v":0},0,null,null,"Koivutukki",0,{"$f":"$C$14","v":6.09},0,0,{"$f":"      $D$14","v":2.88},0,{"$f":"$E$14","v":0},0]
[null,"Lahopuu",null,{"$f":"$C$15","v":0},0,0,{"$f":"      $D$15","v":0},0,{"$f":"$E$15","v":0},0,null,{"$f":"$C$15","v":0},0,null,{"$f":"      $D$15","v":0},0,{"$f":"$E$15","v":0},0,null,null,"Lahopuu",0,{"$f":"$C$15","v":0},0,0,{"$f":"      $D$15","v":0},0,{"$f":"$E$15","v":0},0]
[null,"Erikoispuu",null,{"$f":"$C$16","v":0},{"$f":"C38*D38","v":0},0,{"$f":"      $D$16","v":0},0,{"$f":"$E$16","v":0},{"$f":"I38*F38","v":0},null,{"$f":"$C$16","v":0},{"$f":"K38*L38","v":0},null,{"$f":"      $D$16","v":0},{"$f":"N38*O38","v":0},{"$f":"$E$16","v":0},{"$f":"Q38*N38","v":0},null,null,"Erikoispuu",0,{"$f":"$C$16","v":0},{"$f":"V38*W38","v":0},0,{"$f":"      $D$16","v":0},{"$f":"Y38*Z38","v":0},{"$f":"$E$16","v":0},{"$f":"AB38*Y38","v":0}]
[null,"Energiapuu (kokopuu)",null,{"$f":"$C$17","v":9.1},{"$f":"C39*D39","v":0},0,{"$f":"      $D$17","v":4.72},0,{"$f":"$E$17","v":0},{"$f":"I39*F39","v":0},null,{"$f":"$C$17","v":9.1},{"$f":"K39*L39","v":0},null,{"$f":"      $D$17","v":4.72},{"$f":"N39*O39","v":0},{"$f":"$E$17","v":0},{"$f":"Q39*N39","v":0},null,null,"Energiapuu (kokopuu)",0,{"$f":"$C$17","v":9.1},{"$f":"V39*W39","v":0},0,{"$f":"      $D$17","v":4.72},{"$f":"Y39*Z39","v":0},{"$f":"$E$17","v":0},{"$f":"AB39*Y39","v":0}]
[null,"Halot ja klapit (tukkumyynti)",null,{"$f":"$C$18","v":30.94},{"$f":"C40*D40","v":0},0,{"$f":"      $D$18","v":3.02},0,{"$f":"$E$18","v":0},{"$f":"I40*F40","v":0},null,{"$f":"$C$18","v":30.94},{"$f":"K40*L40","v":0},null,{"$f":"      $D$18","v":3.02},{"$f":"N40*O40","v":0},{"$f":"$E$18","v":0},{"$f":"Q40*N40","v":0},null,null,"Halot ja klapit (tukkumyynti)",0,{"$f":"$C$18","v":30.94},{"$f":"V40*W40","v":0},0,{"$f":"      $D$18","v":3.02},{"$f":"Y40*Z40","v":0},{"$f":"$E$18","v":0},{"$f":"AB40*Y40","v":0}]
[null,"Haketus",null,{"$f":"$C$19","v":4.83},{"$f":"C41*D41","v":0},0," - "," -",{"$f":"$E$19","v":0},{"$f":"I41*F41","v":0},null,{"$f":"$C$19","v":4.83},{"$f":"K41*L41","v":0},null," - "," - ",{"$f":"$E$19","v":0},{"$f":"Q41*N41","v":0},null,null,"Haketus",0,{"$f":"$C$19","v":4.83},{"$f":"V41*W41","v":0},0," - "," - ",{"$f":"$E$19","v":0},{"$f":"AB41*Y41","v":0}]
[null,"Hake ",null," - "," - ",0,{"$f":"      $D$20","v":3.02},0,{"$f":"$E$20","v":0},{"$f":"I42*F42","v":0},null," - "," - ",null,{"$f":"      $D$20","v":3.02},{"$f":"N42*O42","v":0},{"$f":"$E$20","v":0},{"$f":"Q42*N42","v":0},null,null,"Hake ",0," - "," - ",0,{"$f":"      $D$20","v":3.02},{"$f":"Y42*Z42","v":0},{"$f":"$E$20","v":0},{"$f":"AB42*Y42","v":0}]
[null,"Joulupuut (tukkumyynti)",null,{"$f":"$C$21","v":0},{"$f":"C43*D43","v":0},null,{"$f":"$D$21","v":0},null,{"$f":"$E$21","v":0},null,null,{"$f":"$C$21","v":0},{"$f":"K43*L43","v":0},null,{"$f":"$D$21","v":0},null,{"$f":"$E$21","v":0},null,null,null,"Joulupuut (tukkumyynti)",null,{"$f":"$C$21","v":0},null,null,{"$f":"$D$21","v":0},null,{"$f":"$E$21","v":0}]
[null,"Yhteensä",{"$f":"SUM(C31:C43)","v":0},null,{"$f":"SUM(E31:E43)","v":0},{"$f":"SUM(F31:F43)","v":0},null,{"$f":"SUM(H31:H43)","v":0},null,{"$f":"SUM(J31:J43)","v":0},{"$f":"SUM(K31:K43)","v":0},null,{"$f":"SUM(M31:M43)","v":0},{"$f":"SUM(N31:N43)","v":0},null,{"$f":"SUM(P31:P43)","v":0},null,{"$f":"SUM(R31:R43)","v":0},null,null,"Yhteensä",{"$f":"SUM(V31:V43)","v":0},null,{"$f":"SUM(X31:X43)","v":0},{"$f":"SUM(Y31:Y43)","v":0},null,{"$f":"SUM(AA31:AA43)","v":0},null,{"$f":"SUM(AC31:AC43)","v":0}]
[]
[null,null,"YHTEENSÄ",null,null,null,null,null,"EI METSÄVÄHENNYSTÄ",null,null,null,null,null,null,null,"METSÄVÄHENNYSOIKEUS"]
[null,"Hakkuutyön arvo",{"$f":"J47+R47","v":0},null,null,null,null,null,"Hakkuutyön arvo",{"$f":"E44","v":0},null,null,null,null,null,null,"Hakkuutyön arvo",{"$f":"M44","v":0},null,null,null,null,null,null,null,null,null,"Hakkuutyön arvo",{"$f":"X44","v":0}]
[null,"Kuljetuksen arvo",0,null,null,null,null,null,"Kuljetuksen arvo",{"$f":"H44","v":0},null,null,null,null,null,null,"Kuljetuksen arvo",{"$f":"P44","v":0},null,null,null,null,null,null,null,null,null,"Kuljetuksen arvo",{"$f":"AA44","v":0}]
[null,"Konekustannus (muuta vuosimenoa)",{"$f":"J49+R49","v":0},null,null,null,null,null,"Konekustannus",{"$f":"J44","v":0},null,null,null,null,null,null,"Konekustannus",{"$f":"R44","v":0},null,null,null,null,null,null,null,null,null,"Konekustannus",{"$f":"AC44","v":0}]
[null,"Hakkuun määrä yhteensä",0,null,null,null,null,null,"Hakkuun määrä",{"$f":"C44","v":0},null,null,null,null,null,null,"Hakkuun määrä",{"$f":"K44","v":0},null,null,null,null,null,null,null,null,null,"Hakkuun määrä",{"$f":"V44","v":0}]
[null,"Kuljetuksen määrä yhteensä",0,null,null,null,null,null,"Kuljetuksen määrä",{"$f":"F44","v":0},null,null,null,null,null,null,"Kuljetuksen määrä",{"$f":"N44","v":0},null,null,null,null,null,null,null,null,null,"Kuljetuksen määrä",{"$f":"Y44","v":0}]
[null,"Puutavaran verollinen arvo",0,null,null,null,null,null,"Puutavaran verollinen arvo",{"$f":"(D25-J47-J48-J49)","v":0},null,null,null,null,null,null,"Metsävähennykseen oikeuttava osa (verollinen osa)",{"$f":"(L25-R47-R48-R49)","v":0}]
[]
[]
[null,null,"Hakattu määrä yhteensä",null,{"$f":"C50","v":0}]
[null,null,"Kuljetettu määrä yhteensä",null,{"$f":"C51","v":0}]
[null,"Tarkistus:",{"$f":"IF(E56>E55,\"Kuljetettu määrä on valmistettua määrää suurempi\",IF(E56=E55,\"Valmistettu ja kuljetettu määrä yhtäsuuret\",\"Valmistettu määrä on kuljetettua määrää isompi\"))","v":"Valmistettu ja kuljetettu määrä yhtäsuuret"}]
[]
[null,"MAATILA 2","Ei metsävähennysoikeutta",null,null,null,null,null,null,null,"Metsävähennysoikeus",null,null,null,null,null,null,null,null,null,"MAATILA 2"]
[null,null,"Hankintatyötulot",{"$f":"Tulot!AL9","v":0},null,null,null,null,null,null,"Hankintatyötulot",{"$f":"Tulot!AM9","v":0},null,null,null,null,null,null,null,null,null,"Uinumaan jäävä hakkuumäärä"]
[]
[null,null,"HAKKUU",null,null,"KULJETUS",null,null,"KONEKULJETUS",null,"HAKKUU",null,null,"KULJETUS",null,null,"KONEKULJETUS",null,null,null,null,"HAKKUU",null,null,"KULJETUS",null,null,"KONEKULJETUS"]
[]
[null,null,null,"Valmistuksen arvo",null,"Määrä","Kuljetustyön arvo",null,"Konekustannus",null,null,"Valmistuksen arvo",null,"Määrä","Kuljetustyön arvo",null,"Konekustannus",null,null,null,null,null,"valmistuksen arvo",null,"Määrä","Kuljetustyön arvo",null,"Konekustannus"]
[null,null,"m3","€/m3","€","m3","€/m3"," \n€","€/m3","\n€","m3","€/m3","€","m3","€/m3"," \n€","€/m3","\n€",null,null,null,"m3","€/m3","€","m3","€/m3"," \n€","€/m3","\n€"]
[null,"Mäntykuitu",null,{"$f":"$C$9","v":14.76},{"$f":"C66*D66","v":0},null,{"$f":"      $D$9","v":2.59},{"$f":"F66*G66","v":0},{"$f":"$E$9","v":0},{"$f":"I66*F66","v":0},null,{"$f":"$C$9","v":14.76},{"$f":"K66*L66","v":0},0,{"$f":"      $D$9","v":2.59},{"$f":"N66*O66","v":0},{"$f":"$E$9","v":0},{"$f":"Q66*N66","v":0},null,null,"Mäntykuitu",null,{"$f":"$C$9","v":14.76},{"$f":"V66*W66","v":0},null,{"$f":"      $D$9","v":2.59},{"$f":"Y66*Z66","v":0},{"$f":"$E$9","v":0},{"$f":"AB66*Y66","v":0}]
[null,"Kuusikuitu",null,{"$f":"$C$10","v":15.44},0,null,{"$f":"      $D$10","v":2.75},{"$f":"F67*G67","v":0},{"$f":"$E$10","v":0},{"$f":"I67*F67","v":0},0,{"$f":"$C$10","v":15.44},0,0,{"$f":"      $D$10","v":2.75},0,{"$f":"$E$10","v":0},{"$f":"Q67*N67","v":0},null,null,"Kuusikuitu",null,{"$f":"$C$10","v":15.44},0,null,{"$f":"      $D$10","v":2.75},0,{"$f":"$E$10","v":0},{"$f":"AB67*Y67","v":0}]
[null,"Koivukuitu",null,{"$f":"$C$11","v":13.65},0,0,{"$f":"      $D$11","v":3.02},0,{"$f":"$E$11","v":0},0,null,{"$f":"$C$11","v":13.65},0,null,{"$f":"      $D$11","v":3.02},0,{"$f":"$E$11","v":0},0,null,null,"Koivukuitu",null,{"$f":"$C$11","v":13.65},0,0,{"$f":"      $D$11","v":3.02},0,{"$f":"$E$11","v":0},0]
[null,"Mäntytukki",null,{"$f":"$C$12","v":6.39},0,0,{"$f":"      $D$12","v":2.5099999999999998},0,{"$f":"$E$12","v":0},0,0,{"$f":"$C$12","v":6.39},0,0,{"$f":"      $D$12","v":2.5099999999999998},0,{"$f":"$E$12","v":0},0,null,null,"Mäntytukki",0,{"$f":"$C$12","v":6.39},0,0,{"$f":"      $D$12","v":2.5099999999999998},0,{"$f":"$E$12","v":0},0]
[null,"Kuusitukki",0,{"$f":"$C$13","v":8.25},0,null,{"$f":"      $D$13","v":2.54},0,{"$f":"$E$13","v":0},0,0,{"$f":"$C$13","v":8.25},0,0,{"$f":"      $D$13","v":2.54},0,{"$f":"$E$13","v":0},0,null,null,"Kuusitukki",null,{"$f":"$C$13","v":8.25},0,0,{"$f":"      $D$13","v":2.54},0,{"$f":"$E$13","v":0},0]
[null,"Koivutukki",null,{"$f":"$C$14","v":6.09},0,null,{"$f":"      $D$14","v":2.88},0,{"$f":"$E$14","v":0},0,0,{"$f":"$C$14","v":6.09},0,0,{"$f":"      $D$14","v":2.88},0,{"$f":"$E$14","v":0},0,null,null,"Koivutukki",0,{"$f":"$C$14","v":6.09},0,0,{"$f":"      $D$14","v":2.88},0,{"$f":"$E$14","v":0},0]
[null,"Lahopuu",0,{"$f":"$C$15","v":0},0,0,{"$f":"      $D$15","v":0},0,{"$f":"$E$15","v":0},0,0,{"$f":"$C$15","v":0},0,0,{"$f":"      $D$15","v":0},0,{"$f":"$E$15","v":0},0,null,null,"Lahopuu",0,{"$f":"$C$15","v":0},0,0,{"$f":"      $D$15","v":0},0,{"$f":"$E$15","v":0},0]
[null,"Erikoispuu",0,{"$f":"$C$16","v":0},{"$f":"C73*D73","v":0},0,{"$f":"      $D$16","v":0},0,{"$f":"$E$16","v":0},{"$f":"I73*F73","v":0},0,{"$f":"$C$16","v":0},{"$f":"K73*L73","v":0},0,{"$f":"      $D$16","v":0},{"$f":"N73*O73","v":0},{"$f":"$E$16","v":0},{"$f":"Q73*N73","v":0},null,null,"Erikoispuu",0,{"$f":"$C$16","v":0},{"$f":"V73*W73","v":0},0,{"$f":"      $D$16","v":0},{"$f":"Y73*Z73","v":0},{"$f":"$E$16","v":0},{"$f":"AB73*Y73","v":0}]
[null,"Energiapuu (kokopuu)",0,{"$f":"$C$17","v":9.1},{"$f":"C74*D74","v":0},0,{"$f":"      $D$17","v":4.72},0,{"$f":"$E$17","v":0},{"$f":"I74*F74","v":0},0,{"$f":"$C$17","v":9.1},{"$f":"K74*L74","v":0},0,{"$f":"      $D$17","v":4.72},{"$f":"N74*O74","v":0},{"$f":"$E$17","v":0},{"$f":"Q74*N74","v":0},null,null,"Energiapuu (kokopuu)",0,{"$f":"$C$17","v":9.1},{"$f":"V74*W74","v":0},0,{"$f":"      $D$17","v":4.72},{"$f":"Y74*Z74","v":0},{"$f":"$E$17","v":0},{"$f":"AB74*Y74","v":0}]
[null,"Halot ja klapit (tukkumyynti)",null,{"$f":"$C$18","v":30.94},{"$f":"C75*D75","v":0},null,{"$f":"      $D$18","v":3.02},0,{"$f":"$E$18","v":0},{"$f":"I75*F75","v":0},0,{"$f":"$C$18","v":30.94},{"$f":"K75*L75","v":0},0,{"$f":"      $D$18","v":3.02},{"$f":"N75*O75","v":0},{"$f":"$E$18","v":0},{"$f":"Q75*N75","v":0},null,null,"Halot ja klapit (tukkumyynti)",0,{"$f":"$C$18","v":30.94},{"$f":"V75*W75","v":0},0,{"$f":"      $D$18","v":3.02},{"$f":"Y75*Z75","v":0},{"$f":"$E$18","v":0},{"$f":"AB75*Y75","v":0}]
[null,"Haketus",0,{"$f":"$C$19","v":4.83},{"$f":"C76*D76","v":0},0," - "," -",{"$f":"$E$19","v":0},{"$f":"I76*F76","v":0},0,{"$f":"$C$19","v":4.83},{"$f":"K76*L76","v":0},0," - "," - ",{"$f":"$E$19","v":0},{"$f":"Q76*N76","v":0},null,null,"Haketus",0,{"$f":"$C$19","v":4.83},{"$f":"V76*W76","v":0},0," - "," - ",{"$f":"$E$19","v":0},{"$f":"AB76*Y76","v":0}]
[null,"Hake ",0," - "," - ",0,{"$f":"      $D$20","v":3.02},{"$f":"F77*G77","v":0},{"$f":"$E$20","v":0},{"$f":"I77*F77","v":0},0," - "," - ",0,{"$f":"      $D$20","v":3.02},{"$f":"N77*O77","v":0},{"$f":"$E$20","v":0},{"$f":"Q77*N77","v":0},null,null,"Hake ",0," - "," - ",0,{"$f":"      $D$20","v":3.02},{"$f":"Y77*Z77","v":0},{"$f":"$E$20","v":0},{"$f":"AB77*Y77","v":0}]
[null,"Joulupuut (tukkumyynti)",null,{"$f":"$C$21","v":0},{"$f":"C78*D78","v":0},null,{"$f":"$D$21","v":0},null,{"$f":"$E$21","v":0},null,null,{"$f":"$C$21","v":0},{"$f":"K78*L78","v":0},null,{"$f":"$D$21","v":0},null,{"$f":"$E$21","v":0},null,null,null,"Joulupuut (tukkumyynti)",null,{"$f":"$C$21","v":0},null,null,{"$f":"$D$21","v":0},null,{"$f":"$E$21","v":0}]
[null,"Yhteensä",{"$f":"SUM(C66:C78)","v":0},null,{"$f":"SUM(E66:E78)","v":0},{"$f":"SUM(F66:F78)","v":0},null,{"$f":"SUM(H66:H78)","v":0},null,{"$f":"SUM(J66:J78)","v":0},{"$f":"SUM(K66:K78)","v":0},null,{"$f":"SUM(M66:M78)","v":0},{"$f":"SUM(N66:N78)","v":0},null,{"$f":"SUM(P66:P78)","v":0},null,{"$f":"SUM(R66:R78)","v":0},null,null,"Yhteensä",{"$f":"SUM(V66:V78)","v":0},null,{"$f":"SUM(X66:X78)","v":0},{"$f":"SUM(Y66:Y78)","v":0},null,{"$f":"SUM(AA66:AA78)","v":0},null,{"$f":"SUM(AC66:AC78)","v":0}]
[]
[null,null,"YHTEENSÄ",null,null,null,null,null,"EI METSÄVÄHENNYSTÄ",null,null,null,null,null,null,null,"METSÄVÄHENNYSOIKEUS"]
[null,"Hakkuutyön arvo",{"$f":"J82+R82","v":0},null,null,null,null,null,"Hakkuutyön arvo",{"$f":"E79","v":0},null,null,null,null,null,null,"Hakkuutyön arvo",{"$f":"M79","v":0},null,null,null,null,null,null,null,null,null,"Hakkuutyön arvo",{"$f":"X79","v":0}]
[null,"Kuljetuksen arvo",0,null,null,null,null,null,"Kuljetuksen arvo",{"$f":"H79","v":0},null,null,null,null,null,null,"Kuljetuksen arvo",{"$f":"P79","v":0},null,null,null,null,null,null,null,null,null,"Kuljetuksen arvo",{"$f":"AA79","v":0}]
[null,"Konekustannus (muuta vuosimenoa)",0,null,null,null,null,null,"Konekustannus",{"$f":"J79","v":0},null,null,null,null,null,null,"Konekustannus",{"$f":"R79","v":0},null,null,null,null,null,null,null,null,null,"Konekustannus",{"$f":"AC79","v":0}]
[null,"Hakkuun määrä yhteensä",0,null,null,null,null,null,"Hakkuun määrä",{"$f":"C79","v":0},null,null,null,null,null,null,"Hakkuun määrä",{"$f":"K79","v":0},null,null,null,null,null,null,null,null,null,"Hakkuun määrä",{"$f":"V79","v":0}]
[null,"Kuljetuksen määrä yhteensä",0,null,null,null,null,null,"Kuljetuksen määrä",{"$f":"F79","v":0},null,null,null,null,null,null,"Kuljetuksen määrä",{"$f":"N79","v":0},null,null,null,null,null,null,null,null,null,"Kuljetuksen määrä",{"$f":"Y79","v":0}]
[null,"Puutavaran verollinen arvo",0,null,null,null,null,null,"Puutavaran verollinen arvo",{"$f":"(D60-J82-J83-J84)","v":0},null,null,null,null,null,null,"Metsävähennykseen oikeuttava osa (verollinen osa)",{"$f":"(L60-R82-R83-R84)","v":0}]
[]
[]
[null,null,"Hakattu määrä yhteensä",null,{"$f":"C85","v":0}]
[null,null,"Kuljetettu määrä yhteensä",null,{"$f":"C86","v":0}]
[null,"Tarkistus:",{"$f":"IF(E91>E90,\"Kuljetettu määrä on valmistettua määrää suurempi\",IF(E91=E90,\"Valmistettu ja kuljetettu määrä yhtäsuuret\",\"Valmistettu määrä on kuljetettua määrää isompi\"))","v":"Valmistettu ja kuljetettu määrä yhtäsuuret"}]
[]
[null,"MAATILA 3","Ei metsävähennysoikeutta",null,null,null,null,null,null,null,"Metsävähennysoikeus",null,null,null,null,null,null,null,null,null,"MAATILA 3"]
[null,null,"Hankintatyötulot",{"$f":"Tulot!AN9","v":0},null,null,null,null,null,null,"Hankintatyötulot",{"$f":"Tulot!AO9","v":0},null,null,null,null,null,null,null,null,null,"Uinumaan jäävä hakkuumäärä"]
[]
[null,null,"HAKKUU",null,null,"KULJETUS",null,null,"KONEKULJETUS",null,"HAKKUU",null,null,"KULJETUS",null,null,"KONEKULJETUS",null,null,null,null,"HAKKUU",null,null,"KULJETUS",null,null,"KONEKULJETUS"]
[]
[null,null,null,"Valmistuksen arvo",null,"Määrä","Kuljetustyön arvo",null,"Konekustannus",null,null,"Valmistuksen arvo",null,"Määrä","Kuljetustyön arvo",null,"Konekustannus",null,null,null,null,null,"valmistuksen arvo",null,"Määrä","Kuljetustyön arvo",null,"Konekustannus"]
[null,null,"m3","€/m3","€","m3","€/m3"," \n€","€/m3","\n€","m3","€/m3","€","m3","€/m3"," \n€","€/m3","\n€",null,null,null,"m3","€/m3","€","m3","€/m3"," \n€","€/m3","\n€"]
[null,"Mäntykuitu",null,{"$f":"$C$9","v":14.76},{"$f":"C101*D101","v":0},null,{"$f":"      $D$9","v":2.59},{"$f":"F101*G101","v":0},{"$f":"$E$9","v":0},{"$f":"I101*F101","v":0},null,{"$f":"$C$9","v":14.76},{"$f":"K101*L101","v":0},0,{"$f":"      $D$9","v":2.59},{"$f":"N101*O101","v":0},{"$f":"$E$9","v":0},{"$f":"Q101*N101","v":0},null,null,"Mäntykuitu",null,{"$f":"$C$9","v":14.76},{"$f":"V101*W101","v":0},null,{"$f":"      $D$9","v":2.59},{"$f":"Y101*Z101","v":0},{"$f":"$E$9","v":0},{"$f":"AB101*Y101","v":0}]
[null,"Kuusikuitu",0,{"$f":"$C$10","v":15.44},0,0,{"$f":"      $D$10","v":2.75},{"$f":"F102*G102","v":0},{"$f":"$E$10","v":0},{"$f":"I102*F102","v":0},0,{"$f":"$C$10","v":15.44},0,0,{"$f":"      $D$10","v":2.75},0,{"$f":"$E$10","v":0},{"$f":"Q102*N102","v":0},null,null,"Kuusikuitu",null,{"$f":"$C$10","v":15.44},0,null,{"$f":"      $D$10","v":2.75},0,{"$f":"$E$10","v":0},{"$f":"AB102*Y102","v":0}]
[null,"Koivukuitu",null,{"$f":"$C$11","v":13.65},0,null,{"$f":"      $D$11","v":3.02},0,{"$f":"$E$11","v":0},0,null,{"$f":"$C$11","v":13.65},0,null,{"$f":"      $D$11","v":3.02},0,{"$f":"$E$11","v":0},0,null,null,"Koivukuitu",null,{"$f":"$C$11","v":13.65},0,0,{"$f":"      $D$11","v":3.02},0,{"$f":"$E$11","v":0},0]
[null,"Mäntytukki",null,{"$f":"$C$12","v":6.39},0,0,{"$f":"      $D$12","v":2.5099999999999998},0,{"$f":"$E$12","v":0},0,0,{"$f":"$C$12","v":6.39},0,0,{"$f":"      $D$12","v":2.5099999999999998},0,{"$f":"$E$12","v":0},0,null,null,"Mäntytukki",0,{"$f":"$C$12","v":6.39},0,0,{"$f":"      $D$12","v":2.5099999999999998},0,{"$f":"$E$12","v":0},0]
[null,"Kuusitukki",0,{"$f":"$C$13","v":8.25},0,null,{"$f":"      $D$13","v":2.54},0,{"$f":"$E$13","v":0},0,0,{"$f":"$C$13","v":8.25},0,0,{"$f":"      $D$13","v":2.54},0,{"$f":"$E$13","v":0},0,null,null,"Kuusitukki",null,{"$f":"$C$13","v":8.25},0,0,{"$f":"      $D$13","v":2.54},0,{"$f":"$E$13","v":0},0]
[null,"Koivutukki",null,{"$f":"$C$14","v":6.09},0,null,{"$f":"      $D$14","v":2.88},0,{"$f":"$E$14","v":0},0,0,{"$f":"$C$14","v":6.09},0,0,{"$f":"      $D$14","v":2.88},0,{"$f":"$E$14","v":0},0,null,null,"Koivutukki",0,{"$f":"$C$14","v":6.09},0,0,{"$f":"      $D$14","v":2.88},0,{"$f":"$E$14","v":0},0]
[null,"Lahopuu",0,{"$f":"$C$15","v":0},0,0,{"$f":"      $D$15","v":0},0,{"$f":"$E$15","v":0},0,0,{"$f":"$C$15","v":0},0,0,{"$f":"      $D$15","v":0},0,{"$f":"$E$15","v":0},0,null,null,"Lahopuu",0,{"$f":"$C$15","v":0},0,0,{"$f":"      $D$15","v":0},0,{"$f":"$E$15","v":0},0]
[null,"Erikoispuu",0,{"$f":"$C$16","v":0},{"$f":"C108*D108","v":0},0,{"$f":"      $D$16","v":0},0,{"$f":"$E$16","v":0},{"$f":"I108*F108","v":0},0,{"$f":"$C$16","v":0},{"$f":"K108*L108","v":0},0,{"$f":"      $D$16","v":0},{"$f":"N108*O108","v":0},{"$f":"$E$16","v":0},{"$f":"Q108*N108","v":0},null,null,"Erikoispuu",0,{"$f":"$C$16","v":0},{"$f":"V108*W108","v":0},0,{"$f":"      $D$16","v":0},{"$f":"Y108*Z108","v":0},{"$f":"$E$16","v":0},{"$f":"AB108*Y108","v":0}]
[null,"Energiapuu (kokopuu)",0,{"$f":"$C$17","v":9.1},{"$f":"C109*D109","v":0},0,{"$f":"      $D$17","v":4.72},0,{"$f":"$E$17","v":0},{"$f":"I109*F109","v":0},0,{"$f":"$C$17","v":9.1},{"$f":"K109*L109","v":0},0,{"$f":"      $D$17","v":4.72},{"$f":"N109*O109","v":0},{"$f":"$E$17","v":0},{"$f":"Q109*N109","v":0},null,null,"Energiapuu (kokopuu)",0,{"$f":"$C$17","v":9.1},{"$f":"V109*W109","v":0},0,{"$f":"      $D$17","v":4.72},{"$f":"Y109*Z109","v":0},{"$f":"$E$17","v":0},{"$f":"AB109*Y109","v":0}]
[null,"Halot ja klapit (tukkumyynti)",null,{"$f":"$C$18","v":30.94},{"$f":"C110*D110","v":0},null,{"$f":"      $D$18","v":3.02},0,{"$f":"$E$18","v":0},{"$f":"I110*F110","v":0},0,{"$f":"$C$18","v":30.94},{"$f":"K110*L110","v":0},0,{"$f":"      $D$18","v":3.02},{"$f":"N110*O110","v":0},{"$f":"$E$18","v":0},{"$f":"Q110*N110","v":0},null,null,"Halot ja klapit (tukkumyynti)",0,{"$f":"$C$18","v":30.94},{"$f":"V110*W110","v":0},0,{"$f":"      $D$18","v":3.02},{"$f":"Y110*Z110","v":0},{"$f":"$E$18","v":0},{"$f":"AB110*Y110","v":0}]
[null,"Haketus",0,{"$f":"$C$19","v":4.83},{"$f":"C111*D111","v":0},0," - "," -",{"$f":"$E$19","v":0},{"$f":"I111*F111","v":0},0,{"$f":"$C$19","v":4.83},{"$f":"K111*L111","v":0},0," - "," - ",{"$f":"$E$19","v":0},{"$f":"Q111*N111","v":0},null,null,"Haketus",0,{"$f":"$C$19","v":4.83},{"$f":"V111*W111","v":0},0," - "," - ",{"$f":"$E$19","v":0},{"$f":"AB111*Y111","v":0}]
[null,"Hake ",0," - "," - ",0,{"$f":"      $D$20","v":3.02},{"$f":"F112*G112","v":0},{"$f":"$E$20","v":0},{"$f":"I112*F112","v":0},0," - "," - ",0,{"$f":"      $D$20","v":3.02},{"$f":"N112*O112","v":0},{"$f":"$E$20","v":0},{"$f":"Q112*N112","v":0},null,null,"Hake ",0," - "," - ",0,{"$f":"      $D$20","v":3.02},{"$f":"Y112*Z112","v":0},{"$f":"$E$20","v":0},{"$f":"AB112*Y112","v":0}]
[null,"Joulupuut (tukkumyynti)",null,{"$f":"$C$21","v":0},{"$f":"C113*D113","v":0},null,{"$f":"$D$21","v":0},null,{"$f":"$E$21","v":0},null,null,{"$f":"$C$21","v":0},{"$f":"K113*L113","v":0},null,{"$f":"$D$21","v":0},null,{"$f":"$E$21","v":0},null,null,null,"Joulupuut (tukkumyynti)",null,{"$f":"$C$21","v":0},null,null,{"$f":"$D$21","v":0},null,{"$f":"$E$21","v":0}]
[null,"Yhteensä",{"$f":"SUM(C101:C113)","v":0},null,{"$f":"SUM(E101:E113)","v":0},{"$f":"SUM(F101:F113)","v":0},null,{"$f":"SUM(H101:H113)","v":0},null,{"$f":"SUM(J101:J113)","v":0},{"$f":"SUM(K101:K113)","v":0},null,{"$f":"SUM(M101:M113)","v":0},{"$f":"SUM(N101:N113)","v":0},null,{"$f":"SUM(P101:P113)","v":0},null,{"$f":"SUM(R101:R113)","v":0},null,null,"Yhteensä",{"$f":"SUM(V101:V113)","v":0},null,{"$f":"SUM(X101:X113)","v":0},{"$f":"SUM(Y101:Y113)","v":0},null,{"$f":"SUM(AA101:AA113)","v":0},null,{"$f":"SUM(AC101:AC113)","v":0}]
[]
[null,null,"YHTEENSÄ",null,null,null,null,null,"EI METSÄVÄHENNYSTÄ",null,null,null,null,null,null,null,"METSÄVÄHENNYSOIKEUS"]
[null,"Hakkuutyön arvo",{"$f":"J117+R117","v":0},null,null,null,null,null,"Hakkuutyön arvo",{"$f":"E114","v":0},null,null,null,null,null,null,"Hakkuutyön arvo",{"$f":"M114","v":0},null,null,null,null,null,null,null,null,null,"Hakkuutyön arvo",{"$f":"X114","v":0}]
[null,"Kuljetuksen arvo",0,null,null,null,null,null,"Kuljetuksen arvo",{"$f":"H114","v":0},null,null,null,null,null,null,"Kuljetuksen arvo",{"$f":"P114","v":0},null,null,null,null,null,null,null,null,null,"Kuljetuksen arvo",{"$f":"AA114","v":0}]
[null,"Konekustannus (muuta vuosimenoa)",0,null,null,null,null,null,"Konekustannus",{"$f":"J114","v":0},null,null,null,null,null,null,"Konekustannus",{"$f":"R114","v":0},null,null,null,null,null,null,null,null,null,"Konekustannus",{"$f":"AC114","v":0}]
[null,"Hakkuun määrä yhteensä",0,null,null,null,null,null,"Hakkuun määrä",{"$f":"C114","v":0},null,null,null,null,null,null,"Hakkuun määrä",{"$f":"K114","v":0},null,null,null,null,null,null,null,null,null,"Hakkuun määrä",{"$f":"V114","v":0}]
[null,"Kuljetuksen määrä yhteensä",0,null,null,null,null,null,"Kuljetuksen määrä",{"$f":"F114","v":0},null,null,null,null,null,null,"Kuljetuksen määrä",{"$f":"N114","v":0},null,null,null,null,null,null,null,null,null,"Kuljetuksen määrä",{"$f":"Y114","v":0}]
[null,"Puutavaran verollinen arvo",0,null,null,null,null,null,"Puutavaran verollinen arvo",{"$f":"(D95-J117-J118-J119)","v":0},null,null,null,null,null,null,"Metsävähennykseen oikeuttava osa (verollinen osa)",{"$f":"(L95-R117-R118-R119)","v":0}]
[null,null,"Hakattu määrä yhteensä",null,{"$f":"C120","v":0}]
[null,null,"Kuljetettu määrä yhteensä",null,{"$f":"C121","v":0}]
[null,"Tarkistus:",{"$f":"IF(E124>E123,\"Kuljetettu määrä on valmistettua määrää suurempi\",IF(E124=E123,\"Valmistettu ja kuljetettu määrä yhtäsuuret\",\"Valmistettu määrä on kuljetettua määrää isompi\"))","v":"Valmistettu ja kuljetettu määrä yhtäsuuret"}]
[]
[null,"MAATILA 4","Ei metsävähennysoikeutta",null,null,null,null,null,null,null,"Metsävähennysoikeus",null,null,null,null,null,null,null,null,null,"MAATILA 4"]
[null,null,"Hankintatyötulot",{"$f":"Tulot!AP9","v":0},null,null,null,null,null,null,"Hankintatyötulot",{"$f":"Tulot!AQ9","v":0},null,null,null,null,null,null,null,null,null,"Uinumaan jäävä hakkuumäärä"]
[]
[null,null,"HAKKUU",null,null,"KULJETUS",null,null,"KONEKULJETUS",null,"HAKKUU",null,null,"KULJETUS",null,null,"KONEKULJETUS",null,null,null,null,"HAKKUU",null,null,"KULJETUS",null,null,"KONEKULJETUS"]
[]
[null,null,null,"Valmistuksen arvo",null,"Määrä","Kuljetustyön arvo",null,"Konekustannus",null,null,"Valmistuksen arvo",null,"Määrä","Kuljetustyön arvo",null,"Konekustannus",null,null,null,null,null,"valmistuksen arvo",null,"Määrä","Kuljetustyön arvo",null,"Konekustannus"]
[null,null,"m3","€/m3","€","m3","€/m3"," \n€","€/m3","\n€","m3","€/m3","€","m3","€/m3"," \n€","€/m3","\n€",null,null,null,"m3","€/m3","€","m3","€/m3"," \n€","€/m3","\n€"]
[null,"Mäntykuitu",null,{"$f":"$C$9","v":14.76},{"$f":"C134*D134","v":0},null,{"$f":"      $D$9","v":2.59},{"$f":"F134*G134","v":0},{"$f":"$E$9","v":0},{"$f":"I134*F134","v":0},null,{"$f":"$C$9","v":14.76},{"$f":"K134*L134","v":0},0,{"$f":"      $D$9","v":2.59},{"$f":"N134*O134","v":0},{"$f":"$E$9","v":0},{"$f":"Q134*N134","v":0},null,null,"Mäntykuitu",null,{"$f":"$C$9","v":14.76},{"$f":"V134*W134","v":0},null,{"$f":"      $D$9","v":2.59},{"$f":"Y134*Z134","v":0},{"$f":"$E$9","v":0},{"$f":"AB134*Y134","v":0}]
[null,"Kuusikuitu",0,{"$f":"$C$10","v":15.44},0,0,{"$f":"      $D$10","v":2.75},{"$f":"F135*G135","v":0},{"$f":"$E$10","v":0},{"$f":"I135*F135","v":0},0,{"$f":"$C$10","v":15.44},0,0,{"$f":"      $D$10","v":2.75},0,{"$f":"$E$10","v":0},{"$f":"Q135*N135","v":0},null,null,"Kuusikuitu",null,{"$f":"$C$10","v":15.44},0,null,{"$f":"      $D$10","v":2.75},0,{"$f":"$E$10","v":0},{"$f":"AB135*Y135","v":0}]
[null,"Koivukuitu",null,{"$f":"$C$11","v":13.65},0,0,{"$f":"      $D$11","v":3.02},0,{"$f":"$E$11","v":0},0,null,{"$f":"$C$11","v":13.65},0,null,{"$f":"      $D$11","v":3.02},0,{"$f":"$E$11","v":0},0,null,null,"Koivukuitu",null,{"$f":"$C$11","v":13.65},0,0,{"$f":"      $D$11","v":3.02},0,{"$f":"$E$11","v":0},0]
[null,"Mäntytukki",null,{"$f":"$C$12","v":6.39},0,0,{"$f":"      $D$12","v":2.5099999999999998},0,{"$f":"$E$12","v":0},0,0,{"$f":"$C$12","v":6.39},0,0,{"$f":"      $D$12","v":2.5099999999999998},0,{"$f":"$E$12","v":0},0,null,null,"Mäntytukki",0,{"$f":"$C$12","v":6.39},0,0,{"$f":"      $D$12","v":2.5099999999999998},0,{"$f":"$E$12","v":0},0]
[null,"Kuusitukki",0,{"$f":"$C$13","v":8.25},0,null,{"$f":"      $D$13","v":2.54},0,{"$f":"$E$13","v":0},0,0,{"$f":"$C$13","v":8.25},0,0,{"$f":"      $D$13","v":2.54},0,{"$f":"$E$13","v":0},0,null,null,"Kuusitukki",null,{"$f":"$C$13","v":8.25},0,0,{"$f":"      $D$13","v":2.54},0,{"$f":"$E$13","v":0},0]
[null,"Koivutukki",null,{"$f":"$C$14","v":6.09},0,null,{"$f":"      $D$14","v":2.88},0,{"$f":"$E$14","v":0},0,0,{"$f":"$C$14","v":6.09},0,0,{"$f":"      $D$14","v":2.88},0,{"$f":"$E$14","v":0},0,null,null,"Koivutukki",0,{"$f":"$C$14","v":6.09},0,0,{"$f":"      $D$14","v":2.88},0,{"$f":"$E$14","v":0},0]
[null,"Lahopuu",0,{"$f":"$C$15","v":0},0,0,{"$f":"      $D$15","v":0},0,{"$f":"$E$15","v":0},0,0,{"$f":"$C$15","v":0},0,0,{"$f":"      $D$15","v":0},0,{"$f":"$E$15","v":0},0,null,null,"Lahopuu",0,{"$f":"$C$15","v":0},0,0,{"$f":"      $D$15","v":0},0,{"$f":"$E$15","v":0},0]
[null,"Erikoispuu",0,{"$f":"$C$16","v":0},{"$f":"C141*D141","v":0},0,{"$f":"      $D$16","v":0},0,{"$f":"$E$16","v":0},{"$f":"I141*F141","v":0},0,{"$f":"$C$16","v":0},{"$f":"K141*L141","v":0},0,{"$f":"      $D$16","v":0},{"$f":"N141*O141","v":0},{"$f":"$E$16","v":0},{"$f":"Q141*N141","v":0},null,null,"Erikoispuu",0,{"$f":"$C$16","v":0},{"$f":"V141*W141","v":0},0,{"$f":"      $D$16","v":0},{"$f":"Y141*Z141","v":0},{"$f":"$E$16","v":0},{"$f":"AB141*Y141","v":0}]
[null,"Energiapuu (kokopuu)",0,{"$f":"$C$17","v":9.1},{"$f":"C142*D142","v":0},0,{"$f":"      $D$17","v":4.72},0,{"$f":"$E$17","v":0},{"$f":"I142*F142","v":0},0,{"$f":"$C$17","v":9.1},{"$f":"K142*L142","v":0},0,{"$f":"      $D$17","v":4.72},{"$f":"N142*O142","v":0},{"$f":"$E$17","v":0},{"$f":"Q142*N142","v":0},null,null,"Energiapuu (kokopuu)",0,{"$f":"$C$17","v":9.1},{"$f":"V142*W142","v":0},0,{"$f":"      $D$17","v":4.72},{"$f":"Y142*Z142","v":0},{"$f":"$E$17","v":0},{"$f":"AB142*Y142","v":0}]
[null,"Halot ja klapit (tukkumyynti)",null,{"$f":"$C$18","v":30.94},{"$f":"C143*D143","v":0},null,{"$f":"      $D$18","v":3.02},0,{"$f":"$E$18","v":0},{"$f":"I143*F143","v":0},0,{"$f":"$C$18","v":30.94},{"$f":"K143*L143","v":0},0,{"$f":"      $D$18","v":3.02},{"$f":"N143*O143","v":0},{"$f":"$E$18","v":0},{"$f":"Q143*N143","v":0},null,null,"Halot ja klapit (tukkumyynti)",0,{"$f":"$C$18","v":30.94},{"$f":"V143*W143","v":0},0,{"$f":"      $D$18","v":3.02},{"$f":"Y143*Z143","v":0},{"$f":"$E$18","v":0},{"$f":"AB143*Y143","v":0}]
[null,"Haketus",0,{"$f":"$C$19","v":4.83},{"$f":"C144*D144","v":0},0," - "," -",{"$f":"$E$19","v":0},{"$f":"I144*F144","v":0},0,{"$f":"$C$19","v":4.83},{"$f":"K144*L144","v":0},0," - "," - ",{"$f":"$E$19","v":0},{"$f":"Q144*N144","v":0},null,null,"Haketus",0,{"$f":"$C$19","v":4.83},{"$f":"V144*W144","v":0},0," - "," - ",{"$f":"$E$19","v":0},{"$f":"AB144*Y144","v":0}]
[null,"Hake ",0," - "," - ",0,{"$f":"      $D$20","v":3.02},{"$f":"F145*G145","v":0},{"$f":"$E$20","v":0},{"$f":"I145*F145","v":0},0," - "," - ",0,{"$f":"      $D$20","v":3.02},{"$f":"N145*O145","v":0},{"$f":"$E$20","v":0},{"$f":"Q145*N145","v":0},null,null,"Hake ",0," - "," - ",0,{"$f":"      $D$20","v":3.02},{"$f":"Y145*Z145","v":0},{"$f":"$E$20","v":0},{"$f":"AB145*Y145","v":0}]
[null,"Joulupuut (tukkumyynti)",null,{"$f":"$C$21","v":0},{"$f":"C146*D146","v":0},null,{"$f":"$D$21","v":0},null,{"$f":"$E$21","v":0},null,null,{"$f":"$C$21","v":0},{"$f":"K146*L146","v":0},null,{"$f":"$D$21","v":0},null,{"$f":"$E$21","v":0},null,null,null,"Joulupuut (tukkumyynti)",null,{"$f":"$C$21","v":0},null,null,{"$f":"$D$21","v":0},null,{"$f":"$E$21","v":0}]
[null,"Yhteensä",{"$f":"SUM(C134:C146)","v":0},null,{"$f":"SUM(E134:E146)","v":0},{"$f":"SUM(F134:F146)","v":0},null,{"$f":"SUM(H134:H146)","v":0},null,{"$f":"SUM(J134:J146)","v":0},{"$f":"SUM(K134:K146)","v":0},null,{"$f":"SUM(M134:M146)","v":0},{"$f":"SUM(N134:N146)","v":0},null,{"$f":"SUM(P134:P146)","v":0},null,{"$f":"SUM(R134:R146)","v":0},null,null,"Yhteensä",{"$f":"SUM(V134:V146)","v":0},null,{"$f":"SUM(X134:X146)","v":0},{"$f":"SUM(Y134:Y146)","v":0},null,{"$f":"SUM(AA134:AA146)","v":0},null,{"$f":"SUM(AC134:AC146)","v":0}]
[]
[null,null,"YHTEENSÄ",null,null,null,null,null,"EI METSÄVÄHENNYSTÄ",null,null,null,null,null,null,null,"METSÄVÄHENNYSOIKEUS"]
[null,"Hakkuutyön arvo",{"$f":"J150+R150","v":0},null,null,null,null,null,"Hakkuutyön arvo",{"$f":"E147","v":0},null,null,null,null,null,null,"Hakkuutyön arvo",{"$f":"M147","v":0},null,null,null,null,null,null,null,null,null,"Hakkuutyön arvo",{"$f":"X147","v":0}]
[null,"Kuljetuksen arvo",0,null,null,null,null,null,"Kuljetuksen arvo",{"$f":"H147","v":0},null,null,null,null,null,null,"Kuljetuksen arvo",{"$f":"P147","v":0},null,null,null,null,null,null,null,null,null,"Kuljetuksen arvo",{"$f":"AA147","v":0}]
[null,"Konekustannus (muuta vuosimenoa)",0,null,null,null,null,null,"Konekustannus",{"$f":"J147","v":0},null,null,null,null,null,null,"Konekustannus",{"$f":"R147","v":0},null,null,null,null,null,null,null,null,null,"Konekustannus",{"$f":"AC147","v":0}]
[null,"Hakkuun määrä yhteensä",0,null,null,null,null,null,"Hakkuun määrä",{"$f":"C147","v":0},null,null,null,null,null,null,"Hakkuun määrä",{"$f":"K147","v":0},null,null,null,null,null,null,null,null,null,"Hakkuun määrä",{"$f":"V147","v":0}]
[null,"Kuljetuksen määrä yhteensä",0,null,null,null,null,null,"Kuljetuksen määrä",{"$f":"F147","v":0},null,null,null,null,null,null,"Kuljetuksen määrä",{"$f":"N147","v":0},null,null,null,null,null,null,null,null,null,"Kuljetuksen määrä",{"$f":"Y147","v":0}]
[null,"Puutavaran verollinen arvo",0,null,null,null,null,null,"Puutavaran verollinen arvo",{"$f":"(D128-J150-J151-J152)","v":0},null,null,null,null,null,null,"Metsävähennykseen oikeuttava osa (verollinen osa)",{"$f":"(L128-R150-R151-R152)","v":0}]
[]
[]
[null,null,"Hakattu määrä yhteensä",null,{"$f":"C153","v":0}]
[null,null,"Kuljetettu määrä yhteensä",null,{"$f":"C154","v":0}]
[null,"Tarkistus:",{"$f":"IF(E159>E158,\"Kuljetettu määrä on valmistettua määrää suurempi\",IF(E159=E158,\"Valmistettu ja kuljetettu määrä yhtäsuuret\",\"Valmistettu määrä on kuljetettua määrää isompi\"))","v":"Valmistettu ja kuljetettu määrä yhtäsuuret"}]
[]
[null,"MAATILA 5","Ei metsävähennysoikeutta",null,null,null,null,null,null,null,"Metsävähennysoikeus",null,null,null,null,null,null,null,null,null,"MAATILA 5"]
[null,null,"Hankintatyötulot",{"$f":"Tulot!AR9","v":0},null,null,null,null,null,null,"Hankintatyötulot",{"$f":"Tulot!AS9","v":0},null,null,null,null,null,null,null,null,null,"Uinumaan jäävä hakkuumäärä"]
[]
[null,null,"HAKKUU",null,null,"KULJETUS",null,null,"KONEKULJETUS",null,"HAKKUU",null,null,"KULJETUS",null,null,"KONEKULJETUS",null,null,null,null,"HAKKUU",null,null,"KULJETUS",null,null,"KONEKULJETUS"]
[]
[null,null,null,"Valmistuksen arvo",null,"Määrä","Kuljetustyön arvo",null,"Konekustannus",null,null,"Valmistuksen arvo",null,"Määrä","Kuljetustyön arvo",null,"Konekustannus",null,null,null,null,null,"valmistuksen arvo",null,"Määrä","Kuljetustyön arvo",null,"Konekustannus"]
[null,null,"m3","€/m3","€","m3","€/m3"," \n€","€/m3","\n€","m3","€/m3","€","m3","€/m3"," \n€","€/m3","\n€",null,null,null,"m3","€/m3","€","m3","€/m3"," \n€","€/m3","\n€"]
[null,"Mäntykuitu",null,{"$f":"$C$9","v":14.76},{"$f":"C169*D169","v":0},null,{"$f":"      $D$9","v":2.59},{"$f":"F169*G169","v":0},{"$f":"$E$9","v":0},{"$f":"I169*F169","v":0},null,{"$f":"$C$9","v":14.76},{"$f":"K169*L169","v":0},0,{"$f":"      $D$9","v":2.59},{"$f":"N169*O169","v":0},{"$f":"$E$9","v":0},{"$f":"Q169*N169","v":0},null,null,"Mäntykuitu",null,{"$f":"$C$9","v":14.76},{"$f":"V169*W169","v":0},null,{"$f":"      $D$9","v":2.59},{"$f":"Y169*Z169","v":0},{"$f":"$E$9","v":0},{"$f":"AB169*Y169","v":0}]
[null,"Kuusikuitu",0,{"$f":"$C$10","v":15.44},0,0,{"$f":"      $D$10","v":2.75},{"$f":"F170*G170","v":0},{"$f":"$E$10","v":0},{"$f":"I170*F170","v":0},0,{"$f":"$C$10","v":15.44},0,0,{"$f":"      $D$10","v":2.75},0,{"$f":"$E$10","v":0},{"$f":"Q170*N170","v":0},null,null,"Kuusikuitu",null,{"$f":"$C$10","v":15.44},0,null,{"$f":"      $D$10","v":2.75},0,{"$f":"$E$10","v":0},{"$f":"AB170*Y170","v":0}]
[null,"Koivukuitu",null,{"$f":"$C$11","v":13.65},0,0,{"$f":"      $D$11","v":3.02},0,{"$f":"$E$11","v":0},0,null,{"$f":"$C$11","v":13.65},0,null,{"$f":"      $D$11","v":3.02},0,{"$f":"$E$11","v":0},0,null,null,"Koivukuitu",null,{"$f":"$C$11","v":13.65},0,0,{"$f":"      $D$11","v":3.02},0,{"$f":"$E$11","v":0},0]
[null,"Mäntytukki",null,{"$f":"$C$12","v":6.39},0,0,{"$f":"      $D$12","v":2.5099999999999998},0,{"$f":"$E$12","v":0},0,0,{"$f":"$C$12","v":6.39},0,0,{"$f":"      $D$12","v":2.5099999999999998},0,{"$f":"$E$12","v":0},0,null,null,"Mäntytukki",0,{"$f":"$C$12","v":6.39},0,0,{"$f":"      $D$12","v":2.5099999999999998},0,{"$f":"$E$12","v":0},0]
[null,"Kuusitukki",0,{"$f":"$C$13","v":8.25},0,null,{"$f":"      $D$13","v":2.54},0,{"$f":"$E$13","v":0},0,0,{"$f":"$C$13","v":8.25},0,0,{"$f":"      $D$13","v":2.54},0,{"$f":"$E$13","v":0},0,null,null,"Kuusitukki",null,{"$f":"$C$13","v":8.25},0,0,{"$f":"      $D$13","v":2.54},0,{"$f":"$E$13","v":0},0]
[null,"Koivutukki",null,{"$f":"$C$14","v":6.09},0,null,{"$f":"      $D$14","v":2.88},0,{"$f":"$E$14","v":0},0,0,{"$f":"$C$14","v":6.09},0,0,{"$f":"      $D$14","v":2.88},0,{"$f":"$E$14","v":0},0,null,null,"Koivutukki",0,{"$f":"$C$14","v":6.09},0,0,{"$f":"      $D$14","v":2.88},0,{"$f":"$E$14","v":0},0]
[null,"Lahopuu",0,{"$f":"$C$15","v":0},0,0,{"$f":"      $D$15","v":0},0,{"$f":"$E$15","v":0},0,0,{"$f":"$C$15","v":0},0,0,{"$f":"      $D$15","v":0},0,{"$f":"$E$15","v":0},0,null,null,"Lahopuu",0,{"$f":"$C$15","v":0},0,0,{"$f":"      $D$15","v":0},0,{"$f":"$E$15","v":0},0]
[null,"Erikoispuu",0,{"$f":"$C$16","v":0},{"$f":"C176*D176","v":0},0,{"$f":"      $D$16","v":0},0,{"$f":"$E$16","v":0},{"$f":"I176*F176","v":0},0,{"$f":"$C$16","v":0},{"$f":"K176*L176","v":0},0,{"$f":"      $D$16","v":0},{"$f":"N176*O176","v":0},{"$f":"$E$16","v":0},{"$f":"Q176*N176","v":0},null,null,"Erikoispuu",0,{"$f":"$C$16","v":0},{"$f":"V176*W176","v":0},0,{"$f":"      $D$16","v":0},{"$f":"Y176*Z176","v":0},{"$f":"$E$16","v":0},{"$f":"AB176*Y176","v":0}]
[null,"Energiapuu (kokopuu)",0,{"$f":"$C$17","v":9.1},{"$f":"C177*D177","v":0},0,{"$f":"      $D$17","v":4.72},0,{"$f":"$E$17","v":0},{"$f":"I177*F177","v":0},0,{"$f":"$C$17","v":9.1},{"$f":"K177*L177","v":0},0,{"$f":"      $D$17","v":4.72},{"$f":"N177*O177","v":0},{"$f":"$E$17","v":0},{"$f":"Q177*N177","v":0},null,null,"Energiapuu (kokopuu)",0,{"$f":"$C$17","v":9.1},{"$f":"V177*W177","v":0},0,{"$f":"      $D$17","v":4.72},{"$f":"Y177*Z177","v":0},{"$f":"$E$17","v":0},{"$f":"AB177*Y177","v":0}]
[null,"Halot ja klapit (tukkumyynti)",null,{"$f":"$C$18","v":30.94},{"$f":"C178*D178","v":0},null,{"$f":"      $D$18","v":3.02},0,{"$f":"$E$18","v":0},{"$f":"I178*F178","v":0},0,{"$f":"$C$18","v":30.94},{"$f":"K178*L178","v":0},0,{"$f":"      $D$18","v":3.02},{"$f":"N178*O178","v":0},{"$f":"$E$18","v":0},{"$f":"Q178*N178","v":0},null,null,"Halot ja klapit (tukkumyynti)",0,{"$f":"$C$18","v":30.94},{"$f":"V178*W178","v":0},0,{"$f":"      $D$18","v":3.02},{"$f":"Y178*Z178","v":0},{"$f":"$E$18","v":0},{"$f":"AB178*Y178","v":0}]
[null,"Haketus",0,{"$f":"$C$19","v":4.83},{"$f":"C179*D179","v":0},0," - "," -",{"$f":"$E$19","v":0},{"$f":"I179*F179","v":0},0,{"$f":"$C$19","v":4.83},{"$f":"K179*L179","v":0},0," - "," - ",{"$f":"$E$19","v":0},{"$f":"Q179*N179","v":0},null,null,"Haketus",0,{"$f":"$C$19","v":4.83},{"$f":"V179*W179","v":0},0," - "," - ",{"$f":"$E$19","v":0},{"$f":"AB179*Y179","v":0}]
[null,"Hake ",0," - "," - ",0,{"$f":"      $D$20","v":3.02},{"$f":"F180*G180","v":0},{"$f":"$E$20","v":0},{"$f":"I180*F180","v":0},0," - "," - ",0,{"$f":"      $D$20","v":3.02},{"$f":"N180*O180","v":0},{"$f":"$E$20","v":0},{"$f":"Q180*N180","v":0},null,null,"Hake ",0," - "," - ",0,{"$f":"      $D$20","v":3.02},{"$f":"Y180*Z180","v":0},{"$f":"$E$20","v":0},{"$f":"AB180*Y180","v":0}]
[null,"Joulupuut (tukkumyynti)",null,{"$f":"$C$21","v":0},{"$f":"C181*D181","v":0},null,{"$f":"$D$21","v":0},null,{"$f":"$E$21","v":0},null,null,{"$f":"$C$21","v":0},{"$f":"K181*L181","v":0},null,{"$f":"$D$21","v":0},null,{"$f":"$E$21","v":0},null,null,null,"Joulupuut (tukkumyynti)",null,{"$f":"$C$21","v":0},null,null,{"$f":"$D$21","v":0},null,{"$f":"$E$21","v":0}]
[null,"Yhteensä",{"$f":"SUM(C169:C181)","v":0},null,{"$f":"SUM(E169:E181)","v":0},{"$f":"SUM(F169:F181)","v":0},null,{"$f":"SUM(H169:H181)","v":0},null,{"$f":"SUM(J169:J181)","v":0},{"$f":"SUM(K169:K181)","v":0},null,{"$f":"SUM(M169:M181)","v":0},{"$f":"SUM(N169:N181)","v":0},null,{"$f":"SUM(P169:P181)","v":0},null,{"$f":"SUM(R169:R181)","v":0},null,null,"Yhteensä",{"$f":"SUM(V169:V181)","v":0},null,{"$f":"SUM(X169:X181)","v":0},{"$f":"SUM(Y169:Y181)","v":0},null,{"$f":"SUM(AA169:AA181)","v":0},null,{"$f":"SUM(AC169:AC181)","v":0}]
[]
[null,null,"YHTEENSÄ",null,null,null,null,null,"EI METSÄVÄHENNYSTÄ",null,null,null,null,null,null,null,"METSÄVÄHENNYSOIKEUS"]
[null,"Hakkuutyön arvo",{"$f":"J185+R185","v":0},null,null,null,null,null,"Hakkuutyön arvo",{"$f":"E182","v":0},null,null,null,null,null,null,"Hakkuutyön arvo",{"$f":"M182","v":0},null,null,null,null,null,null,null,null,null,"Hakkuutyön arvo",{"$f":"X182","v":0}]
[null,"Kuljetuksen arvo",0,null,null,null,null,null,"Kuljetuksen arvo",{"$f":"H182","v":0},null,null,null,null,null,null,"Kuljetuksen arvo",{"$f":"P182","v":0},null,null,null,null,null,null,null,null,null,"Kuljetuksen arvo",{"$f":"AA182","v":0}]
[null,"Konekustannus (muuta vuosimenoa)",0,null,null,null,null,null,"Konekustannus",{"$f":"J182","v":0},null,null,null,null,null,null,"Konekustannus",{"$f":"R182","v":0},null,null,null,null,null,null,null,null,null,"Konekustannus",{"$f":"AC182","v":0}]
[null,"Hakkuun määrä yhteensä",0,null,null,null,null,null,"Hakkuun määrä",{"$f":"C182","v":0},null,null,null,null,null,null,"Hakkuun määrä",{"$f":"K182","v":0},null,null,null,null,null,null,null,null,null,"Hakkuun määrä",{"$f":"V182","v":0}]
[null,"Kuljetuksen määrä yhteensä",0,null,null,null,null,null,"Kuljetuksen määrä",{"$f":"F182","v":0},null,null,null,null,null,null,"Kuljetuksen määrä",{"$f":"N182","v":0},null,null,null,null,null,null,null,null,null,"Kuljetuksen määrä",{"$f":"Y182","v":0}]
[null,"Puutavaran verollinen arvo",0,null,null,null,null,null,"Puutavaran verollinen arvo",{"$f":"(D163-J185-J186-J187)","v":0},null,null,null,null,null,null,"Metsävähennykseen oikeuttava osa (verollinen osa)",{"$f":"(L163-R185-R186-R187)","v":0}]
[]
[]
[null,null,"Hakattu määrä yhteensä",null,{"$f":"C188","v":0}]
[null,null,"Kuljetettu määrä yhteensä",null,{"$f":"C189","v":0}]
[null,"Tarkistus:",{"$f":"IF(E194>E193,\"Kuljetettu määrä on valmistettua määrää suurempi\",IF(E194=E193,\"Valmistettu ja kuljetettu määrä yhtäsuuret\",\"Valmistettu määrä on kuljetettua määrää isompi\"))","v":"Valmistettu ja kuljetettu määrä yhtäsuuret"}]
[null,"Määrätarkistus:",{"$f":"IF(E195>E194,\"Kuljetettu määrä on valmistettua määrää suurempi\",IF(E195=E194,\"Valmistettu ja kuljetettu määrä yhtäsuuret\",\"Valmistettumääräonkuljetettuamäärääisompi\"))","v":"Valmistettu ja kuljetettu määrä yhtäsuuret"}]

{"sheet":"Hank.työ 2","index":5,"n_rows":158,"n_cols":33,"rows_kept":158,"cut":false,"hidden":false,"merged":[[23,1,24,1],[10,15,11,16],[10,17,11,17],[12,15,13,16],[12,17,13,17],[14,17,15,17],[16,21,16,28],[2,1,2,4],[5,21,5,28],[6,1,7,1],[6,6,7,8],[6,15,7,17],[8,15,9,16],[8,17,9,17],[8,21,9,28],[28,42,28,43],[28,45,28,46],[18,21,21,28],[24,21,25,28],[26,2,27,3],[26,5,27,6],[26,8,27,9],[26,10,27,11],[26,13,27,14],[26,16,27,17],[26,27,27,28],[28,37,28,38],[28,40,28,41],[28,3,28,4],[28,6,28,7],[28,8,28,9],[28,11,28,12],[28,14,28,15],[28,16,28,17],[28,22,28,23],[51,21,52,28],[28,138,28,139],[28,141,28,142],[28,144,28,145],[28,146,28,147],[28,149,28,150],[28,152,28,153],[28,122,28,123],[28,125,28,126],[28,128,28,129],[28,130,28,131],[28,133,28,134],[28,136,28,137],[28,106,28,107],[28,109,28,110],[28,112,28,113],[28,114,28,115],[28,117,28,118],[28,120,28,121],[28,90,28,91],[28,93,28,94],[28,96,28,97],[28,48,28,49],[28,50,28,51],[28,155,28,156],[37,8,37,9],[37,16,37,17],[28,98,28,99],[28,101,28,102],[28,104,28,105],[28,74,28,75],[28,77,28,78],[28,80,28,81],[28,82,28,83],[28,85,28,86],[28,88,28,89],[28,58,28,59],[28,61,28,62],[28,64,28,65],[28,66,28,67],[28,69,28,70],[28,72,28,73],[28,53,28,54],[28,56,28,57],[28,25,28,26],[28,27,28,28],[28,32,28,33],[28,34,28,35],[53,27,54,28],[54,32,54,33],[54,34,54,35],[54,37,54,38],[53,21,54,22],[53,24,54,25],[53,2,54,3],[53,5,54,6],[53,8,54,9],[53,10,54,11],[53,13,54,14],[53,16,54,17],[54,56,54,57],[54,58,54,59],[54,61,54,62],[54,64,54,65],[54,66,54,67],[54,69,54,70],[54,40,54,41],[54,42,54,43],[54,45,54,46],[54,48,54,49],[54,50,54,51],[54,53,54,54],[54,88,54,89],[54,90,54,91],[54,93,54,94],[54,96,54,97],[54,98,54,99],[54,101,54,102],[54,72,54,73],[54,74,54,75],[54,77,54,78],[54,80,54,81],[54,82,54,83],[54,85,54,86],[54,120,54,121],[54,122,54,123],[54,125,54,126],[54,128,54,129],[54,130,54,131],[54,133,54,134],[54,104,54,105],[54,106,54,107],[54,109,54,110],[54,112,54,113],[54,114,54,115],[54,117,54,118],[80,5,81,6],[80,8,81,9],[80,10,81,11],[80,13,81,14],[77,20,78,20],[80,21,81,22],[80,24,81,25],[77,1,78,1],[54,152,54,153],[55,3,55,4],[55,6,55,7],[55,8,55,9],[55,11,55,12],[55,14,55,15],[55,16,55,17],[55,22,55,23],[55,25,55,26],[55,27,55,28],[54,136,54,137],[54,138,54,139],[54,141,54,142],[54,144,54,145],[54,146,54,147],[54,149,54,150],[81,37,81,38],[81,40,81,41],[81,42,81,43],[81,45,81,46],[81,48,81,49],[81,50,81,51],[80,16,81,17],[80,27,81,28],[81,32,81,33],[81,34,81,35],[81,69,81,70],[81,72,81,73],[81,74,81,75],[81,77,81,78],[81,80,81,81],[81,82,81,83],[81,53,81,54],[81,56,81,57],[81,58,81,59],[81,61,81,62],[81,64,81,65],[81,66,81,67],[81,106,81,107],[81,109,81,110],[81,112,81,113],[81,114,81,115],[81,85,81,86],[81,88,81,89],[81,90,81,91],[81,93,81,94],[81,96,81,97],[81,98,81,99],[81,149,81,150],[81,152,81,153],[82,3,82,4],[82,6,82,7],[82,8,82,9],[82,11,82,12],[82,14,82,15],[82,16,82,17],[82,22,82,23],[82,25,82,26],[81,133,81,134],[81,136,81,137],[81,138,81,139],[81,141,81,142],[81,144,81,145],[81,146,81,147],[81,117,81,118],[81,120,81,121],[81,122,81,123],[81,125,81,126],[81,128,81,129],[81,130,81,131],[81,101,81,102],[81,104,81,105],[109,32,109,33],[109,34,109,35],[109,37,109,38],[109,40,109,41],[107,27,108,28],[109,3,109,4],[109,6,109,7],[109,8,109,9],[109,11,109,12],[109,14,109,15],[109,16,109,17],[109,22,109,23],[107,2,108,3],[107,5,108,6],[107,8,108,9],[107,10,108,11],[107,13,108,14],[107,16,108,17],[107,21,108,22],[107,24,108,25],[109,58,109,59],[109,61,109,62],[109,64,109,65],[109,66,109,67],[109,69,109,70],[109,72,109,73],[109,42,109,43],[109,45,109,46],[109,48,109,49],[109,50,109,51],[109,53,109,54],[109,56,109,57],[109,98,109,99],[109,101,109,102],[109,104,109,105],[109,74,109,75],[109,77,109,78],[109,80,109,81],[109,82,109,83],[109,85,109,86],[109,88,109,89],[109,155,109,156],[118,8,118,9],[118,16,118,17],[109,138,109,139],[109,141,109,142],[109,144,109,145],[109,146,109,147],[109,149,109,150],[109,152,109,153],[109,122,109,123],[109,125,109,126],[109,128,109,129],[109,130,109,131],[109,133,109,134],[109,136,109,137],[109,106,109,107],[109,109,109,110],[109,112,109,113],[109,114,109,115],[109,117,109,118],[109,120,109,121],[109,90,109,91],[109,93,109,94],[109,96,109,97],[50,1,51,1],[23,20,24,20],[26,21,27,22],[26,24,27,25],[50,20,51,20],[134,27,135,28],[145,8,145,9],[145,16,145,17],[134,2,135,3],[134,5,135,6],[134,8,135,9],[134,10,135,11],[134,13,135,14],[134,16,135,17],[109,25,109,26],[109,27,109,28],[82,27,82,28],[91,8,91,9],[91,16,91,17],[105,21,106,28],[64,8,64,9],[64,16,64,17],[78,21,79,28],[80,2,81,3],[131,20,132,20],[132,21,133,28],[134,21,135,22],[134,24,135,25],[136,22,136,23],[136,25,136,26],[136,27,136,28],[104,1,105,1],[131,1,132,1],[136,3,136,4],[136,6,136,7],[136,8,136,9],[136,11,136,12],[136,14,136,15],[136,16,136,17],[104,20,105,20]]}
[]
[null,{"$f":"Etusivu!C10","v":"Matti Metsänen"}]
[null,{"$f":"Etusivu!C16","v":"123456-7"}]
[]
[null,"HANKINTATYÖN ARVON LASKENTA",null,null,null,null,null,null,null,null,null,null,null,null,null,"ohje","#### - ohje"]
[null,"Polttopuut ja joulupuut (1.3.)",null,null,null,null,null,null,null,null,null,null,null,null,null,null,null,null,null,null,null,{"$f":"CONCATENATE(\"Verovuodelta \",Etusivu!B6-1,\" uinumaan jätetyn hankintatyön arvo\")","v":"Verovuodelta 2024 uinumaan jätetyn hankintatyön arvo"}]
[null,"TAKSAT",null,null,null,null,"YHTEENVETO",null,null,null,null,null,null,null,null,"SIVUN ASETUKSET",null,null,null,null,null,"Hankintatyön arvo, €",null,{"$f":"SUM(Y7:AC7)","v":0},null,null,0,0,0]
[null,null,"Valmistus","Kuljetus","Kulj. Konekust.",null,null,null,null,"Maatila 1","Maatila 2","Maatila 3","Maatila 4","Maatila 5"]
[null,"Energiapuu (kokopuu)",9.1,4.74,{"$f":"IF(R$9=\"kyllä\",F9,0)","v":0},7.07,"Hankintakauppatulot maatilalta",null,null,{"$f":"D25+L25","v":0},{"$f":"D52+L52","v":0},{"$f":"D79+L79","v":0},{"$f":"D106+L106","v":0},{"$f":"D133+L133","v":0},null,"Kuljetuksen konekustan-\nnukset käytössä",null,"Ei",null,null,null,{"$f":"CONCATENATE(\"Verovuoden \",Etusivu!B$6,\" uinumaan jäävä hankintatyö\")","v":"Verovuoden 2025 uinumaan jäävä hankintatyö"},null,null,null,null,null,null,null,null,null,null,"Ei"]
[null,"Halot ja klapit (tukkumyynti)",30.94,3.02,{"$f":"IF(R$9=\"kyllä\",F10,0)","v":0},4.54,"Puutavaran verollinen arvo",null,null,{"$f":"IF(C44>=0,C44,\"- arvo tarkista\")","v":0},{"$f":"IF(C71>=0,C71,\"- arvo tarkista\")","v":0},{"$f":"IF(C98>=0,C98,\"- arvo tarkista\")","v":0},{"$f":"IF(C125>=0,C125,\"- arvo tarkista\")","v":0},{"$f":"IF(C152>=0,C152,\"- arvo tarkista\")","v":0},null,null,null,null,null,null,null,null,null,null,null,null,null,null,null,null,null,null,"Kyllä"]
[null,"Haketus",4.83,null,{"$f":"IF(R$9=\"kyllä\",F11,0)","v":0},null,"Konekustannusosuus (vuosimenoa)",null,null,{"$f":"+C41+AC41","v":0},{"$f":"+C68+AC68","v":0},{"$f":"+C95+AC95","v":0},{"$f":"+C122+AC122","v":0},{"$f":"+C149+AC149","v":0},null,"Näytä uinuvat hankintatyöt",null,"Ei",null,null,null,null,null,null,"Maatila 1","Maatila 2","Maatila 3","Maatila 4","Maatila 5"]
[null,"Hake",null,3.02,{"$f":"IF(R$9=\"kyllä\",F12,0)","v":0},4.54,"Valmistettu määrä yhteensä",null,null,{"$f":"+C42+AC42","v":0},{"$f":"+C69+AC69","v":0},{"$f":"+C96+AC96","v":0},{"$f":"+C123+AC123","v":0},{"$f":"+C150+AC150","v":0},null,null,null,null,null,null,null,"Valmistettu määrä yhteensä, m3",null,null,{"$f":"AC42","v":0},{"$f":"AC69","v":0},{"$f":"AC96","v":0},{"$f":"AC123","v":0},{"$f":"AC150","v":0}]
[null,"Joulupuut",null,null,{"$f":"IF(R$9=\"kyllä\",F13,0)","v":0},null,"Valmistuksen arvo yhteensä",null,null,{"$f":"+C39","v":0},{"$f":"+C66","v":0},{"$f":"+C93","v":0},{"$f":"+C120","v":0},{"$f":"+C147","v":0},null,"Näytettävien maatilojen määrä",null,1,null,null,null,"Valmistuksen arvo yhteensä, €",null,null,{"$f":"AC39","v":0},{"$f":"AC66","v":0},{"$f":"AC93","v":0},{"$f":"AC120","v":0},{"$f":"AC147","v":0}]
[null,null,null,null,null,null,"Valmistuksen verollinen arvo (125 m3 verovapaata)",null,null,{"$f":"IF(J12+'Hank.työ 1'!J12=0,0,IF((J12+'Hank.työ 1'!J12-125)/(J12+'Hank.työ 1'!J12)*J13>0,(J12+'Hank.työ 1'!J12-125)/(J12+'Hank.työ 1'!J12)*J13,0))","v":0},{"$f":"IF(K12+'Hank.työ 1'!K12=0,0,IF((K12+'Hank.työ 1'!K12-125)/(K12+'Hank.työ 1'!K12)*K13>0,(K12+'Hank.työ 1'!K12-125)/(K12+'Hank.työ 1'!K12)*K13,0))","v":0},{"$f":"IF(L12+'Hank.työ 1'!L12=0,0,IF((L12+'Hank.työ 1'!L12-125)/(L12+'Hank.työ 1'!L12)*L13>0,(L12+'Hank.työ 1'!L12-125)/(L12+'Hank.työ 1'!L12)*L13,0))","v":0},{"$f":"IF(M12+'Hank.työ 1'!M12=0,0,IF((M12+'Hank.työ 1'!M12-125)/(M12+'Hank.työ 1'!M12)*M13>0,(M12+'Hank.työ 1'!M12-125)/(M12+'Hank.työ 1'!M12)*M13,0))","v":0},{"$f":"IF(N12+'Hank.työ 1'!N12=0,0,IF((N12+'Hank.työ 1'!N12-125)/(N12+'Hank.työ 1'!N12)*N13>0,(N12+'Hank.työ 1'!N12-125)/(N12+'Hank.työ 1'!N12)*N13,0))","v":0},null,null,null,null,null,null,null,"Kuljetuksen määrä yhteensä, m3",null,null,{"$f":"AC43","v":0},{"$f":"AC70","v":0},{"$f":"AC97","v":0},{"$f":"AC124","v":0},{"$f":"AC151","v":0}]
[null,null,null,null,null,null,"Kuljetuksen määrä yhteensä",null,null,{"$f":"+C43+AC43","v":0},{"$f":"+C70+AC70","v":0},{"$f":"+C97+AC97","v":0},{"$f":"+C124+AC124","v":0},{"$f":"+C151+AC151","v":0},"Näytettävien maatilojen määrä tulee automaattisesti",null,null,{"$f":"IF(R11=\"Kyllä\",\"  ---->>\",\"\")","v":""},null,null,null,"kuljetuksen arvo yhteensä, €",null,null,{"$f":"AC40","v":0},{"$f":"AC67","v":0},{"$f":"AC94","v":0},{"$f":"AC121","v":0},{"$f":"AC148","v":0}]
[null,null,null,null,null,null,"kuljetuksen arvo yhteensä",null,null,{"$f":"+C40","v":0},{"$f":"+C67","v":0},{"$f":"+C94","v":0},{"$f":"+C121","v":0},{"$f":"+C148","v":0},null,null,null,null,null,null,null,"HANKINTATYÖN ARVO YHTEENSÄ, €",null,null,{"$f":"Y13+Y15","v":0},{"$f":"Z13+Z15","v":0},{"$f":"AA13+AA15","v":0},{"$f":"AB13+AB15","v":0},{"$f":"AC13+AC15","v":0}]
[null,null,null,null,null,null,"Kuljetuksen verollinen arvo (125 m3 verovapaata)",null,null,{"$f":"IF(J15+'Hank.työ 1'!J15=0,0,IF((J15+'Hank.työ 1'!J15-125)/(J15+'Hank.työ 1'!J15)*J16>0,(J15+'Hank.työ 1'!J15-125)/(J15+'Hank.työ 1'!J15)*J16,0))","v":0},{"$f":"IF(K15+'Hank.työ 1'!K15=0,0,IF((K15+'Hank.työ 1'!K15-125)/(K15+'Hank.työ 1'!K15)*K16>0,(K15+'Hank.työ 1'!K15-125)/(K15+'Hank.työ 1'!K15)*K16,0))","v":0},{"$f":"IF(L15+'Hank.työ 1'!L15=0,0,IF((L15+'Hank.työ 1'!L15-125)/(L15+'Hank.työ 1'!L15)*L16>0,(L15+'Hank.työ 1'!L15-125)/(L15+'Hank.työ 1'!L15)*L16,0))","v":0},{"$f":"IF(M15+'Hank.työ 1'!M15=0,0,IF((M15+'Hank.työ 1'!M15-125)/(M15+'Hank.työ 1'!M15)*M16>0,(M15+'Hank.työ 1'!M15-125)/(M15+'Hank.työ 1'!M15)*M16,0))","v":0},{"$f":"IF(N15+'Hank.työ 1'!N15=0,0,IF((N15+'Hank.työ 1'!N15-125)/(N15+'Hank.työ 1'!N15)*N16>0,(N15+'Hank.työ 1'!N15-125)/(N15+'Hank.työ 1'!N15)*N16,0))","v":0},null,null,null,null,null,null,null,"Siirrä nämä alarivin summat seuraavan vuoden verotukseen uinumaan jätettyinä hankintatyön arvoina."]
[null,null,null,null,null,null,"Hankintatyön arvo yhteensä",null,null,{"$f":"J13+J16","v":0},{"$f":"K13+K16","v":0},{"$f":"L13+L16","v":0},{"$f":"M13+M16","v":0},{"$f":"N13+N16","v":0}]
[null,null,null,null,null,null,"Hankintatyön verollinen arvo yhteensä",null,null,{"$f":"(J14+J17)","v":0},{"$f":"(K14+K17)","v":0},{"$f":"(L14+L17)","v":0},{"$f":"(M14+M17)","v":0},{"$f":"(N14+N17)","v":0},null,null,null,null,null,null,null,"TÄHÄN ALLE VAIN NE KUUTIOMÄÄRÄT JOTKA ON TEHTY VEROVUONNA, \nMUTTA MYYDÄÄN TULEVANA VEROVUONNA\nSiirrä seuraavan vuoden veroilmoitukseen hankintatyön arvoon (lomake 2C kohta 2.1)"]
[null,null,null,null,null,null,"Hakkuumäärä yht. verovuonna (sis. hank.työ 1 ja 2)",null,null,{"$f":"J12+'Hank.työ 1'!J12","v":0},{"$f":"K12+'Hank.työ 1'!K12","v":0},{"$f":"L12+'Hank.työ 1'!L12","v":0},{"$f":"M12+'Hank.työ 1'!M12","v":0},{"$f":"N12+'Hank.työ 1'!N12","v":0}]
[null,null,null,null,null,null,"Ajomäärä yht verovuonna (sis. hank.työ 1 ja 2)",null,null,{"$f":"J15+'Hank.työ 1'!J15","v":0},{"$f":"K15+'Hank.työ 1'!K15","v":0},{"$f":"L15+'Hank.työ 1'!L15","v":0},{"$f":"M15+'Hank.työ 1'!M15","v":0},{"$f":"N15+'Hank.työ 1'!N15","v":0}]
[]
[]
[null,"MAATILA 1","Ei metsävähennysoikeutta",null,null,null,null,null,null,null,"Metsävähennysoikeus",null,null,null,null,null,null,null,null,null,"MAATILA 1"]
[null,null,"Hankintatyötulot",{"$f":"Tulot!AU9","v":0},null,null,null,null,null,null,"Hankintatyötulot",{"$f":"Tulot!AV9","v":0},null,null,null,null,null,null,null,null,null,"Uinumaan jäävä hakkuumäärä"]
[]
[null,null,"HAKKUU",null,null,"KULJETUS",null,null,"KONEKULJETUS",null,"HAKKUU",null,null,"KULJETUS",null,null,"KONEKULJETUS",null,null,null,null,"HAKKUU",null,null,"KULJETUS",null,null,"KONEKULJETUS"]
[]
[null,null,null,"Valmistuksen arvo",null,"Määrä","Kuljetustyön arvo",null,"Konekustannus",null,null,"Valmistuksen arvo",null,"Määrä","Kuljetustyön arvo",null,"Konekustannus",null,null,null,null,null,"valmistuksen arvo",null,"Määrä","Kuljetustyön arvo",null,"Konekustannus"]
[null,null,"m3","€/m3","€","m3","€/m3"," \n€","€/m3","\n€","m3","€/m3","€","m3","€/m3"," \n€","€/m3","\n€",null,null,null,"m3","€/m3","€","m3","€/m3"," \n€","€/m3","\n€"]
[null,"Energiapuu (kokopuu)",null,{"$f":"$C$9","v":9.1},{"$f":"C31*D31","v":0},null,{"$f":"      $D$9","v":4.74},{"$f":"F31*G31","v":0},{"$f":"$E$9","v":0},{"$f":"I31*F31","v":0},null,{"$f":"$C$9","v":9.1},{"$f":"K31*L31","v":0},0,{"$f":"      $D$9","v":4.74},{"$f":"N31*O31","v":0},{"$f":"$E$9","v":0},{"$f":"Q31*N31","v":0},null,null,"Energiapuu (kokopuu)",null,{"$f":"$C$9","v":9.1},{"$f":"V31*W31","v":0},null,{"$f":"      $D$9","v":4.74},{"$f":"Y31*Z31","v":0},{"$f":"$E$9","v":0},{"$f":"AB31*Y31","v":0}]
[null,"Halot ja klapit",null,{"$f":"$C$10","v":30.94},{"$f":"C32*D32","v":0},0,{"$f":"      $D$10","v":3.02},{"$f":"F32*G32","v":0},{"$f":"$E$10","v":0},{"$f":"I32*F32","v":0},null,{"$f":"$C$10","v":30.94},{"$f":"K32*L32","v":0},null,{"$f":"      $D$10","v":3.02},{"$f":"N32*O32","v":0},{"$f":"$E$10","v":0},{"$f":"Q32*N32","v":0},null,null,"Halot ja klapit",null,{"$f":"$C$10","v":30.94},{"$f":"V32*W32","v":0},null,{"$f":"      $D$10","v":3.02},{"$f":"Y32*Z32","v":0},{"$f":"$E$10","v":0},{"$f":"AB32*Y32","v":0}]
[null,"Haketus",null,{"$f":"$C$11","v":4.83},{"$f":"C33*D33","v":0},0,{"$f":"      $D$11","v":0},{"$f":"F33*G33","v":0},{"$f":"$E$11","v":0},{"$f":"I33*F33","v":0},null,{"$f":"$C$11","v":4.83},{"$f":"K33*L33","v":0},null,{"$f":"      $D$11","v":0},{"$f":"N33*O33","v":0},{"$f":"$E$11","v":0},{"$f":"Q33*N33","v":0},null,null,"Haketus",null,{"$f":"$C$11","v":4.83},{"$f":"V33*W33","v":0},0,{"$f":"      $D$11","v":0},{"$f":"Y33*Z33","v":0},{"$f":"$E$11","v":0},{"$f":"AB33*Y33","v":0}]
[null,"Hake",null,{"$f":"$C$12","v":0},{"$f":"C34*D34","v":0},0,{"$f":"      $D$12","v":3.02},{"$f":"F34*G34","v":0},{"$f":"$E$12","v":0},{"$f":"I34*F34","v":0},null,{"$f":"$C$12","v":0},{"$f":"K34*L34","v":0},null,{"$f":"      $D$12","v":3.02},{"$f":"N34*O34","v":0},{"$f":"$E$12","v":0},{"$f":"Q34*N34","v":0},null,null,"Hake",0,{"$f":"$C$12","v":0},{"$f":"V34*W34","v":0},0,{"$f":"      $D$12","v":3.02},{"$f":"Y34*Z34","v":0},{"$f":"$E$12","v":0},{"$f":"AB34*Y34","v":0}]
[null,"Joulupuut",null,{"$f":"$C$13","v":0},{"$f":"C35*D35","v":0},0,{"$f":"      $D$13","v":0},{"$f":"F35*G35","v":0},{"$f":"$E$13","v":0},{"$f":"I35*F35","v":0},null,{"$f":"$C$13","v":0},{"$f":"K35*L35","v":0},null,{"$f":"      $D$13","v":0},{"$f":"N35*O35","v":0},{"$f":"$E$13","v":0},{"$f":"Q35*N35","v":0},null,null,"Joulupuut",null,{"$f":"$C$13","v":0},{"$f":"V35*W35","v":0},0,{"$f":"      $D$13","v":0},{"$f":"Y35*Z35","v":0},{"$f":"$E$13","v":0},{"$f":"AB35*Y35","v":0}]
[null,"Yhteensä",{"$f":"SUM(C31:C35)","v":0},null,{"$f":"SUM(E31:E35)","v":0},{"$f":"SUM(F31:F35)","v":0},null,{"$f":"SUM(H31:H35)","v":0},null,{"$f":"SUM(J31:J35)","v":0},{"$f":"SUM(K31:K35)","v":0},null,{"$f":"SUM(M31:M35)","v":0},{"$f":"SUM(N31:N35)","v":0},null,{"$f":"SUM(P31:P35)","v":0},null,{"$f":"SUM(R31:R35)","v":0},null,null,"Yhteensä",{"$f":"SUM(V31:V35)","v":0},null,{"$f":"SUM(X31:X35)","v":0},{"$f":"SUM(Y31:Y35)","v":0},null,{"$f":"SUM(AA31:AA35)","v":0},null,{"$f":"SUM(AC31:AC35)","v":0}]
[]
[null,null,"YHTEENSÄ",null,null,null,null,null,"EI METSÄVÄHENNYSTÄ",null,null,null,null,null,null,null,"METSÄVÄHENNYSOIKEUS"]
[null,"Hakkuutyön arvo",{"$f":"J39+R39","v":0},null,null,null,null,null,"Hakkuutyön arvo",{"$f":"E36","v":0},null,null,null,null,null,null,"Hakkuutyön arvo",{"$f":"M36","v":0},null,null,null,null,null,null,null,null,null,"Hakkuutyön arvo",{"$f":"X36","v":0}]
[null,"Kuljetuksen arvo",0,null,null,null,null,null,"Kuljetuksen arvo",{"$f":"H36","v":0},null,null,null,null,null,null,"Kuljetuksen arvo",{"$f":"P36","v":0},null,null,null,null,null,null,null,null,null,"Kuljetuksen arvo",{"$f":"AA36","v":0}]
[null,"Konekustannus (muuta vuosimenoa)",{"$f":"J41+R41","v":0},null,null,null,null,null,"Konekustannus",{"$f":"J36","v":0},null,null,null,null,null,null,"Konekustannus",{"$f":"R36","v":0},null,null,null,null,null,null,null,null,null,"Konekustannus",{"$f":"AC36","v":0}]
[null,"Hakkuun määrä yhteensä",0,null,null,null,null,null,"Hakkuun määrä",{"$f":"C36","v":0},null,null,null,null,null,null,"Hakkuun määrä",{"$f":"K36","v":0},null,null,null,null,null,null,null,null,null,"Hakkuun määrä",{"$f":"V36","v":0}]
[null,"Kuljetuksen määrä yhteensä",0,null,null,null,null,null,"Kuljetuksen määrä",{"$f":"F36","v":0},null,null,null,null,null,null,"Kuljetuksen määrä",{"$f":"N36","v":0},null,null,null,null,null,null,null,null,null,"Kuljetuksen määrä",{"$f":"Y36","v":0}]
[null,"Puutavaran verollinen arvo",0,null,null,null,null,null,"Puutavaran verollinen arvo",{"$f":"(D25-J39-J40-J41)","v":0},null,null,null,null,null,null,"Metsävähennykseen oikeuttava osa (verollinen osa)",{"$f":"(L25-R39-R40-R41)","v":0}]
[]
[]
[null,null,"Hakattu määrä yhteensä",null,{"$f":"C42","v":0}]
[null,null,"Kuljetettu määrä yhteensä",null,{"$f":"C43","v":0}]
[null,"Tarkistus:",{"$f":"IF(E48>E47,\"Kuljetettu määrä on valmistettua määrää suurempi\",IF(E48=E47,\"Valmistettu ja kuljetettu määrä yhtäsuuret\",\"Valmistettu määrä on kuljetettua määrää isompi\"))","v":"Valmistettu ja kuljetettu määrä yhtäsuuret"}]
[]
[null,"MAATILA 2","Ei metsävähennysoikeutta",null,null,null,null,null,null,null,"Metsävähennysoikeus",null,null,null,null,null,null,null,null,null,"MAATILA 2"]
[null,null,"Hankintatyötulot",{"$f":"Tulot!AW9","v":0},null,null,null,null,null,null,"Hankintatyötulot",{"$f":"Tulot!AX9","v":0},null,null,null,null,null,null,null,null,null,"Uinumaan jäävä hakkuumäärä"]
[]
[null,null,"HAKKUU",null,null,"KULJETUS",null,null,"KONEKULJETUS",null,"HAKKUU",null,null,"KULJETUS",null,null,"KONEKULJETUS",null,null,null,null,"HAKKUU",null,null,"KULJETUS",null,null,"KONEKULJETUS"]
[]
[null,null,null,"Valmistuksen arvo",null,"Määrä","Kuljetustyön arvo",null,"Konekustannus",null,null,"Valmistuksen arvo",null,"Määrä","Kuljetustyön arvo",null,"Konekustannus",null,null,null,null,null,"valmistuksen arvo",null,"Määrä","Kuljetustyön arvo",null,"Konekustannus"]
[null,null,"m3","€/m3","€","m3","€/m3"," \n€","€/m3","\n€","m3","€/m3","€","m3","€/m3"," \n€","€/m3","\n€",null,null,null,"m3","€/m3","€","m3","€/m3"," \n€","€/m3","\n€"]
[null,"Energiapuu (kokopuu)",null,{"$f":"$C$9","v":9.1},{"$f":"C58*D58","v":0},null,{"$f":"      $D$9","v":4.74},{"$f":"F58*G58","v":0},{"$f":"$E$9","v":0},{"$f":"I58*F58","v":0},null,{"$f":"$C$9","v":9.1},{"$f":"K58*L58","v":0},0,{"$f":"      $D$9","v":4.74},{"$f":"N58*O58","v":0},{"$f":"$E$9","v":0},{"$f":"Q58*N58","v":0},null,null,"Energiapuu (kokopuu)",null,{"$f":"$C$9","v":9.1},{"$f":"V58*W58","v":0},null,{"$f":"      $D$9","v":4.74},{"$f":"Y58*Z58","v":0},{"$f":"$E$9","v":0},{"$f":"AB58*Y58","v":0}]
[null,"Halot ja klapit",null,{"$f":"$C$10","v":30.94},{"$f":"C59*D59","v":0},null,{"$f":"      $D$10","v":3.02},{"$f":"F59*G59","v":0},{"$f":"$E$10","v":0},{"$f":"I59*F59","v":0},0,{"$f":"$C$10","v":30.94},{"$f":"K59*L59","v":0},0,{"$f":"      $D$10","v":3.02},{"$f":"N59*O59","v":0},{"$f":"$E$10","v":0},{"$f":"Q59*N59","v":0},null,null,"Halot ja klapit",null,{"$f":"$C$10","v":30.94},{"$f":"V59*W59","v":0},null,{"$f":"      $D$10","v":3.02},{"$f":"Y59*Z59","v":0},{"$f":"$E$10","v":0},{"$f":"AB59*Y59","v":0}]
[null,"Haketus",null,{"$f":"$C$11","v":4.83},{"$f":"C60*D60","v":0},0,{"$f":"      $D$11","v":0},{"$f":"F60*G60","v":0},{"$f":"$E$11","v":0},{"$f":"I60*F60","v":0},null,{"$f":"$C$11","v":4.83},{"$f":"K60*L60","v":0},null,{"$f":"      $D$11","v":0},{"$f":"N60*O60","v":0},{"$f":"$E$11","v":0},{"$f":"Q60*N60","v":0},null,null,"Haketus",null,{"$f":"$C$11","v":4.83},{"$f":"V60*W60","v":0},0,{"$f":"      $D$11","v":0},{"$f":"Y60*Z60","v":0},{"$f":"$E$11","v":0},{"$f":"AB60*Y60","v":0}]
[null,"Hake",null,{"$f":"$C$12","v":0},{"$f":"C61*D61","v":0},0,{"$f":"      $D$12","v":3.02},{"$f":"F61*G61","v":0},{"$f":"$E$12","v":0},{"$f":"I61*F61","v":0},0,{"$f":"$C$12","v":0},{"$f":"K61*L61","v":0},0,{"$f":"      $D$12","v":3.02},{"$f":"N61*O61","v":0},{"$f":"$E$12","v":0},{"$f":"Q61*N61","v":0},null,null,"Hake",0,{"$f":"$C$12","v":0},{"$f":"V61*W61","v":0},0,{"$f":"      $D$12","v":3.02},{"$f":"Y61*Z61","v":0},{"$f":"$E$12","v":0},{"$f":"AB61*Y61","v":0}]
[null,"Joulupuut",0,{"$f":"$C$13","v":0},{"$f":"C62*D62","v":0},null,{"$f":"      $D$13","v":0},{"$f":"F62*G62","v":0},{"$f":"$E$13","v":0},{"$f":"I62*F62","v":0},0,{"$f":"$C$13","v":0},{"$f":"K62*L62","v":0},0,{"$f":"      $D$13","v":0},{"$f":"N62*O62","v":0},{"$f":"$E$13","v":0},{"$f":"Q62*N62","v":0},null,null,"Joulupuut",null,{"$f":"$C$13","v":0},{"$f":"V62*W62","v":0},0,{"$f":"      $D$13","v":0},{"$f":"Y62*Z62","v":0},{"$f":"$E$13","v":0},{"$f":"AB62*Y62","v":0}]
[null,"Yhteensä",{"$f":"SUM(C58:C62)","v":0},null,{"$f":"SUM(E58:E62)","v":0},{"$f":"SUM(F58:F62)","v":0},null,{"$f":"SUM(H58:H62)","v":0},null,{"$f":"SUM(J58:J62)","v":0},{"$f":"SUM(K58:K62)","v":0},null,{"$f":"SUM(M58:M62)","v":0},{"$f":"SUM(N58:N62)","v":0},null,{"$f":"SUM(P58:P62)","v":0},null,{"$f":"SUM(R58:R62)","v":0},null,null,"Yhteensä",{"$f":"SUM(V58:V62)","v":0},null,{"$f":"SUM(X58:X62)","v":0},{"$f":"SUM(Y58:Y62)","v":0},null,{"$f":"SUM(AA58:AA62)","v":0},null,{"$f":"SUM(AC58:AC62)","v":0}]
[]
[null,null,"YHTEENSÄ",null,null,null,null,null,"EI METSÄVÄHENNYSTÄ",null,null,null,null,null,null,null,"METSÄVÄHENNYSOIKEUS"]
[null,"Hakkuutyön arvo",{"$f":"J66+R66","v":0},null,null,null,null,null,"Hakkuutyön arvo",{"$f":"E63","v":0},null,null,null,null,null,null,"Hakkuutyön arvo",{"$f":"M63","v":0},null,null,null,null,null,null,null,null,null,"Hakkuutyön arvo",{"$f":"X63","v":0}]
[null,"Kuljetuksen arvo",0,null,null,null,null,null,"Kuljetuksen arvo",{"$f":"H63","v":0},null,null,null,null,null,null,"Kuljetuksen arvo",{"$f":"P63","v":0},null,null,null,null,null,null,null,null,null,"Kuljetuksen arvo",{"$f":"AA63","v":0}]
[null,"Konekustannus (muuta vuosimenoa)",0,null,null,null,null,null,"Konekustannus",{"$f":"J63","v":0},null,null,null,null,null,null,"Konekustannus",{"$f":"R63","v":0},null,null,null,null,null,null,null,null,null,"Konekustannus",{"$f":"AC63","v":0}]
[null,"Hakkuun määrä yhteensä",0,null,null,null,null,null,"Hakkuun määrä",{"$f":"C63","v":0},null,null,null,null,null,null,"Hakkuun määrä",{"$f":"K63","v":0},null,null,null,null,null,null,null,null,null,"Hakkuun määrä",{"$f":"V63","v":0}]
[null,"Kuljetuksen määrä yhteensä",0,null,null,null,null,null,"Kuljetuksen määrä",{"$f":"F63","v":0},null,null,null,null,null,null,"Kuljetuksen määrä",{"$f":"N63","v":0},null,null,null,null,null,null,null,null,null,"Kuljetuksen määrä",{"$f":"Y63","v":0}]
[null,"Puutavaran verollinen arvo",0,null,null,null,null,null,"Puutavaran verollinen arvo",{"$f":"(D52-J66-J67-J68)","v":0},null,null,null,null,null,null,"Metsävähennykseen oikeuttava osa (verollinen osa)",{"$f":"(L52-R66-R67-R68)","v":0}]
[]
[]
[null,null,"Hakattu määrä yhteensä",null,{"$f":"C69","v":0}]
[null,null,"Kuljetettu määrä yhteensä",null,{"$f":"C70","v":0}]
[null,"Tarkistus:",{"$f":"IF(E75>E74,\"Kuljetettu määrä on valmistettua määrää suurempi\",IF(E75=E74,\"Valmistettu ja kuljetettu määrä yhtäsuuret\",\"Valmistettu määrä on kuljetettua määrää isompi\"))","v":"Valmistettu ja kuljetettu määrä yhtäsuuret"}]
[]
[null,"MAATILA 3","Ei metsävähennysoikeutta",null,null,null,null,null,null,null,"Metsävähennysoikeus",null,null,null,null,null,null,null,null,null,"MAATILA 3"]
[null,null,"Hankintatyötulot",{"$f":"Tulot!AY9","v":0},null,null,null,null,null,null,"Hankintatyötulot",{"$f":"Tulot!AZ9","v":0},null,null,null,null,null,null,null,null,null,"Uinumaan jäävä hakkuumäärä"]
[]
[null,null,"HAKKUU",null,null,"KULJETUS",null,null,"KONEKULJETUS",null,"HAKKUU",null,null,"KULJETUS",null,null,"KONEKULJETUS",null,null,null,null,"HAKKUU",null,null,"KULJETUS",null,null,"KONEKULJETUS"]
[]
[null,null,null,"Valmistuksen arvo",null,"Määrä","Kuljetustyön arvo",null,"Konekustannus",null,null,"Valmistuksen arvo",null,"Määrä","Kuljetustyön arvo",null,"Konekustannus",null,null,null,null,null,"valmistuksen arvo",null,"Määrä","Kuljetustyön arvo",null,"Konekustannus"]
[null,null,"m3","€/m3","€","m3","€/m3"," \n€","€/m3","\n€","m3","€/m3","€","m3","€/m3"," \n€","€/m3","\n€",null,null,null,"m3","€/m3","€","m3","€/m3"," \n€","€/m3","\n€"]
[null,"Energiapuu (kokopuu)",null,{"$f":"$C$9","v":9.1},{"$f":"C85*D85","v":0},null,{"$f":"      $D$9","v":4.74},{"$f":"F85*G85","v":0},{"$f":"$E$9","v":0},{"$f":"I85*F85","v":0},null,{"$f":"$C$9","v":9.1},{"$f":"K85*L85","v":0},0,{"$f":"      $D$9","v":4.74},{"$f":"N85*O85","v":0},{"$f":"$E$9","v":0},{"$f":"Q85*N85","v":0},null,null,"Energiapuu (kokopuu)",null,{"$f":"$C$9","v":9.1},{"$f":"V85*W85","v":0},null,{"$f":"      $D$9","v":4.74},{"$f":"Y85*Z85","v":0},{"$f":"$E$9","v":0},{"$f":"AB85*Y85","v":0}]
[null,"Halot ja klapit",0,{"$f":"$C$10","v":30.94},{"$f":"C86*D86","v":0},0,{"$f":"      $D$10","v":3.02},{"$f":"F86*G86","v":0},{"$f":"$E$10","v":0},{"$f":"I86*F86","v":0},0,{"$f":"$C$10","v":30.94},{"$f":"K86*L86","v":0},0,{"$f":"      $D$10","v":3.02},{"$f":"N86*O86","v":0},{"$f":"$E$10","v":0},{"$f":"Q86*N86","v":0},null,null,"Halot ja klapit",null,{"$f":"$C$10","v":30.94},{"$f":"V86*W86","v":0},null,{"$f":"      $D$10","v":3.02},{"$f":"Y86*Z86","v":0},{"$f":"$E$10","v":0},{"$f":"AB86*Y86","v":0}]
[null,"Haketus",null,{"$f":"$C$11","v":4.83},{"$f":"C87*D87","v":0},null,{"$f":"      $D$11","v":0},{"$f":"F87*G87","v":0},{"$f":"$E$11","v":0},{"$f":"I87*F87","v":0},null,{"$f":"$C$11","v":4.83},{"$f":"K87*L87","v":0},null,{"$f":"      $D$11","v":0},{"$f":"N87*O87","v":0},{"$f":"$E$11","v":0},{"$f":"Q87*N87","v":0},null,null,"Haketus",null,{"$f":"$C$11","v":4.83},{"$f":"V87*W87","v":0},0,{"$f":"      $D$11","v":0},{"$f":"Y87*Z87","v":0},{"$f":"$E$11","v":0},{"$f":"AB87*Y87","v":0}]
[null,"Hake",null,{"$f":"$C$12","v":0},{"$f":"C88*D88","v":0},0,{"$f":"      $D$12","v":3.02},{"$f":"F88*G88","v":0},{"$f":"$E$12","v":0},{"$f":"I88*F88","v":0},0,{"$f":"$C$12","v":0},{"$f":"K88*L88","v":0},0,{"$f":"      $D$12","v":3.02},{"$f":"N88*O88","v":0},{"$f":"$E$12","v":0},{"$f":"Q88*N88","v":0},null,null,"Hake",0,{"$f":"$C$12","v":0},{"$f":"V88*W88","v":0},0,{"$f":"      $D$12","v":3.02},{"$f":"Y88*Z88","v":0},{"$f":"$E$12","v":0},{"$f":"AB88*Y88","v":0}]
[null,"Joulupuut",0,{"$f":"$C$13","v":0},{"$f":"C89*D89","v":0},null,{"$f":"      $D$13","v":0},{"$f":"F89*G89","v":0},{"$f":"$E$13","v":0},{"$f":"I89*F89","v":0},0,{"$f":"$C$13","v":0},{"$f":"K89*L89","v":0},0,{"$f":"      $D$13","v":0},{"$f":"N89*O89","v":0},{"$f":"$E$13","v":0},{"$f":"Q89*N89","v":0},null,null,"Joulupuut",null,{"$f":"$C$13","v":0},{"$f":"V89*W89","v":0},0,{"$f":"      $D$13","v":0},{"$f":"Y89*Z89","v":0},{"$f":"$E$13","v":0},{"$f":"AB89*Y89","v":0}]
[null,"Yhteensä",{"$f":"SUM(C85:C89)","v":0},null,{"$f":"SUM(E85:E89)","v":0},{"$f":"SUM(F85:F89)","v":0},null,{"$f":"SUM(H85:H89)","v":0},null,{"$f":"SUM(J85:J89)","v":0},{"$f":"SUM(K85:K89)","v":0},null,{"$f":"SUM(M85:M89)","v":0},{"$f":"SUM(N85:N89)","v":0},null,{"$f":"SUM(P85:P89)","v":0},null,{"$f":"SUM(R85:R89)","v":0},null,null,"Yhteensä",{"$f":"SUM(V85:V89)","v":0},null,{"$f":"SUM(X85:X89)","v":0},{"$f":"SUM(Y85:Y89)","v":0},null,{"$f":"SUM(AA85:AA89)","v":0},null,{"$f":"SUM(AC85:AC89)","v":0}]
[]
[null,null,"YHTEENSÄ",null,null,null,null,null,"EI METSÄVÄHENNYSTÄ",null,null,null,null,null,null,null,"METSÄVÄHENNYSOIKEUS"]
[null,"Hakkuutyön arvo",{"$f":"J93+R93","v":0},null,null,null,null,null,"Hakkuutyön arvo",{"$f":"E90","v":0},null,null,null,null,null,null,"Hakkuutyön arvo",{"$f":"M90","v":0},null,null,null,null,null,null,null,null,null,"Hakkuutyön arvo",{"$f":"X90","v":0}]
[null,"Kuljetuksen arvo",0,null,null,null,null,null,"Kuljetuksen arvo",{"$f":"H90","v":0},null,null,null,null,null,null,"Kuljetuksen arvo",{"$f":"P90","v":0},null,null,null,null,null,null,null,null,null,"Kuljetuksen arvo",{"$f":"AA90","v":0}]
[null,"Konekustannus (muuta vuosimenoa)",0,null,null,null,null,null,"Konekustannus",{"$f":"J90","v":0},null,null,null,null,null,null,"Konekustannus",{"$f":"R90","v":0},null,null,null,null,null,null,null,null,null,"Konekustannus",{"$f":"AC90","v":0}]
[null,"Hakkuun määrä yhteensä",0,null,null,null,null,null,"Hakkuun määrä",{"$f":"C90","v":0},null,null,null,null,null,null,"Hakkuun määrä",{"$f":"K90","v":0},null,null,null,null,null,null,null,null,null,"Hakkuun määrä",{"$f":"V90","v":0}]
[null,"Kuljetuksen määrä yhteensä",0,null,null,null,null,null,"Kuljetuksen määrä",{"$f":"F90","v":0},null,null,null,null,null,null,"Kuljetuksen määrä",{"$f":"N90","v":0},null,null,null,null,null,null,null,null,null,"Kuljetuksen määrä",{"$f":"Y90","v":0}]
[null,"Puutavaran verollinen arvo",0,null,null,null,null,null,"Puutavaran verollinen arvo",{"$f":"(D79-J93-J94-J95)","v":0},null,null,null,null,null,null,"Metsävähennykseen oikeuttava osa (verollinen osa)",{"$f":"(L79-R93-R94-R95)","v":0}]
[]
[]
[null,null,"Hakattu määrä yhteensä",null,{"$f":"C96","v":0}]
[null,null,"Kuljetettu määrä yhteensä",null,{"$f":"C97","v":0}]
[null,"Tarkistus:",{"$f":"IF(E102>E101,\"Kuljetettu määrä on valmistettua määrää suurempi\",IF(E102=E101,\"Valmistettu ja kuljetettu määrä yhtäsuuret\",\"Valmistettu määrä on kuljetettua määrää isompi\"))","v":"Valmistettu ja kuljetettu määrä yhtäsuuret"}]
[]
[null,"MAATILA 4","Ei metsävähennysoikeutta",null,null,null,null,null,null,null,"Metsävähennysoikeus",null,null,null,null,null,null,null,null,null,"MAATILA 4"]
[null,null,"Hankintatyötulot",{"$f":"Tulot!BA9","v":0},null,null,null,null,null,null,"Hankintatyötulot",{"$f":"Tulot!BB9","v":0},null,null,null,null,null,null,null,null,null,"Uinumaan jäävä hakkuumäärä"]
[]
[null,null,"HAKKUU",null,null,"KULJETUS",null,null,"KONEKULJETUS",null,"HAKKUU",null,null,"KULJETUS",null,null,"KONEKULJETUS",null,null,null,null,"HAKKUU",null,null,"KULJETUS",null,null,"KONEKULJETUS"]
[]
[null,null,null,"Valmistuksen arvo",null,"Määrä","Kuljetustyön arvo",null,"Konekustannus",null,null,"Valmistuksen arvo",null,"Määrä","Kuljetustyön arvo",null,"Konekustannus",null,null,null,null,null,"valmistuksen arvo",null,"Määrä","Kuljetustyön arvo",null,"Konekustannus"]
[null,null,"m3","€/m3","€","m3","€/m3"," \n€","€/m3","\n€","m3","€/m3","€","m3","€/m3"," \n€","€/m3","\n€",null,null,null,"m3","€/m3","€","m3","€/m3"," \n€","€/m3","\n€"]
[null,"Energiapuu (kokopuu)",null,{"$f":"$C$9","v":9.1},{"$f":"C112*D112","v":0},null,{"$f":"      $D$9","v":4.74},{"$f":"F112*G112","v":0},{"$f":"$E$9","v":0},{"$f":"I112*F112","v":0},null,{"$f":"$C$9","v":9.1},{"$f":"K112*L112","v":0},0,{"$f":"      $D$9","v":4.74},{"$f":"N112*O112","v":0},{"$f":"$E$9","v":0},{"$f":"Q112*N112","v":0},null,null,"Energiapuu (kokopuu)",null,{"$f":"$C$9","v":9.1},{"$f":"V112*W112","v":0},null,{"$f":"      $D$9","v":4.74},{"$f":"Y112*Z112","v":0},{"$f":"$E$9","v":0},{"$f":"AB112*Y112","v":0}]
[null,"Halot ja klapit",0,{"$f":"$C$10","v":30.94},{"$f":"C113*D113","v":0},0,{"$f":"      $D$10","v":3.02},{"$f":"F113*G113","v":0},{"$f":"$E$10","v":0},{"$f":"I113*F113","v":0},0,{"$f":"$C$10","v":30.94},{"$f":"K113*L113","v":0},0,{"$f":"      $D$10","v":3.02},{"$f":"N113*O113","v":0},{"$f":"$E$10","v":0},{"$f":"Q113*N113","v":0},null,null,"Halot ja klapit",null,{"$f":"$C$10","v":30.94},{"$f":"V113*W113","v":0},null,{"$f":"      $D$10","v":3.02},{"$f":"Y113*Z113","v":0},{"$f":"$E$10","v":0},{"$f":"AB113*Y113","v":0}]
[null,"Haketus",null,{"$f":"$C$11","v":4.83},{"$f":"C114*D114","v":0},0,{"$f":"      $D$11","v":0},{"$f":"F114*G114","v":0},{"$f":"$E$11","v":0},{"$f":"I114*F114","v":0},null,{"$f":"$C$11","v":4.83},{"$f":"K114*L114","v":0},null,{"$f":"      $D$11","v":0},{"$f":"N114*O114","v":0},{"$f":"$E$11","v":0},{"$f":"Q114*N114","v":0},null,null,"Haketus",null,{"$f":"$C$11","v":4.83},{"$f":"V114*W114","v":0},0,{"$f":"      $D$11","v":0},{"$f":"Y114*Z114","v":0},{"$f":"$E$11","v":0},{"$f":"AB114*Y114","v":0}]
[null,"Hake",null,{"$f":"$C$12","v":0},{"$f":"C115*D115","v":0},0,{"$f":"      $D$12","v":3.02},{"$f":"F115*G115","v":0},{"$f":"$E$12","v":0},{"$f":"I115*F115","v":0},0,{"$f":"$C$12","v":0},{"$f":"K115*L115","v":0},0,{"$f":"      $D$12","v":3.02},{"$f":"N115*O115","v":0},{"$f":"$E$12","v":0},{"$f":"Q115*N115","v":0},null,null,"Hake",0,{"$f":"$C$12","v":0},{"$f":"V115*W115","v":0},0,{"$f":"      $D$12","v":3.02},{"$f":"Y115*Z115","v":0},{"$f":"$E$12","v":0},{"$f":"AB115*Y115","v":0}]
[null,"Joulupuut",0,{"$f":"$C$13","v":0},{"$f":"C116*D116","v":0},null,{"$f":"      $D$13","v":0},{"$f":"F116*G116","v":0},{"$f":"$E$13","v":0},{"$f":"I116*F116","v":0},0,{"$f":"$C$13","v":0},{"$f":"K116*L116","v":0},0,{"$f":"      $D$13","v":0},{"$f":"N116*O116","v":0},{"$f":"$E$13","v":0},{"$f":"Q116*N116","v":0},null,null,"Joulupuut",null,{"$f":"$C$13","v":0},{"$f":"V116*W116","v":0},0,{"$f":"      $D$13","v":0},{"$f":"Y116*Z116","v":0},{"$f":"$E$13","v":0},{"$f":"AB116*Y116","v":0}]
[null,"Yhteensä",{"$f":"SUM(C112:C116)","v":0},null,{"$f":"SUM(E112:E116)","v":0},{"$f":"SUM(F112:F116)","v":0},null,{"$f":"SUM(H112:H116)","v":0},null,{"$f":"SUM(J112:J116)","v":0},{"$f":"SUM(K112:K116)","v":0},null,{"$f":"SUM(M112:M116)","v":0},{"$f":"SUM(N112:N116)","v":0},null,{"$f":"SUM(P112:P116)","v":0},null,{"$f":"SUM(R112:R116)","v":0},null,null,"Yhteensä",{"$f":"SUM(V112:V116)","v":0},null,{"$f":"SUM(X112:X116)","v":0},{"$f":"SUM(Y112:Y116)","v":0},null,{"$f":"SUM(AA112:AA116)","v":0},null,{"$f":"SUM(AC112:AC116)","v":0}]
[]
[null,null,"YHTEENSÄ",null,null,null,null,null,"EI METSÄVÄHENNYSTÄ",null,null,null,null,null,null,null,"METSÄVÄHENNYSOIKEUS"]
[null,"Hakkuutyön arvo",{"$f":"J120+R120","v":0},null,null,null,null,null,"Hakkuutyön arvo",{"$f":"E117","v":0},null,null,null,null,null,null,"Hakkuutyön arvo",{"$f":"M117","v":0},null,null,null,null,null,null,null,null,null,"Hakkuutyön arvo",{"$f":"X117","v":0}]
[null,"Kuljetuksen arvo",0,null,null,null,null,null,"Kuljetuksen arvo",{"$f":"H117","v":0},null,null,null,null,null,null,"Kuljetuksen arvo",{"$f":"P117","v":0},null,null,null,null,null,null,null,null,null,"Kuljetuksen arvo",{"$f":"AA117","v":0}]
[null,"Konekustannus (muuta vuosimenoa)",0,null,null,null,null,null,"Konekustannus",{"$f":"J117","v":0},null,null,null,null,null,null,"Konekustannus",{"$f":"R117","v":0},null,null,null,null,null,null,null,null,null,"Konekustannus",{"$f":"AC117","v":0}]
[null,"Hakkuun määrä yhteensä",0,null,null,null,null,null,"Hakkuun määrä",{"$f":"C117","v":0},null,null,null,null,null,null,"Hakkuun määrä",{"$f":"K117","v":0},null,null,null,null,null,null,null,null,null,"Hakkuun määrä",{"$f":"V117","v":0}]
[null,"Kuljetuksen määrä yhteensä",0,null,null,null,null,null,"Kuljetuksen määrä",{"$f":"F117","v":0},null,null,null,null,null,null,"Kuljetuksen määrä",{"$f":"N117","v":0},null,null,null,null,null,null,null,null,null,"Kuljetuksen määrä",{"$f":"Y117","v":0}]
[null,"Puutavaran verollinen arvo",0,null,null,null,null,null,"Puutavaran verollinen arvo",{"$f":"(D106-J120-J121-J122)","v":0},null,null,null,null,null,null,"Metsävähennykseen oikeuttava osa (verollinen osa)",{"$f":"(L106-R120-R121-R122)","v":0}]
[]
[]
[null,null,"Hakattu määrä yhteensä",null,{"$f":"C123","v":0}]
[null,null,"Kuljetettu määrä yhteensä",null,{"$f":"C124","v":0}]
[null,"Tarkistus:",{"$f":"IF(E129>E128,\"Kuljetettu määrä on valmistettua määrää suurempi\",IF(E129=E128,\"Valmistettu ja kuljetettu määrä yhtäsuuret\",\"Valmistettu määrä on kuljetettua määrää isompi\"))","v":"Valmistettu ja kuljetettu määrä yhtäsuuret"}]
[]
[null,"MAATILA 5","Ei metsävähennysoikeutta",null,null,null,null,null,null,null,"Metsävähennysoikeus",null,null,null,null,null,null,null,null,null,"MAATILA 5"]
[null,null,"Hankintatyötulot",{"$f":"Tulot!BC9","v":0},null,null,null,null,null,null,"Hankintatyötulot",{"$f":"Tulot!BD9","v":0},null,null,null,null,null,null,null,null,null,"Uinumaan jäävä hakkuumäärä"]
[]
[null,null,"HAKKUU",null,null,"KULJETUS",null,null,"KONEKULJETUS",null,"HAKKUU",null,null,"KULJETUS",null,null,"KONEKULJETUS",null,null,null,null,"HAKKUU",null,null,"KULJETUS",null,null,"KONEKULJETUS"]
[]
[null,null,null,"Valmistuksen arvo",null,"Määrä","Kuljetustyön arvo",null,"Konekustannus",null,null,"Valmistuksen arvo",null,"Määrä","Kuljetustyön arvo",null,"Konekustannus",null,null,null,null,null,"valmistuksen arvo",null,"Määrä","Kuljetustyön arvo",null,"Konekustannus"]
[null,null,"m3","€/m3","€","m3","€/m3"," \n€","€/m3","\n€","m3","€/m3","€","m3","€/m3"," \n€","€/m3","\n€",null,null,null,"m3","€/m3","€","m3","€/m3"," \n€","€/m3","\n€"]
[null,"Energiapuu (kokopuu)",null,{"$f":"$C$9","v":9.1},{"$f":"C139*D139","v":0},null,{"$f":"      $D$9","v":4.74},{"$f":"F139*G139","v":0},{"$f":"$E$9","v":0},{"$f":"I139*F139","v":0},null,{"$f":"$C$9","v":9.1},{"$f":"K139*L139","v":0},0,{"$f":"      $D$9","v":4.74},{"$f":"N139*O139","v":0},{"$f":"$E$9","v":0},{"$f":"Q139*N139","v":0},null,null,"Energiapuu (kokopuu)",null,{"$f":"$C$9","v":9.1},{"$f":"V139*W139","v":0},null,{"$f":"      $D$9","v":4.74},{"$f":"Y139*Z139","v":0},{"$f":"$E$9","v":0},{"$f":"AB139*Y139","v":0}]
[null,"Halot ja klapit",0,{"$f":"$C$10","v":30.94},{"$f":"C140*D140","v":0},0,{"$f":"      $D$10","v":3.02},{"$f":"F140*G140","v":0},{"$f":"$E$10","v":0},{"$f":"I140*F140","v":0},0,{"$f":"$C$10","v":30.94},{"$f":"K140*L140","v":0},0,{"$f":"      $D$10","v":3.02},{"$f":"N140*O140","v":0},{"$f":"$E$10","v":0},{"$f":"Q140*N140","v":0},null,null,"Halot ja klapit",null,{"$f":"$C$10","v":30.94},{"$f":"V140*W140","v":0},null,{"$f":"      $D$10","v":3.02},{"$f":"Y140*Z140","v":0},{"$f":"$E$10","v":0},{"$f":"AB140*Y140","v":0}]
[null,"Haketus",null,{"$f":"$C$11","v":4.83},{"$f":"C141*D141","v":0},0,{"$f":"      $D$11","v":0},{"$f":"F141*G141","v":0},{"$f":"$E$11","v":0},{"$f":"I141*F141","v":0},null,{"$f":"$C$11","v":4.83},{"$f":"K141*L141","v":0},null,{"$f":"      $D$11","v":0},{"$f":"N141*O141","v":0},{"$f":"$E$11","v":0},{"$f":"Q141*N141","v":0},null,null,"Haketus",null,{"$f":"$C$11","v":4.83},{"$f":"V141*W141","v":0},0,{"$f":"      $D$11","v":0},{"$f":"Y141*Z141","v":0},{"$f":"$E$11","v":0},{"$f":"AB141*Y141","v":0}]
[null,"Hake",null,{"$f":"$C$12","v":0},{"$f":"C142*D142","v":0},0,{"$f":"      $D$12","v":3.02},{"$f":"F142*G142","v":0},{"$f":"$E$12","v":0},{"$f":"I142*F142","v":0},0,{"$f":"$C$12","v":0},{"$f":"K142*L142","v":0},0,{"$f":"      $D$12","v":3.02},{"$f":"N142*O142","v":0},{"$f":"$E$12","v":0},{"$f":"Q142*N142","v":0},null,null,"Hake",0,{"$f":"$C$12","v":0},{"$f":"V142*W142","v":0},0,{"$f":"      $D$12","v":3.02},{"$f":"Y142*Z142","v":0},{"$f":"$E$12","v":0},{"$f":"AB142*Y142","v":0}]
[null,"Joulupuut",0,{"$f":"$C$13","v":0},{"$f":"C143*D143","v":0},null,{"$f":"      $D$13","v":0},{"$f":"F143*G143","v":0},{"$f":"$E$13","v":0},{"$f":"I143*F143","v":0},0,{"$f":"$C$13","v":0},{"$f":"K143*L143","v":0},0,{"$f":"      $D$13","v":0},{"$f":"N143*O143","v":0},{"$f":"$E$13","v":0},{"$f":"Q143*N143","v":0},null,null,"Joulupuut",null,{"$f":"$C$13","v":0},{"$f":"V143*W143","v":0},0,{"$f":"      $D$13","v":0},{"$f":"Y143*Z143","v":0},{"$f":"$E$13","v":0},{"$f":"AB143*Y143","v":0}]
[null,"Yhteensä",{"$f":"SUM(C139:C143)","v":0},null,{"$f":"SUM(E139:E143)","v":0},{"$f":"SUM(F139:F143)","v":0},null,{"$f":"SUM(H139:H143)","v":0},null,{"$f":"SUM(J139:J143)","v":0},{"$f":"SUM(K139:K143)","v":0},null,{"$f":"SUM(M139:M143)","v":0},{"$f":"SUM(N139:N143)","v":0},null,{"$f":"SUM(P139:P143)","v":0},null,{"$f":"SUM(R139:R143)","v":0},null,null,"Yhteensä",{"$f":"SUM(V139:V143)","v":0},null,{"$f":"SUM(X139:X143)","v":0},{"$f":"SUM(Y139:Y143)","v":0},null,{"$f":"SUM(AA139:AA143)","v":0},null,{"$f":"SUM(AC139:AC143)","v":0}]
[]
[null,null,"YHTEENSÄ",null,null,null,null,null,"EI METSÄVÄHENNYSTÄ",null,null,null,null,null,null,null,"METSÄVÄHENNYSOIKEUS"]
[null,"Hakkuutyön arvo",{"$f":"J147+R147","v":0},null,null,null,null,null,"Hakkuutyön arvo",{"$f":"E144","v":0},null,null,null,null,null,null,"Hakkuutyön arvo",{"$f":"M144","v":0},null,null,null,null,null,null,null,null,null,"Hakkuutyön arvo",{"$f":"X144","v":0}]
[null,"Kuljetuksen arvo",0,null,null,null,null,null,"Kuljetuksen arvo",{"$f":"H144","v":0},null,null,null,null,null,null,"Kuljetuksen arvo",{"$f":"P144","v":0},null,null,null,null,null,null,null,null,null,"Kuljetuksen arvo",{"$f":"AA144","v":0}]
[null,"Konekustannus (muuta vuosimenoa)",0,null,null,null,null,null,"Konekustannus",{"$f":"J144","v":0},null,null,null,null,null,null,"Konekustannus",{"$f":"R144","v":0},null,null,null,null,null,null,null,null,null,"Konekustannus",{"$f":"AC144","v":0}]
[null,"Hakkuun määrä yhteensä",0,null,null,null,null,null,"Hakkuun määrä",{"$f":"C144","v":0},null,null,null,null,null,null,"Hakkuun määrä",{"$f":"K144","v":0},null,null,null,null,null,null,null,null,null,"Hakkuun määrä",{"$f":"V144","v":0}]
[null,"Kuljetuksen määrä yhteensä",0,null,null,null,null,null,"Kuljetuksen määrä",{"$f":"F144","v":0},null,null,null,null,null,null,"Kuljetuksen määrä",{"$f":"N144","v":0},null,null,null,null,null,null,null,null,null,"Kuljetuksen määrä",{"$f":"Y144","v":0}]
[null,"Puutavaran verollinen arvo",0,null,null,null,null,null,"Puutavaran verollinen arvo",{"$f":"(D133-J147-J148-J149)","v":0},null,null,null,null,null,null,"Metsävähennykseen oikeuttava osa (verollinen osa)",{"$f":"(L133-R147-R148-R149)","v":0}]
[]
[]
[null,null,"Hakattu määrä yhteensä",null,{"$f":"C150","v":0}]
[null,null,"Kuljetettu määrä yhteensä",null,{"$f":"C151","v":0}]
[null,"Tarkistus:",{"$f":"IF(E156>E155,\"Kuljetettu määrä on valmistettua määrää suurempi\",IF(E156=E155,\"Valmistettu ja kuljetettu määrä yhtäsuuret\",\"Valmistettu määrä on kuljetettua määrää isompi\"))","v":"Valmistettu ja kuljetettu määrä yhtäsuuret"}]
[null,"Määrätarkistus:",{"$f":"IF(E157>E156,\"Kuljetettu määrä on valmistettua määrää suurempi\",IF(E157=E156,\"Valmistettu ja kuljetettu määrä yhtäsuuret\",\"Valmistettumääräonkuljetettuamäärääisompi\"))","v":"Valmistettu ja kuljetettu määrä yhtäsuuret"}]

{"sheet":"Menot","index":6,"n_rows":634,"n_cols":55,"rows_kept":634,"cut":false,"hidden":false,"merged":[[20,34,21,46],[5,32,7,32],[9,1,9,4],[5,29,5,31],[8,1,8,4],[12,34,13,35],[10,1,10,4],[11,18,11,20],[11,15,11,17],[11,21,11,23],[4,29,4,31],[5,2,5,3],[4,8,4,10],[5,7,6,7],[5,5,7,5],[2,6,2,22],[6,18,6,19],[6,21,6,22],[5,15,5,22],[5,11,5,14]]}
[]
[null,{"$f":"Etusivu!C10","v":"Matti Metsänen"},null,null,null,"DEMOSSA voit testata kahta ylintä riviä"]
[null,{"$f":"Etusivu!C16","v":"123456-7"}]
[]
[null,"MENOT",null,null,null,null,null,null,{"$f":"IF(Etusivu!$C$22=\"kyllä\",\"Arvonlisäverovelvollinen\",\"Ei arvonlisäverovelvollinen\")","v":"Arvonlisäverovelvollinen"},null,null,null,null,null,null,null,null,null,null,null,null,null,null,null,null,null,null,null,null,"Jos erittelet metsätalouden osuuden tässä, \nKäytä sarakkeella G (Metsätalouden osuus) 100%"]
[null,"Kuitti","Päiväys",null,null,"Menoluokka","Koko summa","Metsä-talouden osuus","ALV:n osuus","Vähennys- kelpoinen","Väh.kelp. summa ","Vuosimenot",null,null,null,"Poistot (alv 0 %)",null,null,null,null,null,null,null,null,null,"Tiliöinti",null,"Maatalouteen \nkuuluva",null,"Muistiinpanoihin sisältyvät \nmuun toiminnan menot (alv 0%)",null,null,"Lisää kuitti upotettuna objektina"]
[null,"N:o","pv","kk"," Selite",null,"sis. alv",null,"alv-%","alv €","alv 0 %","Palkat","Matkat","Muut","Erittely","koneet",null,null,"rakennukset",null,null,"ojat, tiet",null,null,null,null,null,"meno ",null,"Maatalous","Elinkeinotoiminta","Yksityismenot",null,null,null,null,null,null,null,null,null,null,null,null,null,null,null,null,null,null,null,null,"Valikkoarvot"]
[null,"YHTEENSÄ",null,null,null,null,{"$f":"SUM(G13:G634)","v":1794.2},null,null,{"$f":"SUM(J10:J634)","v":303.60000000000002},{"$f":"SUM(K13:K634)","v":1490.6},{"$f":"SUM(L13:L634)","v":0},{"$f":"SUM(M9:M634)","v":44.64},{"$f":"SUM(N10:N634)","v":773.47},{"$f":"SUM(O10:O634)","v":0},{"$f":"SUM(P13:P634)","v":717.13},null,null,{"$f":"SUM(S13:S634)","v":0},null,null,{"$f":"SUM(V13:V634)","v":0},null,null,null,null,null,{"$f":"SUM(AB13:AB634)","v":0},null,{"$f":"SUM(AD13:AD634)","v":0},{"$f":"SUM(AE13:AE634)","v":0},{"$f":"SUM(AF13:AF634)","v":0},null,null,null,null,null,null,null,null,null,null,null,null,null,null,null,null,null,null,null,null,1,"Palkat",0.24]
[null,"Vuoden matkakulut ajopäiväkirjasta",null,null,null,null,null,null,null,null,{"$f":"M9","v":44.64},null,{"$f":"Ajopäiv.!L4","v":44.64},null,null,null,null,null,null,null,null,null,null,null,null,201,null,null,null,null,null,null,null,null,null,null,null,null,null,null,null,null,null,null,null,null,null,null,null,null,null,null,2,"Matkat",0.1]
[null,"Arvionvaraiset ja lainojen kulut",null,null,null,null,null,null,null,{"$f":"Arvionvaraiset!G34","v":0},{"$f":"N10","v":0},null,null,{"$f":"Arvionvaraiset!G35+Velat!L11","v":0},null,null,null,null,null,null,null,null,null,null,null,null,null,null,null,null,null,null,null,null,null,null,null,null,null,null,null,null,null,null,null,null,null,null,null,null,null,null,3,"Muut",0]
[null,"Hankintatyön konekustannusosuus",null,null,null,null,null,null,null,null,{"$f":"N11","v":0},null,null,{"$f":"SUM('Hank.työ 1'!J11:N11)+SUM('Hank.työ 2'!C8:G8)","v":0},null,null,null,null,null,null,null,null,null,null,null,null,null,null,null,null,null,null,null,null,null,null,null,null,null,null,null,null,null,null,null,null,null,null,null,null,null,null,4,"Erittely"]
[null,null,null,null,null,null,null,null,null,null,null,"Palkat","Matkat","Muut","Erittely","Konepoisto",null,null,"Rak.poisto",null,null,"Oja/tie poisto",null,null,null,null,null,"Maatalouden meno",null,null,null,null,null,null,null,null,null,null,null,null,null,null,null,null,null,null,null,null,null,null,null,null,5,"Konepoisto"]
[null,200,1,3,"Esimerkkikirjaus, Mette 2025","Muut",44.2,1,{"$f":"IF(Etusivu!$C$22=\"kyllä\",25.5%,0%)","v":0.255},{"$f":"H13*((G13-(AD13+AE13+AF13)*(1+I13))-((G13-(AD13+AE13+AF13)*(1+I13))/(1+I13)))","v":8.98},{"$f":"H13*(G13/(1+I13))","v":35.22},{"$f":"IF($F13=L$12,$K13,0)","v":0},0,35.22,0,0,null,{"$f":"IF(P13>0,IF(Q13<1,\" !\",\"\"),\"\")","v":""},{"$f":"IF($F13=S$12,$K13,0)","v":0},null,{"$f":"IF(S13>0,IF(T13<1,\" !\",\"\"),\"\")","v":""},{"$f":"IF($F13=V$12,$K13,0)","v":0},null,{"$f":"IF(V13>0,IF(W13<1,\" !\",\"\"),\"\")","v":""},null,210,null,{"$f":"IF($F13=AB$12,$K13,0)","v":0},null,null,null,null,null,null,"OHJEITA",null,null,null,null,null,null,null,null,null,null,null,null,null,null,null,null,null,6,"Rak.poisto"]
[null,201,null,null,null,null,null,1,{"$f":"IF(Etusivu!$C$22=\"kyllä\",25.5%,0%)","v":0.255},{"$f":"H14*((G14-(AD14+AE14+AF14)*(1+I14))-((G14-(AD14+AE14+AF14)*(1+I14))/(1+I14)))","v":0},{"$f":"H14*(G14/(1+I14))","v":0},0,0,0,0,0,null,{"$f":"IF(P14>0,IF(Q14<1,\" !\",\"\"),\"\")","v":""},{"$f":"IF($F14=S$12,$K14,0)","v":0},null,{"$f":"IF(S14>0,IF(T14<1,\" !\",\"\"),\"\")","v":""},{"$f":"IF($F14=V$12,$K14,0)","v":0},null,{"$f":"IF(V14>0,IF(W14<1,\" !\",\"\"),\"\")","v":""},null,null,null,{"$f":"IF($F14=AB$12,$K14,0)","v":0},null,null,null,null,null,null,null,null,null,null,null,null,null,null,null,null,null,null,null,null,null,null,null,null,7,"Oja/tie poisto"]
[null,202,8,9,"Metsävakuutus","Muut",300,1,0,{"$f":"H15*((G15-(AD15+AE15+AF15)*(1+I15))-((G15-(AD15+AE15+AF15)*(1+I15))/(1+I15)))","v":0},{"$f":"H15*(G15/(1+I15))","v":300},{"$f":"IF($F15=L$12,$K15,0)","v":0},0,{"$f":"IF($F15=N$12,$K15,0)","v":300},{"$f":"IF($F15=O$12,$K15,0)","v":0},{"$f":"IF($F15=P$12,$K15,0)","v":0},null,{"$f":"IF(P15>0,IF(Q15<1,\" !\",\"\"),\"\")","v":""},{"$f":"IF($F15=S$12,$K15,0)","v":0},null,{"$f":"IF(S15>0,IF(T15<1,\" !\",\"\"),\"\")","v":""},{"$f":"IF($F15=V$12,$K15,0)","v":0},null,{"$f":"IF(V15>0,IF(W15<1,\" !\",\"\"),\"\")","v":""},null,null,null,0,null,null,null,null,null,null,"o Muista kirjata menon päiväys. Sen perusteella Mette laskee ALV:n oikealle kuukaudelle ja vie tulon sisältävän arvonlisveron jatkolaskentaan.",null,null,null,null,null,null,null,null,null,null,null,null,null,null,null,null,null,null,"Maatalouden meno"]
[null,203,9,10,"Maanmuokkaus Mhy","Muut",550,1,{"$f":"IF(Etusivu!$C$22=\"kyllä\",25.5%,0%)","v":0.255},{"$f":"H16*((G16-(AD16+AE16+AF16)*(1+I16))-((G16-(AD16+AE16+AF16)*(1+I16))/(1+I16)))","v":111.75},{"$f":"H16*(G16/(1+I16))","v":438.25},0,0,438.25,0,0,null,{"$f":"IF(P16>0,IF(Q16<1,\" !\",\"\"),\"\")","v":""},0,null,{"$f":"IF(S16>0,IF(T16<1,\" !\",\"\"),\"\")","v":""},0,null,{"$f":"IF(V16>0,IF(W16<1,\" !\",\"\"),\"\")","v":""},null,null,null,0,null,null,null,null,null,null,"o Poistoihin kirjattavien menojen kirjaaminen tapahtuu tämän taulukon kautta. "]
[null,204,10,11,"Moottorisaha","Konepoisto",900,1,{"$f":"IF(Etusivu!$C$22=\"kyllä\",25.5%,0%)","v":0.255},{"$f":"H17*((G17-(AD17+AE17+AF17)*(1+I17))-((G17-(AD17+AE17+AF17)*(1+I17))/(1+I17)))","v":182.87},{"$f":"H17*(G17/(1+I17))","v":717.13},0,0,{"$f":"IF($F17=N$12,$K17,0)","v":0},0,717.13,2,"",0,null,"",0,null,"",null,null,null,0,null,null,null,null,null,null,"o Kun arvonlisäveroprosentti poikkeaa 24%:sta. Muuta oikea prosenttimäärä ALV-sarakkeeseen itse "]
[null,205,null,null,null,null,null,1,{"$f":"IF(Etusivu!$C$22=\"kyllä\",25.5%,0%)","v":0.255},0,0,0,0,0,0,0,null,"",0,null,"",0,null,"",null,null,null,0,null,null,null,null,null,null,"OHJE "]
[null,206,null,null,null,null,null,1,{"$f":"IF(Etusivu!$C$22=\"kyllä\",25.5%,0%)","v":0.255},0,0,0,0,{"$f":"IF($F19=N$12,$K19,0)","v":0},0,0,null,"",0,null,"",0,null,"",null,null,null,0,null,null,null,null,null,null,"OHJE: 'taulukon suojauksen poitaminen"]
[null,207,null,null,null,null,null,1,{"$f":"IF(Etusivu!$C$22=\"kyllä\",25.5%,0%)","v":0.255},0,0,0,0,0,0,0,null,"",0,null,"",0,null,"",null,null,null,0,null,null,null,null,null,null,"o Katso kuitin lisäämisen ohje tarkemmin Tulot välilehdeltä."]
[null,208,null,null,null,null,null,1,{"$f":"IF(Etusivu!$C$22=\"kyllä\",25.5%,0%)","v":0.255},0,0,0,0,{"$f":"IF($F21=N$12,$K21,0)","v":0},0,0,null,"",0,null,"",0,null,"",null,null,null,0]
[null,209,null,null,null,null,null,1,{"$f":"IF(Etusivu!$C$22=\"kyllä\",25.5%,0%)","v":0.255},0,0,0,0,0,0,0,null,"",0,null,"",0,null,"",null,null,null,0]
[null,210,null,null,null,null,null,1,{"$f":"IF(Etusivu!$C$22=\"kyllä\",25.5%,0%)","v":0.255},0,0,0,0,{"$f":"IF($F23=N$12,$K23,0)","v":0},0,0,null,"",0,null,"",0,null,"",null,null,null,0]
[null,211,null,null,null,null,null,1,{"$f":"IF(Etusivu!$C$22=\"kyllä\",25.5%,0%)","v":0.255},0,0,0,0,0,0,0,null,"",0,null,"",0,null,"",null,null,null,0]
[null,212,null,null,null,null,null,1,{"$f":"IF(Etusivu!$C$22=\"kyllä\",25.5%,0%)","v":0.255},0,0,0,0,{"$f":"IF($F25=N$12,$K25,0)","v":0},0,0,null,"",0,null,"",0,null,"",null,null,null,0]
[null,213,null,null,null,null,null,1,{"$f":"IF(Etusivu!$C$22=\"kyllä\",25.5%,0%)","v":0.255},0,0,0,0,0,0,0,null,"",0,null,"",0,null,"",null,null,null,0]
[null,214,null,null,null,null,null,1,{"$f":"IF(Etusivu!$C$22=\"kyllä\",25.5%,0%)","v":0.255},0,0,0,0,{"$f":"IF($F27=N$12,$K27,0)","v":0},0,0,null,"",0,null,"",0,null,"",null,null,null,0]
[null,215,null,null,null,null,null,1,{"$f":"IF(Etusivu!$C$22=\"kyllä\",25.5%,0%)","v":0.255},0,0,0,0,0,0,0,null,"",0,null,"",0,null,"",null,null,null,0]
[null,216,null,null,null,null,null,1,{"$f":"IF(Etusivu!$C$22=\"kyllä\",25.5%,0%)","v":0.255},0,0,0,0,{"$f":"IF($F29=N$12,$K29,0)","v":0},{"$f":"IF($F29=O$12,$K29,0)","v":0},0,null,"",0,null,"",0,null,"",null,null,null,0]
[null,217,null,null,null,null,null,1,{"$f":"IF(Etusivu!$C$22=\"kyllä\",25.5%,0%)","v":0.255},0,0,0,0,0,0,0,null,"",0,null,"",0,null,"",null,null,null,0]
[null,218,null,null,null,null,null,1,{"$f":"IF(Etusivu!$C$22=\"kyllä\",25.5%,0%)","v":0.255},0,0,0,0,{"$f":"IF($F31=N$12,$K31,0)","v":0},0,0,null,"",0,null,"",0,null,"",null,null,null,0]
[null,219,null,null,null,null,null,1,{"$f":"IF(Etusivu!$C$22=\"kyllä\",25.5%,0%)","v":0.255},0,0,0,0,0,0,0,null,"",0,null,"",0,null,"",null,null,null,0]
[null,220,null,null,null,null,null,1,{"$f":"IF(Etusivu!$C$22=\"kyllä\",25.5%,0%)","v":0.255},0,0,0,0,{"$f":"IF($F33=N$12,$K33,0)","v":0},0,0,null,"",0,null,"",0,null,"",null,null,null,0]
[null,221,null,null,null,null,null,1,{"$f":"IF(Etusivu!$C$22=\"kyllä\",25.5%,0%)","v":0.255},0,0,0,0,0,0,0,null,"",0,null,"",0,null,"",null,null,null,0]
[null,222,null,null,null,null,null,1,{"$f":"IF(Etusivu!$C$22=\"kyllä\",25.5%,0%)","v":0.255},0,0,0,0,{"$f":"IF($F35=N$12,$K35,0)","v":0},0,0,null,"",0,null,"",0,null,"",null,null,null,0]
[null,223,null,null,null,null,null,1,{"$f":"IF(Etusivu!$C$22=\"kyllä\",25.5%,0%)","v":0.255},0,0,0,0,0,0,0,null,"",0,null,"",0,null,"",null,null,null,0]
[null,224,null,null,null,null,null,1,{"$f":"IF(Etusivu!$C$22=\"kyllä\",25.5%,0%)","v":0.255},0,0,0,0,{"$f":"IF($F37=N$12,$K37,0)","v":0},0,0,null,"",0,null,"",0,null,"",null,null,null,0]
[null,225,null,null,null,null,null,1,{"$f":"IF(Etusivu!$C$22=\"kyllä\",25.5%,0%)","v":0.255},0,0,0,0,0,0,0,null,"",0,null,"",0,null,"",null,null,null,0]
[null,226,null,null,null,null,null,1,{"$f":"IF(Etusivu!$C$22=\"kyllä\",25.5%,0%)","v":0.255},0,0,0,0,{"$f":"IF($F39=N$12,$K39,0)","v":0},0,0,null,"",0,null,"",0,null,"",null,null,null,0]
[null,227,null,null,null,null,null,1,{"$f":"IF(Etusivu!$C$22=\"kyllä\",25.5%,0%)","v":0.255},0,0,0,0,0,0,0,null,"",0,null,"",0,null,"",null,null,null,0]
[null,228,null,null,null,null,null,1,{"$f":"IF(Etusivu!$C$22=\"kyllä\",25.5%,0%)","v":0.255},0,0,0,0,{"$f":"IF($F41=N$12,$K41,0)","v":0},0,0,null,"",0,null,"",0,null,"",null,null,null,0]
[null,229,null,null,null,null,null,1,{"$f":"IF(Etusivu!$C$22=\"kyllä\",25.5%,0%)","v":0.255},0,0,0,0,0,0,0,null,"",0,null,"",0,null,"",null,null,null,0]
[null,230,null,null,null,null,null,1,{"$f":"IF(Etusivu!$C$22=\"kyllä\",25.5%,0%)","v":0.255},0,0,0,0,{"$f":"IF($F43=N$12,$K43,0)","v":0},0,0,null,"",0,null,"",0,null,"",null,null,null,0]
[null,231,null,null,null,null,null,1,{"$f":"IF(Etusivu!$C$22=\"kyllä\",25.5%,0%)","v":0.255},0,0,0,0,0,0,0,null,"",0,null,"",0,null,"",null,null,null,0]
[null,232,null,null,null,null,null,1,{"$f":"IF(Etusivu!$C$22=\"kyllä\",25.5%,0%)","v":0.255},0,0,0,0,{"$f":"IF($F45=N$12,$K45,0)","v":0},0,0,null,"",0,null,"",0,null,"",null,null,null,0]
[null,233,null,null,null,null,null,1,{"$f":"IF(Etusivu!$C$22=\"kyllä\",25.5%,0%)","v":0.255},0,0,0,0,0,0,0,null,"",0,null,"",0,null,"",null,null,null,0]
[null,234,null,null,null,null,null,1,{"$f":"IF(Etusivu!$C$22=\"kyllä\",25.5%,0%)","v":0.255},0,0,0,0,{"$f":"IF($F47=N$12,$K47,0)","v":0},0,0,null,"",0,null,"",0,null,"",null,null,null,0]
[null,235,null,null,null,null,null,1,{"$f":"IF(Etusivu!$C$22=\"kyllä\",25.5%,0%)","v":0.255},0,0,0,0,0,0,0,null,"",0,null,"",0,null,"",null,null,null,0]
[null,236,null,null,null,null,null,1,{"$f":"IF(Etusivu!$C$22=\"kyllä\",25.5%,0%)","v":0.255},0,0,0,0,{"$f":"IF($F49=N$12,$K49,0)","v":0},0,0,null,"",0,null,"",0,null,"",null,null,null,0]
[null,237,null,null,null,null,null,1,{"$f":"IF(Etusivu!$C$22=\"kyllä\",25.5%,0%)","v":0.255},0,0,0,0,0,0,0,null,"",0,null,"",0,null,"",null,null,null,0]
[null,238,null,null,null,null,null,1,{"$f":"IF(Etusivu!$C$22=\"kyllä\",25.5%,0%)","v":0.255},0,0,0,0,{"$f":"IF($F51=N$12,$K51,0)","v":0},0,0,null,"",0,null,"",0,null,"",null,null,null,0]
[null,239,null,null,null,null,null,1,{"$f":"IF(Etusivu!$C$22=\"kyllä\",25.5%,0%)","v":0.255},0,0,0,0,0,0,0,null,"",0,null,"",0,null,"",null,null,null,0]
[null,240,null,null,null,null,null,1,{"$f":"IF(Etusivu!$C$22=\"kyllä\",25.5%,0%)","v":0.255},0,0,0,0,{"$f":"IF($F53=N$12,$K53,0)","v":0},0,0,null,"",0,null,"",0,null,"",null,null,null,0]
[null,241,null,null,null,null,null,1,{"$f":"IF(Etusivu!$C$22=\"kyllä\",25.5%,0%)","v":0.255},0,0,0,0,0,0,0,null,"",0,null,"",0,null,"",null,null,null,0]
[null,242,null,null,null,null,null,1,{"$f":"IF(Etusivu!$C$22=\"kyllä\",25.5%,0%)","v":0.255},0,0,0,0,{"$f":"IF($F55=N$12,$K55,0)","v":0},0,0,null,"",0,null,"",0,null,"",null,null,null,0]
[null,243,null,null,null,null,null,1,{"$f":"IF(Etusivu!$C$22=\"kyllä\",25.5%,0%)","v":0.255},0,0,0,0,0,0,0,null,"",0,null,"",0,null,"",null,null,null,0]
[null,244,null,null,null,null,null,1,{"$f":"IF(Etusivu!$C$22=\"kyllä\",25.5%,0%)","v":0.255},0,0,0,0,{"$f":"IF($F57=N$12,$K57,0)","v":0},0,0,null,"",0,null,"",0,null,"",null,null,null,0]
[null,245,null,null,null,null,null,1,{"$f":"IF(Etusivu!$C$22=\"kyllä\",25.5%,0%)","v":0.255},0,0,0,{"$f":"IF($F58=M$12,$K58,0)","v":0},0,0,0,null,"",0,null,"",0,null,"",null,null,null,0]
[null,246,null,null,null,null,null,1,{"$f":"IF(Etusivu!$C$22=\"kyllä\",25.5%,0%)","v":0.255},0,0,{"$f":"IF($F59=L$12,$K59,0)","v":0},{"$f":"IF($F59=M$12,$K59,0)","v":0},{"$f":"IF($F59=N$12,$K59,0)","v":0},0,0,null,"",0,null,"",0,null,"",null,null,null,0]
[null,247,null,null,null,null,null,1,{"$f":"IF(Etusivu!$C$22=\"kyllä\",25.5%,0%)","v":0.255},0,0,0,0,0,0,0,null,"",0,null,"",0,null,"",null,null,null,0]
[null,248,null,null,null,null,null,1,{"$f":"IF(Etusivu!$C$22=\"kyllä\",25.5%,0%)","v":0.255},0,0,{"$f":"IF($F61=L$12,$K61,0)","v":0},{"$f":"IF($F61=M$12,$K61,0)","v":0},{"$f":"IF($F61=N$12,$K61,0)","v":0},0,0,null,"",0,null,"",0,null,"",null,null,null,0]
[null,249,null,null,null,null,null,1,{"$f":"IF(Etusivu!$C$22=\"kyllä\",25.5%,0%)","v":0.255},0,0,0,0,0,0,0,null,"",0,null,"",0,null,"",null,null,null,0]
[null,250,null,null,null,null,null,1,{"$f":"IF(Etusivu!$C$22=\"kyllä\",25.5%,0%)","v":0.255},0,0,{"$f":"IF($F63=L$12,$K63,0)","v":0},{"$f":"IF($F63=M$12,$K63,0)","v":0},{"$f":"IF($F63=N$12,$K63,0)","v":0},0,0,null,"",0,null,"",0,null,"",null,null,null,0]
[null,251,null,null,null,null,null,1,{"$f":"IF(Etusivu!$C$22=\"kyllä\",25.5%,0%)","v":0.255},0,0,0,0,0,0,0,null,"",0,null,"",0,null,"",null,null,null,0]
[null,252,null,null,null,null,null,1,{"$f":"IF(Etusivu!$C$22=\"kyllä\",25.5%,0%)","v":0.255},0,0,{"$f":"IF($F65=L$12,$K65,0)","v":0},{"$f":"IF($F65=M$12,$K65,0)","v":0},{"$f":"IF($F65=N$12,$K65,0)","v":0},0,0,null,"",0,null,"",0,null,"",null,null,null,0]
[null,253,null,null,null,null,null,1,{"$f":"IF(Etusivu!$C$22=\"kyllä\",25.5%,0%)","v":0.255},0,0,0,0,0,0,0,null,"",0,null,"",0,null,"",null,null,null,0]
[null,254,null,null,null,null,null,1,{"$f":"IF(Etusivu!$C$22=\"kyllä\",25.5%,0%)","v":0.255},0,0,{"$f":"IF($F67=L$12,$K67,0)","v":0},{"$f":"IF($F67=M$12,$K67,0)","v":0},{"$f":"IF($F67=N$12,$K67,0)","v":0},0,0,null,"",0,null,"",0,null,"",null,null,null,0]
[null,255,null,null,null,null,null,1,{"$f":"IF(Etusivu!$C$22=\"kyllä\",25.5%,0%)","v":0.255},0,0,0,0,0,0,0,null,"",0,null,"",0,null,"",null,null,null,0]
[null,256,null,null,null,null,null,1,{"$f":"IF(Etusivu!$C$22=\"kyllä\",25.5%,0%)","v":0.255},0,0,{"$f":"IF($F69=L$12,$K69,0)","v":0},{"$f":"IF($F69=M$12,$K69,0)","v":0},{"$f":"IF($F69=N$12,$K69,0)","v":0},0,0,null,"",0,null,"",0,null,"",null,null,null,0]
[null,257,null,null,null,null,null,1,{"$f":"IF(Etusivu!$C$22=\"kyllä\",25.5%,0%)","v":0.255},0,0,0,0,0,0,0,null,"",0,null,"",0,null,"",null,null,null,0]
[null,258,null,null,null,null,null,1,{"$f":"IF(Etusivu!$C$22=\"kyllä\",25.5%,0%)","v":0.255},0,0,{"$f":"IF($F71=L$12,$K71,0)","v":0},{"$f":"IF($F71=M$12,$K71,0)","v":0},{"$f":"IF($F71=N$12,$K71,0)","v":0},0,0,null,"",0,null,"",0,null,"",null,null,null,0]
[null,259,null,null,null,null,null,1,{"$f":"IF(Etusivu!$C$22=\"kyllä\",25.5%,0%)","v":0.255},0,0,0,0,0,0,0,null,"",0,null,"",0,null,"",null,null,null,0]
[null,260,null,null,null,null,null,1,{"$f":"IF(Etusivu!$C$22=\"kyllä\",25.5%,0%)","v":0.255},0,0,{"$f":"IF($F73=L$12,$K73,0)","v":0},{"$f":"IF($F73=M$12,$K73,0)","v":0},{"$f":"IF($F73=N$12,$K73,0)","v":0},0,0,null,"",0,null,"",0,null,"",null,null,null,0]
[null,261,null,null,null,null,null,1,{"$f":"IF(Etusivu!$C$22=\"kyllä\",25.5%,0%)","v":0.255},0,0,0,0,0,0,0,null,"",0,null,"",0,null,"",null,null,null,0]
[null,262,null,null,null,null,null,1,{"$f":"IF(Etusivu!$C$22=\"kyllä\",25.5%,0%)","v":0.255},0,0,{"$f":"IF($F75=L$12,$K75,0)","v":0},{"$f":"IF($F75=M$12,$K75,0)","v":0},{"$f":"IF($F75=N$12,$K75,0)","v":0},0,0,null,"",0,null,"",0,null,"",null,null,null,0]
[null,263,null,null,null,null,null,1,{"$f":"IF(Etusivu!$C$22=\"kyllä\",25.5%,0%)","v":0.255},0,0,0,0,0,0,0,null,"",0,null,"",0,null,"",null,null,null,0]
[null,264,null,null,null,null,null,1,{"$f":"IF(Etusivu!$C$22=\"kyllä\",25.5%,0%)","v":0.255},0,0,{"$f":"IF($F77=L$12,$K77,0)","v":0},{"$f":"IF($F77=M$12,$K77,0)","v":0},{"$f":"IF($F77=N$12,$K77,0)","v":0},0,0,null,"",0,null,"",0,null,"",null,null,null,0]
[null,265,null,null,null,null,null,1,{"$f":"IF(Etusivu!$C$22=\"kyllä\",25.5%,0%)","v":0.255},0,0,0,0,0,0,0,null,"",0,null,"",0,null,"",null,null,null,{"$f":"IF($F78=AB$12,$K78,0)","v":0}]
[null,266,null,null,null,null,null,1,{"$f":"IF(Etusivu!$C$22=\"kyllä\",25.5%,0%)","v":0.255},0,0,{"$f":"IF($F79=L$12,$K79,0)","v":0},{"$f":"IF($F79=M$12,$K79,0)","v":0},0,0,0,null,"",{"$f":"IF($F79=S$12,$K79,0)","v":0},null,"",{"$f":"IF($F79=V$12,$K79,0)","v":0},null,"",null,null,null,0]
[null,267,null,null,null,null,null,1,{"$f":"IF(Etusivu!$C$22=\"kyllä\",25.5%,0%)","v":0.255},0,0,0,0,0,0,0,null,{"$f":"IF(P80>0,IF(Q80<1,\" !\",\"\"),\"\")","v":""},0,null,{"$f":"IF(S80>0,IF(T80<1,\" !\",\"\"),\"\")","v":""},0,null,{"$f":"IF(V80>0,IF(W80<1,\" !\",\"\"),\"\")","v":""},null,null,null,0]
[null,268,null,null,null,null,null,1,{"$f":"IF(Etusivu!$C$22=\"kyllä\",25.5%,0%)","v":0.255},{"$f":"H81*((G81-(AD81+AE81+AF81)*(1+I81))-((G81-(AD81+AE81+AF81)*(1+I81))/(1+I81)))","v":0},{"$f":"H81*(G81/(1+I81))","v":0},{"$f":"IF($F81=L$12,$K81,0)","v":0},{"$f":"IF($F81=M$12,$K81,0)","v":0},0,0,0,null,"",0,null,"",0,null,"",null,null,null,0]
[null,269,null,null,null,null,null,1,{"$f":"IF(Etusivu!$C$22=\"kyllä\",25.5%,0%)","v":0.255},0,0,0,0,0,0,0,null,"",0,null,"",0,null,"",null,null,null,0]
[null,270,null,null,null,null,null,1,{"$f":"IF(Etusivu!$C$22=\"kyllä\",25.5%,0%)","v":0.255},0,0,{"$f":"IF($F83=L$12,$K83,0)","v":0},{"$f":"IF($F83=M$12,$K83,0)","v":0},0,0,0,null,"",0,null,"",0,null,"",null,null,null,0]
[null,271,null,null,null,null,null,1,{"$f":"IF(Etusivu!$C$22=\"kyllä\",25.5%,0%)","v":0.255},0,0,0,0,0,0,0,null,"",0,null,"",0,null,"",null,null,null,0]
[null,272,null,null,null,null,null,1,{"$f":"IF(Etusivu!$C$22=\"kyllä\",25.5%,0%)","v":0.255},0,0,{"$f":"IF($F85=L$12,$K85,0)","v":0},{"$f":"IF($F85=M$12,$K85,0)","v":0},0,0,0,null,"",0,null,"",0,null,"",null,null,null,0]
[null,273,null,null,null,null,null,1,{"$f":"IF(Etusivu!$C$22=\"kyllä\",25.5%,0%)","v":0.255},0,0,0,0,0,0,0,null,"",0,null,"",0,null,"",null,null,null,0]
[null,274,null,null,null,null,null,1,{"$f":"IF(Etusivu!$C$22=\"kyllä\",25.5%,0%)","v":0.255},0,0,{"$f":"IF($F87=L$12,$K87,0)","v":0},{"$f":"IF($F87=M$12,$K87,0)","v":0},0,0,0,null,"",0,null,"",0,null,"",null,null,null,0]
[null,275,null,null,null,null,null,1,{"$f":"IF(Etusivu!$C$22=\"kyllä\",25.5%,0%)","v":0.255},0,0,0,0,0,0,0,null,"",0,null,"",0,null,"",null,null,null,0]
[null,276,null,null,null,null,null,1,{"$f":"IF(Etusivu!$C$22=\"kyllä\",25.5%,0%)","v":0.255},0,0,{"$f":"IF($F89=L$12,$K89,0)","v":0},{"$f":"IF($F89=M$12,$K89,0)","v":0},0,0,0,null,"",0,null,"",0,null,"",null,null,null,0]
[null,277,null,null,null,null,null,1,{"$f":"IF(Etusivu!$C$22=\"kyllä\",25.5%,0%)","v":0.255},0,0,0,0,0,0,0,null,"",0,null,"",0,null,"",null,null,null,0]
[null,278,null,null,null,null,null,1,{"$f":"IF(Etusivu!$C$22=\"kyllä\",25.5%,0%)","v":0.255},0,0,{"$f":"IF($F91=L$12,$K91,0)","v":0},{"$f":"IF($F91=M$12,$K91,0)","v":0},0,0,0,null,"",0,null,"",0,null,"",null,null,null,0]
[null,279,null,null,null,null,null,1,{"$f":"IF(Etusivu!$C$22=\"kyllä\",25.5%,0%)","v":0.255},0,0,0,0,0,0,0,null,"",0,null,"",0,null,"",null,null,null,0]
[null,280,null,null,null,null,null,1,{"$f":"IF(Etusivu!$C$22=\"kyllä\",25.5%,0%)","v":0.255},0,0,{"$f":"IF($F93=L$12,$K93,0)","v":0},{"$f":"IF($F93=M$12,$K93,0)","v":0},0,0,0,null,"",0,null,"",0,null,"",null,null,null,0]
[null,281,null,null,null,null,null,1,{"$f":"IF(Etusivu!$C$22=\"kyllä\",25.5%,0%)","v":0.255},0,0,0,0,0,0,0,null,"",0,null,"",0,null,"",null,null,null,0]
[null,282,null,null,null,null,null,1,{"$f":"IF(Etusivu!$C$22=\"kyllä\",25.5%,0%)","v":0.255},0,0,{"$f":"IF($F95=L$12,$K95,0)","v":0},{"$f":"IF($F95=M$12,$K95,0)","v":0},0,0,0,null,"",0,null,"",0,null,"",null,null,null,0]
[null,283,null,null,null,null,null,1,{"$f":"IF(Etusivu!$C$22=\"kyllä\",25.5%,0%)","v":0.255},0,0,0,0,0,0,0,null,"",0,null,"",0,null,"",null,null,null,0]
[null,284,null,null,null,null,null,1,{"$f":"IF(Etusivu!$C$22=\"kyllä\",25.5%,0%)","v":0.255},0,0,{"$f":"IF($F97=L$12,$K97,0)","v":0},{"$f":"IF($F97=M$12,$K97,0)","v":0},0,0,0,null,"",0,null,"",0,null,"",null,null,null,0]
[null,285,null,null,null,null,null,1,{"$f":"IF(Etusivu!$C$22=\"kyllä\",25.5%,0%)","v":0.255},0,0,0,0,0,0,0,null,"",0,null,"",0,null,"",null,null,null,0]
[null,286,null,null,null,null,null,1,{"$f":"IF(Etusivu!$C$22=\"kyllä\",25.5%,0%)","v":0.255},0,0,{"$f":"IF($F99=L$12,$K99,0)","v":0},{"$f":"IF($F99=M$12,$K99,0)","v":0},0,0,0,null,"",0,null,"",0,null,"",null,null,null,0]
[null,287,null,null,null,null,null,1,{"$f":"IF(Etusivu!$C$22=\"kyllä\",25.5%,0%)","v":0.255},0,0,0,0,0,0,0,null,"",0,null,"",0,null,"",null,null,null,0]
[null,288,null,null,null,null,null,1,{"$f":"IF(Etusivu!$C$22=\"kyllä\",25.5%,0%)","v":0.255},0,0,{"$f":"IF($F101=L$12,$K101,0)","v":0},{"$f":"IF($F101=M$12,$K101,0)","v":0},0,0,0,null,"",0,null,"",0,null,"",null,null,null,0]
[null,289,null,null,null,null,null,1,{"$f":"IF(Etusivu!$C$22=\"kyllä\",25.5%,0%)","v":0.255},0,0,0,0,0,0,0,null,"",0,null,"",0,null,"",null,null,null,0]
[null,290,null,null,null,null,null,1,{"$f":"IF(Etusivu!$C$22=\"kyllä\",25.5%,0%)","v":0.255},0,0,{"$f":"IF($F103=L$12,$K103,0)","v":0},{"$f":"IF($F103=M$12,$K103,0)","v":0},0,0,0,null,"",0,null,"",0,null,"",null,null,null,0]
[null,291,null,null,null,null,null,1,{"$f":"IF(Etusivu!$C$22=\"kyllä\",25.5%,0%)","v":0.255},0,0,0,0,0,0,0,null,"",0,null,"",0,null,"",null,null,null,0]
[null,292,null,null,null,null,null,1,{"$f":"IF(Etusivu!$C$22=\"kyllä\",25.5%,0%)","v":0.255},0,0,{"$f":"IF($F105=L$12,$K105,0)","v":0},{"$f":"IF($F105=M$12,$K105,0)","v":0},0,0,0,null,"",0,null,"",0,null,"",null,null,null,0]
[null,293,null,null,null,null,null,1,{"$f":"IF(Etusivu!$C$22=\"kyllä\",25.5%,0%)","v":0.255},0,0,0,0,0,0,0,null,"",0,null,"",0,null,"",null,null,null,0]
[null,294,null,null,null,null,null,1,{"$f":"IF(Etusivu!$C$22=\"kyllä\",25.5%,0%)","v":0.255},0,0,{"$f":"IF($F107=L$12,$K107,0)","v":0},{"$f":"IF($F107=M$12,$K107,0)","v":0},0,0,0,null,"",0,null,"",0,null,"",null,null,null,0]
[null,295,null,null,null,null,null,1,{"$f":"IF(Etusivu!$C$22=\"kyllä\",25.5%,0%)","v":0.255},0,0,0,0,0,0,0,null,"",0,null,"",0,null,"",null,null,null,0]
[null,296,null,null,null,null,null,1,{"$f":"IF(Etusivu!$C$22=\"kyllä\",25.5%,0%)","v":0.255},0,0,{"$f":"IF($F109=L$12,$K109,0)","v":0},{"$f":"IF($F109=M$12,$K109,0)","v":0},0,0,0,null,"",0,null,"",0,null,"",null,null,null,0]
[null,297,null,null,null,null,null,1,{"$f":"IF(Etusivu!$C$22=\"kyllä\",25.5%,0%)","v":0.255},0,0,0,0,0,0,0,null,"",0,null,"",0,null,"",null,null,null,0]
[null,298,null,null,null,null,null,1,{"$f":"IF(Etusivu!$C$22=\"kyllä\",25.5%,0%)","v":0.255},0,0,{"$f":"IF($F111=L$12,$K111,0)","v":0},{"$f":"IF($F111=M$12,$K111,0)","v":0},0,0,0,null,"",0,null,"",0,null,"",null,null,null,0]
[null,299,null,null,null,null,null,1,{"$f":"IF(Etusivu!$C$22=\"kyllä\",25.5%,0%)","v":0.255},0,0,0,0,0,0,0,null,"",0,null,"",0,null,"",null,null,null,0]
[null,300,null,null,null,null,null,1,{"$f":"IF(Etusivu!$C$22=\"kyllä\",25.5%,0%)","v":0.255},0,0,{"$f":"IF($F113=L$12,$K113,0)","v":0},{"$f":"IF($F113=M$12,$K113,0)","v":0},0,0,0,null,"",0,null,"",0,null,"",null,null,null,0]
[null,301,null,null,null,null,null,1,{"$f":"IF(Etusivu!$C$22=\"kyllä\",25.5%,0%)","v":0.255},0,0,0,0,0,0,0,null,"",0,null,"",0,null,"",null,null,null,0]
[null,302,null,null,null,null,null,1,{"$f":"IF(Etusivu!$C$22=\"kyllä\",25.5%,0%)","v":0.255},0,0,{"$f":"IF($F115=L$12,$K115,0)","v":0},{"$f":"IF($F115=M$12,$K115,0)","v":0},0,0,0,null,"",0,null,"",0,null,"",null,null,null,0]
[null,303,null,null,null,null,null,1,{"$f":"IF(Etusivu!$C$22=\"kyllä\",25.5%,0%)","v":0.255},0,0,0,0,0,0,0,null,"",0,null,"",0,null,"",null,null,null,0]
[null,304,null,null,null,null,null,1,{"$f":"IF(Etusivu!$C$22=\"kyllä\",25.5%,0%)","v":0.255},0,0,{"$f":"IF($F117=L$12,$K117,0)","v":0},{"$f":"IF($F117=M$12,$K117,0)","v":0},0,0,0,null,"",0,null,"",0,null,"",null,null,null,0]
[null,305,null,null,null,null,null,1,{"$f":"IF(Etusivu!$C$22=\"kyllä\",25.5%,0%)","v":0.255},0,0,0,0,0,0,0,null,"",0,null,"",0,null,"",null,null,null,0]
[null,306,null,null,null,null,null,1,{"$f":"IF(Etusivu!$C$22=\"kyllä\",25.5%,0%)","v":0.255},0,0,{"$f":"IF($F119=L$12,$K119,0)","v":0},{"$f":"IF($F119=M$12,$K119,0)","v":0},0,0,0,null,"",0,null,"",0,null,"",null,null,null,0]
[null,307,null,null,null,null,null,1,{"$f":"IF(Etusivu!$C$22=\"kyllä\",25.5%,0%)","v":0.255},0,0,0,0,0,0,0,null,"",0,null,"",0,null,"",null,null,null,0]
[null,308,null,null,null,null,null,1,{"$f":"IF(Etusivu!$C$22=\"kyllä\",25.5%,0%)","v":0.255},0,0,{"$f":"IF($F121=L$12,$K121,0)","v":0},{"$f":"IF($F121=M$12,$K121,0)","v":0},0,0,0,null,"",0,null,"",0,null,"",null,null,null,0]
[null,309,null,null,null,null,null,1,{"$f":"IF(Etusivu!$C$22=\"kyllä\",25.5%,0%)","v":0.255},0,0,{"$f":"IF($F122=L$12,$K122,0)","v":0},{"$f":"IF($F122=M$12,$K122,0)","v":0},{"$f":"IF($F122=N$12,$K122,0)","v":0},{"$f":"IF($F122=O$12,$K122,0)","v":0},{"$f":"IF($F122=P$12,$K122,0)","v":0},null,"",0,null,"",0,null,"",null,null,null,0]
[null,310,null,null,null,null,null,1,{"$f":"IF(Etusivu!$C$22=\"kyllä\",25.5%,0%)","v":0.255},0,0,{"$f":"IF($F123=L$12,$K123,0)","v":0},0,0,0,0,null,"",0,null,"",0,null,"",null,null,null,0]
[null,311,null,null,null,null,null,1,{"$f":"IF(Etusivu!$C$22=\"kyllä\",25.5%,0%)","v":0.255},0,0,0,0,0,0,0,null,"",0,null,"",0,null,"",null,null,null,0]
[null,312,null,null,null,null,null,1,{"$f":"IF(Etusivu!$C$22=\"kyllä\",25.5%,0%)","v":0.255},0,0,0,0,0,0,0,null,"",0,null,"",0,null,"",null,null,null,0]
[null,313,null,null,null,null,null,1,{"$f":"IF(Etusivu!$C$22=\"kyllä\",25.5%,0%)","v":0.255},0,0,0,0,0,0,0,null,"",0,null,"",0,null,"",null,null,null,0]
[null,314,null,null,null,null,null,1,{"$f":"IF(Etusivu!$C$22=\"kyllä\",25.5%,0%)","v":0.255},0,0,0,0,0,0,0,null,"",0,null,"",0,null,"",null,null,null,0]
[null,315,null,null,null,null,null,1,{"$f":"IF(Etusivu!$C$22=\"kyllä\",25.5%,0%)","v":0.255},0,0,0,0,0,0,0,null,"",0,null,"",0,null,"",null,null,null,0]
[null,316,null,null,null,null,null,1,{"$f":"IF(Etusivu!$C$22=\"kyllä\",25.5%,0%)","v":0.255},0,0,0,0,0,0,0,null,"",0,null,"",0,null,"",null,null,null,0]
[null,317,null,null,null,null,null,1,{"$f":"IF(Etusivu!$C$22=\"kyllä\",25.5%,0%)","v":0.255},0,0,0,0,0,0,0,null,"",0,null,"",0,null,"",null,null,null,0]
[null,318,null,null,null,null,null,1,{"$f":"IF(Etusivu!$C$22=\"kyllä\",25.5%,0%)","v":0.255},0,0,0,0,0,0,0,null,"",0,null,"",0,null,"",null,null,null,0]
[null,319,null,null,null,null,null,1,{"$f":"IF(Etusivu!$C$22=\"kyllä\",25.5%,0%)","v":0.255},0,0,0,0,0,0,0,null,"",0,null,"",0,null,"",null,null,null,0]
[null,320,null,null,null,null,null,1,{"$f":"IF(Etusivu!$C$22=\"kyllä\",25.5%,0%)","v":0.255},0,0,0,0,0,0,0,null,"",0,null,"",0,null,"",null,null,null,0]
[null,321,null,null,null,null,null,1,{"$f":"IF(Etusivu!$C$22=\"kyllä\",25.5%,0%)","v":0.255},0,0,0,0,0,0,0,null,"",0,null,"",0,null,"",null,null,null,0]
[null,322,null,null,null,null,null,1,{"$f":"IF(Etusivu!$C$22=\"kyllä\",25.5%,0%)","v":0.255},0,0,0,0,0,0,0,null,"",0,null,"",0,null,"",null,null,null,0]
[null,323,null,null,null,null,null,1,{"$f":"IF(Etusivu!$C$22=\"kyllä\",25.5%,0%)","v":0.255},0,0,0,0,0,0,0,null,"",0,null,"",0,null,"",null,null,null,0]
[null,324,null,null,null,null,null,1,{"$f":"IF(Etusivu!$C$22=\"kyllä\",25.5%,0%)","v":0.255},0,0,0,0,0,0,0,null,"",0,null,"",0,null,"",null,null,null,0]
[null,325,null,null,null,null,null,1,{"$f":"IF(Etusivu!$C$22=\"kyllä\",25.5%,0%)","v":0.255},0,0,0,0,0,0,0,null,"",0,null,"",0,null,"",null,null,null,0]
[null,326,null,null,null,null,null,1,{"$f":"IF(Etusivu!$C$22=\"kyllä\",25.5%,0%)","v":0.255},0,0,0,0,0,0,0,null,"",0,null,"",0,null,"",null,null,null,0]
[null,327,null,null,null,null,null,1,{"$f":"IF(Etusivu!$C$22=\"kyllä\",25.5%,0%)","v":0.255},0,0,0,0,0,0,0,null,"",0,null,"",0,null,"",null,null,null,0]
[null,328,null,null,null,null,null,1,{"$f":"IF(Etusivu!$C$22=\"kyllä\",25.5%,0%)","v":0.255},0,0,0,0,0,0,0,null,"",0,null,"",0,null,"",null,null,null,0]
[null,329,null,null,null,null,null,1,{"$f":"IF(Etusivu!$C$22=\"kyllä\",25.5%,0%)","v":0.255},0,0,0,0,0,0,0,null,"",0,null,"",0,null,"",null,null,null,{"$f":"IF($F142=AB$12,$K142,0)","v":0}]
[null,330,null,null,null,null,null,1,{"$f":"IF(Etusivu!$C$22=\"kyllä\",25.5%,0%)","v":0.255},0,0,0,0,0,0,0,null,"",{"$f":"IF($F143=S$12,$K143,0)","v":0},null,"",{"$f":"IF($F143=V$12,$K143,0)","v":0},null,"",null,null,null,0]
[null,331,null,null,null,null,null,1,{"$f":"IF(Etusivu!$C$22=\"kyllä\",25.5%,0%)","v":0.255},0,0,0,0,0,0,0,null,{"$f":"IF(P144>0,IF(Q144<1,\" !\",\"\"),\"\")","v":""},0,null,{"$f":"IF(S144>0,IF(T144<1,\" !\",\"\"),\"\")","v":""},0,null,{"$f":"IF(V144>0,IF(W144<1,\" !\",\"\"),\"\")","v":""},null,null,null,0]
[null,332,null,null,null,null,null,1,{"$f":"IF(Etusivu!$C$22=\"kyllä\",25.5%,0%)","v":0.255},{"$f":"H145*((G145-(AD145+AE145+AF145)*(1+I145))-((G145-(AD145+AE145+AF145)*(1+I145))/(1+I145)))","v":0},{"$f":"H145*(G145/(1+I145))","v":0},0,0,0,0,0,null,"",0,null,"",0,null,"",null,null,null,0]
[null,333,null,null,null,null,null,1,{"$f":"IF(Etusivu!$C$22=\"kyllä\",25.5%,0%)","v":0.255},0,0,0,0,0,0,0,null,"",0,null,"",0,null,"",null,null,null,0]
[null,334,null,null,null,null,null,1,{"$f":"IF(Etusivu!$C$22=\"kyllä\",25.5%,0%)","v":0.255},0,0,0,0,0,0,0,null,"",0,null,"",0,null,"",null,null,null,0]
[null,335,null,null,null,null,null,1,{"$f":"IF(Etusivu!$C$22=\"kyllä\",25.5%,0%)","v":0.255},0,0,0,0,0,0,0,null,"",0,null,"",0,null,"",null,null,null,0]
[null,336,null,null,null,null,null,1,{"$f":"IF(Etusivu!$C$22=\"kyllä\",25.5%,0%)","v":0.255},0,0,0,0,0,0,0,null,"",0,null,"",0,null,"",null,null,null,0]
[null,337,null,null,null,null,null,1,{"$f":"IF(Etusivu!$C$22=\"kyllä\",25.5%,0%)","v":0.255},0,0,0,0,0,0,0,null,"",0,null,"",0,null,"",null,null,null,0]
[null,338,null,null,null,null,null,1,{"$f":"IF(Etusivu!$C$22=\"kyllä\",25.5%,0%)","v":0.255},0,0,0,0,0,0,0,null,"",0,null,"",0,null,"",null,null,null,0]
[null,339,null,null,null,null,null,1,{"$f":"IF(Etusivu!$C$22=\"kyllä\",25.5%,0%)","v":0.255},0,0,0,0,0,0,0,null,"",0,null,"",0,null,"",null,null,null,0]
[null,340,null,null,null,null,null,1,{"$f":"IF(Etusivu!$C$22=\"kyllä\",25.5%,0%)","v":0.255},0,0,0,0,0,0,0,null,"",0,null,"",0,null,"",null,null,null,0]
[null,341,null,null,null,null,null,1,{"$f":"IF(Etusivu!$C$22=\"kyllä\",25.5%,0%)","v":0.255},0,0,0,0,0,0,0,null,"",0,null,"",0,null,"",null,null,null,0]
[null,342,null,null,null,null,null,1,{"$f":"IF(Etusivu!$C$22=\"kyllä\",25.5%,0%)","v":0.255},0,0,0,0,0,0,0,null,"",0,null,"",0,null,"",null,null,null,0]
[null,343,null,null,null,null,null,1,{"$f":"IF(Etusivu!$C$22=\"kyllä\",25.5%,0%)","v":0.255},0,0,0,0,0,0,0,null,"",0,null,"",0,null,"",null,null,null,0]
[null,344,null,null,null,null,null,1,{"$f":"IF(Etusivu!$C$22=\"kyllä\",25.5%,0%)","v":0.255},0,0,0,0,0,0,0,null,"",0,null,"",0,null,"",null,null,null,0]
[null,345,null,null,null,null,null,1,{"$f":"IF(Etusivu!$C$22=\"kyllä\",25.5%,0%)","v":0.255},0,0,0,0,0,0,0,null,"",0,null,"",0,null,"",null,null,null,0]
[null,346,null,null,null,null,null,1,{"$f":"IF(Etusivu!$C$22=\"kyllä\",25.5%,0%)","v":0.255},0,0,0,0,0,0,0,null,"",0,null,"",0,null,"",null,null,null,0]
[null,347,null,null,null,null,null,1,{"$f":"IF(Etusivu!$C$22=\"kyllä\",25.5%,0%)","v":0.255},0,0,0,0,0,0,0,null,"",0,null,"",0,null,"",null,null,null,0]
[null,348,null,null,null,null,null,1,{"$f":"IF(Etusivu!$C$22=\"kyllä\",25.5%,0%)","v":0.255},0,0,0,0,0,0,0,null,"",0,null,"",0,null,"",null,null,null,0]
[null,349,null,null,null,null,null,1,{"$f":"IF(Etusivu!$C$22=\"kyllä\",25.5%,0%)","v":0.255},0,0,0,0,0,0,0,null,"",0,null,"",0,null,"",null,null,null,0]
[null,350,null,null,null,null,null,1,{"$f":"IF(Etusivu!$C$22=\"kyllä\",25.5%,0%)","v":0.255},0,0,0,0,0,0,0,null,"",0,null,"",0,null,"",null,null,null,0]
[null,351,null,null,null,null,null,1,{"$f":"IF(Etusivu!$C$22=\"kyllä\",25.5%,0%)","v":0.255},0,0,0,0,0,0,0,null,"",0,null,"",0,null,"",null,null,null,0]
[null,352,null,null,null,null,null,1,{"$f":"IF(Etusivu!$C$22=\"kyllä\",25.5%,0%)","v":0.255},0,0,0,0,0,0,0,null,"",0,null,"",0,null,"",null,null,null,0]
[null,353,null,null,null,null,null,1,{"$f":"IF(Etusivu!$C$22=\"kyllä\",25.5%,0%)","v":0.255},0,0,0,0,0,0,0,null,"",0,null,"",0,null,"",null,null,null,0]
[null,354,null,null,null,null,null,1,{"$f":"IF(Etusivu!$C$22=\"kyllä\",25.5%,0%)","v":0.255},0,0,0,0,0,0,0,null,"",0,null,"",0,null,"",null,null,null,0]
[null,355,null,null,null,null,null,1,{"$f":"IF(Etusivu!$C$22=\"kyllä\",25.5%,0%)","v":0.255},0,0,0,0,0,0,0,null,"",0,null,"",0,null,"",null,null,null,0]
[null,356,null,null,null,null,null,1,{"$f":"IF(Etusivu!$C$22=\"kyllä\",25.5%,0%)","v":0.255},0,0,0,0,0,0,0,null,"",0,null,"",0,null,"",null,null,null,0]
[null,357,null,null,null,null,null,1,{"$f":"IF(Etusivu!$C$22=\"kyllä\",25.5%,0%)","v":0.255},0,0,0,0,0,0,0,null,"",0,null,"",0,null,"",null,null,null,0]
[null,358,null,null,null,null,null,1,{"$f":"IF(Etusivu!$C$22=\"kyllä\",25.5%,0%)","v":0.255},0,0,0,0,0,0,0,null,"",0,null,"",0,null,"",null,null,null,0]
[null,359,null,null,null,null,null,1,{"$f":"IF(Etusivu!$C$22=\"kyllä\",25.5%,0%)","v":0.255},0,0,0,0,0,0,0,null,"",0,null,"",0,null,"",null,null,null,0]
[null,360,null,null,null,null,null,1,{"$f":"IF(Etusivu!$C$22=\"kyllä\",25.5%,0%)","v":0.255},0,0,0,0,0,0,0,null,"",0,null,"",0,null,"",null,null,null,0]
[null,361,null,null,null,null,null,1,{"$f":"IF(Etusivu!$C$22=\"kyllä\",25.5%,0%)","v":0.255},0,0,{"$f":"IF($F174=L$12,$K174,0)","v":0},0,0,0,0,null,"",0,null,"",0,null,"",null,null,null,0]
[null,362,null,null,null,null,null,1,{"$f":"IF(Etusivu!$C$22=\"kyllä\",25.5%,0%)","v":0.255},0,0,0,0,0,0,0,null,"",0,null,"",0,null,"",null,null,null,0]
[null,363,null,null,null,null,null,1,{"$f":"IF(Etusivu!$C$22=\"kyllä\",25.5%,0%)","v":0.255},0,0,0,0,0,0,0,null,"",0,null,"",0,null,"",null,null,null,0]
[null,364,null,null,null,null,null,1,{"$f":"IF(Etusivu!$C$22=\"kyllä\",25.5%,0%)","v":0.255},0,0,0,0,0,0,0,null,"",0,null,"",0,null,"",null,null,null,0]
[null,365,null,null,null,null,null,1,{"$f":"IF(Etusivu!$C$22=\"kyllä\",25.5%,0%)","v":0.255},0,0,0,0,0,0,0,null,"",0,null,"",0,null,"",null,null,null,0]
[null,366,null,null,null,null,null,1,{"$f":"IF(Etusivu!$C$22=\"kyllä\",25.5%,0%)","v":0.255},0,0,0,0,0,0,0,null,"",0,null,"",0,null,"",null,null,null,0]
[null,367,null,null,null,null,null,1,{"$f":"IF(Etusivu!$C$22=\"kyllä\",25.5%,0%)","v":0.255},0,0,0,0,0,0,0,null,"",0,null,"",0,null,"",null,null,null,0]
[null,368,null,null,null,null,null,1,{"$f":"IF(Etusivu!$C$22=\"kyllä\",25.5%,0%)","v":0.255},0,0,0,0,0,0,0,null,"",0,null,"",0,null,"",null,null,null,0]
[null,369,null,null,null,null,null,1,{"$f":"IF(Etusivu!$C$22=\"kyllä\",25.5%,0%)","v":0.255},0,0,0,0,0,0,0,null,"",0,null,"",0,null,"",null,null,null,0]
[null,370,null,null,null,null,null,1,{"$f":"IF(Etusivu!$C$22=\"kyllä\",25.5%,0%)","v":0.255},0,0,0,0,0,0,0,null,"",0,null,"",0,null,"",null,null,null,0]
[null,371,null,null,null,null,null,1,{"$f":"IF(Etusivu!$C$22=\"kyllä\",25.5%,0%)","v":0.255},0,0,0,0,0,0,0,null,"",0,null,"",0,null,"",null,null,null,0]
[null,372,null,null,null,null,null,1,{"$f":"IF(Etusivu!$C$22=\"kyllä\",25.5%,0%)","v":0.255},0,0,0,0,0,0,0,null,"",0,null,"",0,null,"",null,null,null,0]
[null,373,null,null,null,null,null,1,{"$f":"IF(Etusivu!$C$22=\"kyllä\",25.5%,0%)","v":0.255},0,0,0,0,0,0,0,null,"",0,null,"",0,null,"",null,null,null,0]
[null,374,null,null,null,null,null,1,{"$f":"IF(Etusivu!$C$22=\"kyllä\",25.5%,0%)","v":0.255},0,0,0,0,0,0,0,null,"",0,null,"",0,null,"",null,null,null,0]
[null,375,null,null,null,null,null,1,{"$f":"IF(Etusivu!$C$22=\"kyllä\",25.5%,0%)","v":0.255},0,0,0,0,0,0,0,null,"",0,null,"",0,null,"",null,null,null,0]
[null,376,null,null,null,null,null,1,{"$f":"IF(Etusivu!$C$22=\"kyllä\",25.5%,0%)","v":0.255},0,0,0,0,0,0,0,null,"",0,null,"",0,null,"",null,null,null,0]
[null,377,null,null,null,null,null,1,{"$f":"IF(Etusivu!$C$22=\"kyllä\",25.5%,0%)","v":0.255},0,0,0,0,0,0,0,null,"",0,null,"",0,null,"",null,null,null,0]
[null,378,null,null,null,null,null,1,{"$f":"IF(Etusivu!$C$22=\"kyllä\",25.5%,0%)","v":0.255},0,0,0,0,0,0,0,null,"",0,null,"",0,null,"",null,null,null,0]
[null,379,null,null,null,null,null,1,{"$f":"IF(Etusivu!$C$22=\"kyllä\",25.5%,0%)","v":0.255},0,0,0,0,0,0,0,null,"",0,null,"",0,null,"",null,null,null,0]
[null,380,null,null,null,null,null,1,{"$f":"IF(Etusivu!$C$22=\"kyllä\",25.5%,0%)","v":0.255},0,0,0,0,0,0,0,null,"",0,null,"",0,null,"",null,null,null,0]
[null,381,null,null,null,null,null,1,{"$f":"IF(Etusivu!$C$22=\"kyllä\",25.5%,0%)","v":0.255},0,0,0,0,0,0,0,null,"",0,null,"",0,null,"",null,null,null,0]
[null,382,null,null,null,null,null,1,{"$f":"IF(Etusivu!$C$22=\"kyllä\",25.5%,0%)","v":0.255},0,0,0,0,0,0,0,null,"",0,null,"",0,null,"",null,null,null,0]
[null,383,null,null,null,null,null,1,{"$f":"IF(Etusivu!$C$22=\"kyllä\",25.5%,0%)","v":0.255},0,0,0,0,0,0,0,null,"",0,null,"",0,null,"",null,null,null,0]
[null,384,null,null,null,null,null,1,{"$f":"IF(Etusivu!$C$22=\"kyllä\",25.5%,0%)","v":0.255},0,0,0,0,0,0,0,null,"",0,null,"",0,null,"",null,null,null,0]
[null,385,null,null,null,null,null,1,{"$f":"IF(Etusivu!$C$22=\"kyllä\",25.5%,0%)","v":0.255},0,0,0,0,0,0,0,null,"",0,null,"",0,null,"",null,null,null,0]
[null,386,null,null,null,null,null,1,{"$f":"IF(Etusivu!$C$22=\"kyllä\",25.5%,0%)","v":0.255},0,0,0,0,0,0,0,null,"",0,null,"",0,null,"",null,null,null,0]
[null,387,null,null,null,null,null,1,{"$f":"IF(Etusivu!$C$22=\"kyllä\",25.5%,0%)","v":0.255},0,0,0,0,0,0,0,null,"",0,null,"",0,null,"",null,null,null,0]
[null,388,null,null,null,null,null,1,{"$f":"IF(Etusivu!$C$22=\"kyllä\",25.5%,0%)","v":0.255},0,0,0,0,0,0,0,null,"",0,null,"",0,null,"",null,null,null,0]
[null,389,null,null,null,null,null,1,{"$f":"IF(Etusivu!$C$22=\"kyllä\",25.5%,0%)","v":0.255},0,0,0,0,0,0,0,null,"",0,null,"",0,null,"",null,null,null,0]
[null,390,null,null,null,null,null,1,{"$f":"IF(Etusivu!$C$22=\"kyllä\",25.5%,0%)","v":0.255},0,0,0,0,0,0,0,null,"",0,null,"",0,null,"",null,null,null,0]
[null,391,null,null,null,null,null,1,{"$f":"IF(Etusivu!$C$22=\"kyllä\",25.5%,0%)","v":0.255},0,0,0,0,0,0,0,null,"",0,null,"",0,null,"",null,null,null,0]
[null,392,null,null,null,null,null,1,{"$f":"IF(Etusivu!$C$22=\"kyllä\",25.5%,0%)","v":0.255},0,0,0,0,0,0,0,null,"",0,null,"",0,null,"",null,null,null,0]
[null,393,null,null,null,null,null,1,{"$f":"IF(Etusivu!$C$22=\"kyllä\",25.5%,0%)","v":0.255},0,0,0,0,0,0,0,null,"",0,null,"",0,null,"",null,null,null,{"$f":"IF($F206=AB$12,$K206,0)","v":0}]
[null,394,null,null,null,null,null,1,{"$f":"IF(Etusivu!$C$22=\"kyllä\",25.5%,0%)","v":0.255},0,0,0,0,0,0,0,null,"",{"$f":"IF($F207=S$12,$K207,0)","v":0},null,"",{"$f":"IF($F207=V$12,$K207,0)","v":0},null,"",null,null,null,0]
[null,395,null,null,null,null,null,1,{"$f":"IF(Etusivu!$C$22=\"kyllä\",25.5%,0%)","v":0.255},0,0,0,0,0,0,0,null,{"$f":"IF(P208>0,IF(Q208<1,\" !\",\"\"),\"\")","v":""},0,null,{"$f":"IF(S208>0,IF(T208<1,\" !\",\"\"),\"\")","v":""},0,null,{"$f":"IF(V208>0,IF(W208<1,\" !\",\"\"),\"\")","v":""},null,null,null,0]
[null,396,null,null,null,null,null,1,{"$f":"IF(Etusivu!$C$22=\"kyllä\",25.5%,0%)","v":0.255},{"$f":"H209*((G209-(AD209+AE209+AF209)*(1+I209))-((G209-(AD209+AE209+AF209)*(1+I209))/(1+I209)))","v":0},{"$f":"H209*(G209/(1+I209))","v":0},0,0,0,0,0,null,"",0,null,"",0,null,"",null,null,null,0]
[null,397,null,null,null,null,null,1,{"$f":"IF(Etusivu!$C$22=\"kyllä\",25.5%,0%)","v":0.255},0,0,0,0,0,0,0,null,"",0,null,"",0,null,"",null,null,null,0]
[null,398,null,null,null,null,null,1,{"$f":"IF(Etusivu!$C$22=\"kyllä\",25.5%,0%)","v":0.255},0,0,0,0,0,0,0,null,"",0,null,"",0,null,"",null,null,null,0]
[null,399,null,null,null,null,null,1,{"$f":"IF(Etusivu!$C$22=\"kyllä\",25.5%,0%)","v":0.255},0,0,0,0,0,0,0,null,"",0,null,"",0,null,"",null,null,null,0]
[null,400,null,null,null,null,null,1,{"$f":"IF(Etusivu!$C$22=\"kyllä\",25.5%,0%)","v":0.255},0,0,0,0,0,0,0,null,"",0,null,"",0,null,"",null,null,null,0]
[null,401,null,null,null,null,null,1,{"$f":"IF(Etusivu!$C$22=\"kyllä\",25.5%,0%)","v":0.255},0,0,0,0,0,0,0,null,"",0,null,"",0,null,"",null,null,null,0]
[null,402,null,null,null,null,null,1,{"$f":"IF(Etusivu!$C$22=\"kyllä\",25.5%,0%)","v":0.255},0,0,0,0,0,0,0,null,"",0,null,"",0,null,"",null,null,null,0]
[null,403,null,null,null,null,null,1,{"$f":"IF(Etusivu!$C$22=\"kyllä\",25.5%,0%)","v":0.255},0,0,0,0,0,0,0,null,"",0,null,"",0,null,"",null,null,null,0]
[null,404,null,null,null,null,null,1,{"$f":"IF(Etusivu!$C$22=\"kyllä\",25.5%,0%)","v":0.255},0,0,0,0,0,0,0,null,"",0,null,"",0,null,"",null,null,null,0]
[null,405,null,null,null,null,null,1,{"$f":"IF(Etusivu!$C$22=\"kyllä\",25.5%,0%)","v":0.255},0,0,0,0,0,0,0,null,"",0,null,"",0,null,"",null,null,null,0]
[null,406,null,null,null,null,null,1,{"$f":"IF(Etusivu!$C$22=\"kyllä\",25.5%,0%)","v":0.255},0,0,0,0,0,0,0,null,"",0,null,"",0,null,"",null,null,null,0]
[null,407,null,null,null,null,null,1,{"$f":"IF(Etusivu!$C$22=\"kyllä\",25.5%,0%)","v":0.255},0,0,0,0,0,0,0,null,"",0,null,"",0,null,"",null,null,null,0]
[null,408,null,null,null,null,null,1,{"$f":"IF(Etusivu!$C$22=\"kyllä\",25.5%,0%)","v":0.255},0,0,0,0,0,0,0,null,"",0,null,"",0,null,"",null,null,null,0]
[null,409,null,null,null,null,null,1,{"$f":"IF(Etusivu!$C$22=\"kyllä\",25.5%,0%)","v":0.255},0,0,0,0,0,0,0,null,"",0,null,"",0,null,"",null,null,null,0]
[null,410,null,null,null,null,null,1,{"$f":"IF(Etusivu!$C$22=\"kyllä\",25.5%,0%)","v":0.255},0,0,0,0,0,0,0,null,"",0,null,"",0,null,"",null,null,null,0]
[null,411,null,null,null,null,null,1,{"$f":"IF(Etusivu!$C$22=\"kyllä\",25.5%,0%)","v":0.255},0,0,0,0,0,0,0,null,"",0,null,"",0,null,"",null,null,null,0]
[null,412,null,null,null,null,null,1,{"$f":"IF(Etusivu!$C$22=\"kyllä\",25.5%,0%)","v":0.255},0,0,{"$f":"IF($F225=L$12,$K225,0)","v":0},0,0,0,0,null,"",0,null,"",0,null,"",null,null,null,0]
[null,413,null,null,null,null,null,1,{"$f":"IF(Etusivu!$C$22=\"kyllä\",25.5%,0%)","v":0.255},0,0,0,0,0,0,0,null,"",0,null,"",0,null,"",null,null,null,0]
[null,414,null,null,null,null,null,1,{"$f":"IF(Etusivu!$C$22=\"kyllä\",25.5%,0%)","v":0.255},0,0,0,0,0,0,0,null,"",0,null,"",0,null,"",null,null,null,0]
[null,415,null,null,null,null,null,1,{"$f":"IF(Etusivu!$C$22=\"kyllä\",25.5%,0%)","v":0.255},0,0,0,0,0,0,0,null,"",0,null,"",0,null,"",null,null,null,0]
[null,416,null,null,null,null,null,1,{"$f":"IF(Etusivu!$C$22=\"kyllä\",25.5%,0%)","v":0.255},0,0,0,0,0,0,0,null,"",0,null,"",0,null,"",null,null,null,0]
[null,417,null,null,null,null,null,1,{"$f":"IF(Etusivu!$C$22=\"kyllä\",25.5%,0%)","v":0.255},0,0,0,0,0,0,0,null,"",0,null,"",0,null,"",null,null,null,0]
[null,418,null,null,null,null,null,1,{"$f":"IF(Etusivu!$C$22=\"kyllä\",25.5%,0%)","v":0.255},0,0,0,0,0,0,0,null,"",0,null,"",0,null,"",null,null,null,0]
[null,419,null,null,null,null,null,1,{"$f":"IF(Etusivu!$C$22=\"kyllä\",25.5%,0%)","v":0.255},0,0,0,0,0,0,0,null,"",0,null,"",0,null,"",null,null,null,0]
[null,420,null,null,null,null,null,1,{"$f":"IF(Etusivu!$C$22=\"kyllä\",25.5%,0%)","v":0.255},0,0,0,0,0,0,0,null,"",0,null,"",0,null,"",null,null,null,0]
[null,421,null,null,null,null,null,1,{"$f":"IF(Etusivu!$C$22=\"kyllä\",25.5%,0%)","v":0.255},0,0,0,0,0,0,0,null,"",0,null,"",0,null,"",null,null,null,0]
[null,422,null,null,null,null,null,1,{"$f":"IF(Etusivu!$C$22=\"kyllä\",25.5%,0%)","v":0.255},0,0,0,0,0,0,0,null,"",0,null,"",0,null,"",null,null,null,0]
[null,423,null,null,null,null,null,1,{"$f":"IF(Etusivu!$C$22=\"kyllä\",25.5%,0%)","v":0.255},0,0,0,0,0,0,0,null,"",0,null,"",0,null,"",null,null,null,0]
[null,424,null,null,null,null,null,1,{"$f":"IF(Etusivu!$C$22=\"kyllä\",25.5%,0%)","v":0.255},0,0,0,0,0,0,0,null,"",0,null,"",0,null,"",null,null,null,0]
[null,425,null,null,null,null,null,1,{"$f":"IF(Etusivu!$C$22=\"kyllä\",25.5%,0%)","v":0.255},0,0,0,0,0,0,0,null,"",0,null,"",0,null,"",null,null,null,0]
[null,426,null,null,null,null,null,1,{"$f":"IF(Etusivu!$C$22=\"kyllä\",25.5%,0%)","v":0.255},0,0,0,0,0,0,0,null,"",0,null,"",0,null,"",null,null,null,0]
[null,427,null,null,null,null,null,1,{"$f":"IF(Etusivu!$C$22=\"kyllä\",25.5%,0%)","v":0.255},0,0,0,0,0,0,0,null,"",0,null,"",0,null,"",null,null,null,0]
[null,428,null,null,null,null,null,1,{"$f":"IF(Etusivu!$C$22=\"kyllä\",25.5%,0%)","v":0.255},0,0,0,0,0,0,0,null,"",0,null,"",0,null,"",null,null,null,0]
[null,429,null,null,null,null,null,1,{"$f":"IF(Etusivu!$C$22=\"kyllä\",25.5%,0%)","v":0.255},0,0,0,0,0,0,0,null,"",0,null,"",0,null,"",null,null,null,0]
[null,430,null,null,null,null,null,1,{"$f":"IF(Etusivu!$C$22=\"kyllä\",25.5%,0%)","v":0.255},0,0,0,0,0,0,0,null,"",0,null,"",0,null,"",null,null,null,0]
[null,431,null,null,null,null,null,1,{"$f":"IF(Etusivu!$C$22=\"kyllä\",25.5%,0%)","v":0.255},0,0,0,0,0,0,0,null,"",0,null,"",0,null,"",null,null,null,0]
[null,432,null,null,null,null,null,1,{"$f":"IF(Etusivu!$C$22=\"kyllä\",25.5%,0%)","v":0.255},0,0,0,0,0,0,0,null,"",0,null,"",0,null,"",null,null,null,0]
[null,433,null,null,null,null,null,1,{"$f":"IF(Etusivu!$C$22=\"kyllä\",25.5%,0%)","v":0.255},0,0,0,0,0,0,0,null,"",0,null,"",0,null,"",null,null,null,0]
[null,434,null,null,null,null,null,1,{"$f":"IF(Etusivu!$C$22=\"kyllä\",25.5%,0%)","v":0.255},0,0,0,0,0,0,0,null,"",0,null,"",0,null,"",null,null,null,0]
[null,435,null,null,null,null,null,1,{"$f":"IF(Etusivu!$C$22=\"kyllä\",25.5%,0%)","v":0.255},0,0,0,0,0,0,0,null,"",0,null,"",0,null,"",null,null,null,0]
[null,436,null,null,null,null,null,1,{"$f":"IF(Etusivu!$C$22=\"kyllä\",25.5%,0%)","v":0.255},0,0,0,0,0,0,0,null,"",0,null,"",0,null,"",null,null,null,0]
[null,437,null,null,null,null,null,1,{"$f":"IF(Etusivu!$C$22=\"kyllä\",25.5%,0%)","v":0.255},0,0,0,0,0,0,0,null,"",0,null,"",0,null,"",null,null,null,0]
[null,438,null,null,null,null,null,1,{"$f":"IF(Etusivu!$C$22=\"kyllä\",25.5%,0%)","v":0.255},0,0,0,0,0,0,0,null,"",0,null,"",0,null,"",null,null,null,0]
[null,439,null,null,null,null,null,1,{"$f":"IF(Etusivu!$C$22=\"kyllä\",25.5%,0%)","v":0.255},0,0,0,0,0,0,0,null,"",0,null,"",0,null,"",null,null,null,0]
[null,440,null,null,null,null,null,1,{"$f":"IF(Etusivu!$C$22=\"kyllä\",25.5%,0%)","v":0.255},0,0,0,0,0,0,0,null,"",0,null,"",0,null,"",null,null,null,0]
[null,441,null,null,null,null,null,1,{"$f":"IF(Etusivu!$C$22=\"kyllä\",25.5%,0%)","v":0.255},0,0,0,0,0,0,0,null,"",0,null,"",0,null,"",null,null,null,0]
[null,442,null,null,null,null,null,1,{"$f":"IF(Etusivu!$C$22=\"kyllä\",25.5%,0%)","v":0.255},0,0,0,0,0,0,0,null,"",0,null,"",0,null,"",null,null,null,0]
[null,443,null,null,null,null,null,1,{"$f":"IF(Etusivu!$C$22=\"kyllä\",25.5%,0%)","v":0.255},0,0,0,0,0,0,0,null,"",0,null,"",0,null,"",null,null,null,0]
[null,444,null,null,null,null,null,1,{"$f":"IF(Etusivu!$C$22=\"kyllä\",25.5%,0%)","v":0.255},0,0,0,0,0,0,0,null,"",0,null,"",0,null,"",null,null,null,0]
[null,445,null,null,null,null,null,1,{"$f":"IF(Etusivu!$C$22=\"kyllä\",25.5%,0%)","v":0.255},0,0,0,0,0,0,0,null,"",0,null,"",0,null,"",null,null,null,0]
[null,446,null,null,null,null,null,1,{"$f":"IF(Etusivu!$C$22=\"kyllä\",25.5%,0%)","v":0.255},0,0,0,0,0,0,0,null,"",0,null,"",0,null,"",null,null,null,0]
[null,447,null,null,null,null,null,1,{"$f":"IF(Etusivu!$C$22=\"kyllä\",25.5%,0%)","v":0.255},0,0,0,0,0,0,0,null,"",0,null,"",0,null,"",null,null,null,0]
[null,448,null,null,null,null,null,1,{"$f":"IF(Etusivu!$C$22=\"kyllä\",25.5%,0%)","v":0.255},0,0,0,0,0,0,0,null,"",0,null,"",0,null,"",null,null,null,0]
[null,449,null,null,null,null,null,1,{"$f":"IF(Etusivu!$C$22=\"kyllä\",25.5%,0%)","v":0.255},0,0,0,0,0,0,0,null,"",0,null,"",0,null,"",null,null,null,0]
[null,450,null,null,null,null,null,1,{"$f":"IF(Etusivu!$C$22=\"kyllä\",25.5%,0%)","v":0.255},0,0,0,0,0,0,0,null,"",0,null,"",0,null,"",null,null,null,0]
[null,451,null,null,null,null,null,1,{"$f":"IF(Etusivu!$C$22=\"kyllä\",25.5%,0%)","v":0.255},0,0,0,0,0,0,0,null,"",0,null,"",0,null,"",null,null,null,0]
[null,452,null,null,null,null,null,1,{"$f":"IF(Etusivu!$C$22=\"kyllä\",25.5%,0%)","v":0.255},0,0,0,0,0,0,0,null,"",0,null,"",0,null,"",null,null,null,0]
[null,453,null,null,null,null,null,1,{"$f":"IF(Etusivu!$C$22=\"kyllä\",25.5%,0%)","v":0.255},0,0,0,0,0,0,0,null,"",0,null,"",0,null,"",null,null,null,0]
[null,454,null,null,null,null,null,1,{"$f":"IF(Etusivu!$C$22=\"kyllä\",25.5%,0%)","v":0.255},0,0,0,0,0,0,0,null,"",0,null,"",0,null,"",null,null,null,0]
[null,455,null,null,null,null,null,1,{"$f":"IF(Etusivu!$C$22=\"kyllä\",25.5%,0%)","v":0.255},0,0,0,0,0,0,0,null,"",0,null,"",0,null,"",null,null,null,0]
[null,456,null,null,null,null,null,1,{"$f":"IF(Etusivu!$C$22=\"kyllä\",25.5%,0%)","v":0.255},0,0,0,0,0,0,0,null,"",0,null,"",0,null,"",null,null,null,0]
[null,457,null,null,null,null,null,1,{"$f":"IF(Etusivu!$C$22=\"kyllä\",25.5%,0%)","v":0.255},0,0,0,0,0,0,0,null,"",0,null,"",0,null,"",null,null,null,{"$f":"IF($F270=AB$12,$K270,0)","v":0}]
[null,458,null,null,null,null,null,1,{"$f":"IF(Etusivu!$C$22=\"kyllä\",25.5%,0%)","v":0.255},0,0,0,0,0,0,0,null,"",{"$f":"IF($F271=S$12,$K271,0)","v":0},null,"",{"$f":"IF($F271=V$12,$K271,0)","v":0},null,"",null,null,null,0]
[null,459,null,null,null,null,null,1,{"$f":"IF(Etusivu!$C$22=\"kyllä\",25.5%,0%)","v":0.255},0,0,0,0,0,0,0,null,{"$f":"IF(P272>0,IF(Q272<1,\" !\",\"\"),\"\")","v":""},0,null,{"$f":"IF(S272>0,IF(T272<1,\" !\",\"\"),\"\")","v":""},0,null,{"$f":"IF(V272>0,IF(W272<1,\" !\",\"\"),\"\")","v":""},null,null,null,0]
[null,460,null,null,null,null,null,1,{"$f":"IF(Etusivu!$C$22=\"kyllä\",25.5%,0%)","v":0.255},{"$f":"H273*((G273-(AD273+AE273+AF273)*(1+I273))-((G273-(AD273+AE273+AF273)*(1+I273))/(1+I273)))","v":0},{"$f":"H273*(G273/(1+I273))","v":0},0,0,0,0,0,null,"",0,null,"",0,null,"",null,null,null,0]
[null,461,null,null,null,null,null,1,{"$f":"IF(Etusivu!$C$22=\"kyllä\",25.5%,0%)","v":0.255},0,0,0,0,0,0,0,null,"",0,null,"",0,null,"",null,null,null,0]
[null,462,null,null,null,null,null,1,{"$f":"IF(Etusivu!$C$22=\"kyllä\",25.5%,0%)","v":0.255},0,0,0,0,0,0,0,null,"",0,null,"",0,null,"",null,null,null,0]
[null,463,null,null,null,null,null,1,{"$f":"IF(Etusivu!$C$22=\"kyllä\",25.5%,0%)","v":0.255},0,0,{"$f":"IF($F276=L$12,$K276,0)","v":0},0,0,0,0,null,"",0,null,"",0,null,"",null,null,null,0]
[null,464,null,null,null,null,null,1,{"$f":"IF(Etusivu!$C$22=\"kyllä\",25.5%,0%)","v":0.255},0,0,0,0,0,0,0,null,"",0,null,"",0,null,"",null,null,null,0]
[null,465,null,null,null,null,null,1,{"$f":"IF(Etusivu!$C$22=\"kyllä\",25.5%,0%)","v":0.255},0,0,0,0,0,0,0,null,"",0,null,"",0,null,"",null,null,null,0]
[null,466,null,null,null,null,null,1,{"$f":"IF(Etusivu!$C$22=\"kyllä\",25.5%,0%)","v":0.255},0,0,0,0,0,0,0,null,"",0,null,"",0,null,"",null,null,null,0]
[null,467,null,null,null,null,null,1,{"$f":"IF(Etusivu!$C$22=\"kyllä\",25.5%,0%)","v":0.255},0,0,0,0,0,0,0,null,"",0,null,"",0,null,"",null,null,null,0]
[null,468,null,null,null,null,null,1,{"$f":"IF(Etusivu!$C$22=\"kyllä\",25.5%,0%)","v":0.255},0,0,0,0,0,0,0,null,"",0,null,"",0,null,"",null,null,null,0]
[null,469,null,null,null,null,null,1,{"$f":"IF(Etusivu!$C$22=\"kyllä\",25.5%,0%)","v":0.255},0,0,0,0,0,0,0,null,"",0,null,"",0,null,"",null,null,null,0]
[null,470,null,null,null,null,null,1,{"$f":"IF(Etusivu!$C$22=\"kyllä\",25.5%,0%)","v":0.255},0,0,0,0,0,0,0,null,"",0,null,"",0,null,"",null,null,null,0]
[null,471,null,null,null,null,null,1,{"$f":"IF(Etusivu!$C$22=\"kyllä\",25.5%,0%)","v":0.255},0,0,0,0,0,0,0,null,"",0,null,"",0,null,"",null,null,null,0]
[null,472,null,null,null,null,null,1,{"$f":"IF(Etusivu!$C$22=\"kyllä\",25.5%,0%)","v":0.255},0,0,0,0,0,0,0,null,"",0,null,"",0,null,"",null,null,null,0]
[null,473,null,null,null,null,null,1,{"$f":"IF(Etusivu!$C$22=\"kyllä\",25.5%,0%)","v":0.255},0,0,0,0,0,0,0,null,"",0,null,"",0,null,"",null,null,null,0]
[null,474,null,null,null,null,null,1,{"$f":"IF(Etusivu!$C$22=\"kyllä\",25.5%,0%)","v":0.255},0,0,0,0,0,0,0,null,"",0,null,"",0,null,"",null,null,null,0]
[null,475,null,null,null,null,null,1,{"$f":"IF(Etusivu!$C$22=\"kyllä\",25.5%,0%)","v":0.255},0,0,0,0,0,0,0,null,"",0,null,"",0,null,"",null,null,null,0]
[null,476,null,null,null,null,null,1,{"$f":"IF(Etusivu!$C$22=\"kyllä\",25.5%,0%)","v":0.255},0,0,0,0,0,0,0,null,"",0,null,"",0,null,"",null,null,null,0]
[null,477,null,null,null,null,null,1,{"$f":"IF(Etusivu!$C$22=\"kyllä\",25.5%,0%)","v":0.255},0,0,0,0,0,0,0,null,"",0,null,"",0,null,"",null,null,null,0]
[null,478,null,null,null,null,null,1,{"$f":"IF(Etusivu!$C$22=\"kyllä\",25.5%,0%)","v":0.255},0,0,0,0,0,0,0,null,"",0,null,"",0,null,"",null,null,null,0]
[null,479,null,null,null,null,null,1,{"$f":"IF(Etusivu!$C$22=\"kyllä\",25.5%,0%)","v":0.255},0,0,0,0,0,0,0,null,"",0,null,"",0,null,"",null,null,null,0]
[null,480,null,null,null,null,null,1,{"$f":"IF(Etusivu!$C$22=\"kyllä\",25.5%,0%)","v":0.255},0,0,0,0,0,0,0,null,"",0,null,"",0,null,"",null,null,null,0]
[null,481,null,null,null,null,null,1,{"$f":"IF(Etusivu!$C$22=\"kyllä\",25.5%,0%)","v":0.255},0,0,0,0,0,0,0,null,"",0,null,"",0,null,"",null,null,null,0]
[null,482,null,null,null,null,null,1,{"$f":"IF(Etusivu!$C$22=\"kyllä\",25.5%,0%)","v":0.255},0,0,0,0,0,0,0,null,"",0,null,"",0,null,"",null,null,null,0]
[null,483,null,null,null,null,null,1,{"$f":"IF(Etusivu!$C$22=\"kyllä\",25.5%,0%)","v":0.255},0,0,0,0,0,0,0,null,"",0,null,"",0,null,"",null,null,null,0]
[null,484,null,null,null,null,null,1,{"$f":"IF(Etusivu!$C$22=\"kyllä\",25.5%,0%)","v":0.255},0,0,0,0,0,0,0,null,"",0,null,"",0,null,"",null,null,null,0]
[null,485,null,null,null,null,null,1,{"$f":"IF(Etusivu!$C$22=\"kyllä\",25.5%,0%)","v":0.255},0,0,0,0,0,0,0,null,"",0,null,"",0,null,"",null,null,null,0]
[null,486,null,null,null,null,null,1,{"$f":"IF(Etusivu!$C$22=\"kyllä\",25.5%,0%)","v":0.255},0,0,0,0,0,0,0,null,"",0,null,"",0,null,"",null,null,null,0]
[null,487,null,null,null,null,null,1,{"$f":"IF(Etusivu!$C$22=\"kyllä\",25.5%,0%)","v":0.255},0,0,0,0,0,0,0,null,"",0,null,"",0,null,"",null,null,null,0]
[null,488,null,null,null,null,null,1,{"$f":"IF(Etusivu!$C$22=\"kyllä\",25.5%,0%)","v":0.255},0,0,0,0,0,0,0,null,"",0,null,"",0,null,"",null,null,null,0]
[null,489,null,null,null,null,null,1,{"$f":"IF(Etusivu!$C$22=\"kyllä\",25.5%,0%)","v":0.255},0,0,0,0,0,0,0,null,"",0,null,"",0,null,"",null,null,null,0]
[null,490,null,null,null,null,null,1,{"$f":"IF(Etusivu!$C$22=\"kyllä\",25.5%,0%)","v":0.255},0,0,0,0,0,0,0,null,"",0,null,"",0,null,"",null,null,null,0]
[null,491,null,null,null,null,null,1,{"$f":"IF(Etusivu!$C$22=\"kyllä\",25.5%,0%)","v":0.255},0,0,0,0,0,0,0,null,"",0,null,"",0,null,"",null,null,null,0]
[null,492,null,null,null,null,null,1,{"$f":"IF(Etusivu!$C$22=\"kyllä\",25.5%,0%)","v":0.255},0,0,0,0,0,0,0,null,"",0,null,"",0,null,"",null,null,null,0]
[null,493,null,null,null,null,null,1,{"$f":"IF(Etusivu!$C$22=\"kyllä\",25.5%,0%)","v":0.255},0,0,0,0,0,0,0,null,"",0,null,"",0,null,"",null,null,null,0]
[null,494,null,null,null,null,null,1,{"$f":"IF(Etusivu!$C$22=\"kyllä\",25.5%,0%)","v":0.255},0,0,0,0,0,0,0,null,"",0,null,"",0,null,"",null,null,null,0]
[null,495,null,null,null,null,null,1,{"$f":"IF(Etusivu!$C$22=\"kyllä\",25.5%,0%)","v":0.255},0,0,0,0,0,0,0,null,"",0,null,"",0,null,"",null,null,null,0]
[null,496,null,null,null,null,null,1,{"$f":"IF(Etusivu!$C$22=\"kyllä\",25.5%,0%)","v":0.255},0,0,0,0,0,0,0,null,"",0,null,"",0,null,"",null,null,null,0]
[null,497,null,null,null,null,null,1,{"$f":"IF(Etusivu!$C$22=\"kyllä\",25.5%,0%)","v":0.255},0,0,0,0,0,0,0,null,"",0,null,"",0,null,"",null,null,null,0]
[null,498,null,null,null,null,null,1,{"$f":"IF(Etusivu!$C$22=\"kyllä\",25.5%,0%)","v":0.255},0,0,0,0,0,0,0,null,"",0,null,"",0,null,"",null,null,null,0]
[null,499,null,null,null,null,null,1,{"$f":"IF(Etusivu!$C$22=\"kyllä\",25.5%,0%)","v":0.255},0,0,0,0,0,0,0,null,"",0,null,"",0,null,"",null,null,null,0]
[null,500,null,null,null,null,null,1,{"$f":"IF(Etusivu!$C$22=\"kyllä\",25.5%,0%)","v":0.255},0,0,0,0,0,0,0,null,"",0,null,"",0,null,"",null,null,null,0]
[null,501,null,null,null,null,null,1,{"$f":"IF(Etusivu!$C$22=\"kyllä\",25.5%,0%)","v":0.255},0,0,0,0,0,0,0,null,"",0,null,"",0,null,"",null,null,null,0]
[null,502,null,null,null,null,null,1,{"$f":"IF(Etusivu!$C$22=\"kyllä\",25.5%,0%)","v":0.255},0,0,0,0,0,0,0,null,"",0,null,"",0,null,"",null,null,null,0]
[null,503,null,null,null,null,null,1,{"$f":"IF(Etusivu!$C$22=\"kyllä\",25.5%,0%)","v":0.255},0,0,0,0,0,0,0,null,"",0,null,"",0,null,"",null,null,null,0]
[null,504,null,null,null,null,null,1,{"$f":"IF(Etusivu!$C$22=\"kyllä\",25.5%,0%)","v":0.255},0,0,0,0,0,0,0,null,"",0,null,"",0,null,"",null,null,null,0]
[null,505,null,null,null,null,null,1,{"$f":"IF(Etusivu!$C$22=\"kyllä\",25.5%,0%)","v":0.255},0,0,0,0,0,0,0,null,"",0,null,"",0,null,"",null,null,null,0]
[null,506,null,null,null,null,null,1,{"$f":"IF(Etusivu!$C$22=\"kyllä\",25.5%,0%)","v":0.255},0,0,0,0,0,0,0,null,"",0,null,"",0,null,"",null,null,null,0]
[null,507,null,null,null,null,null,1,{"$f":"IF(Etusivu!$C$22=\"kyllä\",25.5%,0%)","v":0.255},0,0,0,0,0,0,0,null,"",0,null,"",0,null,"",null,null,null,0]
[null,508,null,null,null,null,null,1,{"$f":"IF(Etusivu!$C$22=\"kyllä\",25.5%,0%)","v":0.255},0,0,0,0,0,0,0,null,"",0,null,"",0,null,"",null,null,null,0]
[null,509,null,null,null,null,null,1,{"$f":"IF(Etusivu!$C$22=\"kyllä\",25.5%,0%)","v":0.255},0,0,0,0,0,0,0,null,"",0,null,"",0,null,"",null,null,null,0]
[null,510,null,null,null,null,null,1,{"$f":"IF(Etusivu!$C$22=\"kyllä\",25.5%,0%)","v":0.255},0,0,0,0,0,0,0,null,"",0,null,"",0,null,"",null,null,null,0]
[null,511,null,null,null,null,null,1,{"$f":"IF(Etusivu!$C$22=\"kyllä\",25.5%,0%)","v":0.255},0,0,0,0,0,0,0,null,"",0,null,"",0,null,"",null,null,null,0]
[null,512,null,null,null,null,null,1,{"$f":"IF(Etusivu!$C$22=\"kyllä\",25.5%,0%)","v":0.255},0,0,0,0,0,0,0,null,"",0,null,"",0,null,"",null,null,null,0]
[null,513,null,null,null,null,null,1,{"$f":"IF(Etusivu!$C$22=\"kyllä\",25.5%,0%)","v":0.255},0,0,0,0,0,0,0,null,"",0,null,"",0,null,"",null,null,null,0]
[null,514,null,null,null,null,null,1,{"$f":"IF(Etusivu!$C$22=\"kyllä\",25.5%,0%)","v":0.255},0,0,{"$f":"IF($F327=L$12,$K327,0)","v":0},0,0,0,0,null,"",0,null,"",0,null,"",null,null,null,0]
[null,515,null,null,null,null,null,1,{"$f":"IF(Etusivu!$C$22=\"kyllä\",25.5%,0%)","v":0.255},0,0,0,0,0,0,0,null,"",0,null,"",0,null,"",null,null,null,0]
[null,516,null,null,null,null,null,1,{"$f":"IF(Etusivu!$C$22=\"kyllä\",25.5%,0%)","v":0.255},0,0,0,0,0,0,0,null,"",0,null,"",0,null,"",null,null,null,0]
[null,517,null,null,null,null,null,1,{"$f":"IF(Etusivu!$C$22=\"kyllä\",25.5%,0%)","v":0.255},0,0,0,0,0,0,0,null,"",0,null,"",0,null,"",null,null,null,0]
[null,518,null,null,null,null,null,1,{"$f":"IF(Etusivu!$C$22=\"kyllä\",25.5%,0%)","v":0.255},0,0,0,0,0,0,0,null,"",0,null,"",0,null,"",null,null,null,0]
[null,519,null,null,null,null,null,1,{"$f":"IF(Etusivu!$C$22=\"kyllä\",25.5%,0%)","v":0.255},0,0,0,0,0,0,0,null,"",0,null,"",0,null,"",null,null,null,0]
[null,520,null,null,null,null,null,1,{"$f":"IF(Etusivu!$C$22=\"kyllä\",25.5%,0%)","v":0.255},0,0,0,0,0,0,0,null,"",0,null,"",0,null,"",null,null,null,0]
[null,521,null,null,null,null,null,1,{"$f":"IF(Etusivu!$C$22=\"kyllä\",25.5%,0%)","v":0.255},0,0,0,0,0,0,0,null,"",0,null,"",0,null,"",null,null,null,{"$f":"IF($F334=AB$12,$K334,0)","v":0}]
[null,522,null,null,null,null,null,1,{"$f":"IF(Etusivu!$C$22=\"kyllä\",25.5%,0%)","v":0.255},0,0,0,0,0,0,0,null,"",{"$f":"IF($F335=S$12,$K335,0)","v":0},null,"",{"$f":"IF($F335=V$12,$K335,0)","v":0},null,"",null,null,null,0]
[null,523,null,null,null,null,null,1,{"$f":"IF(Etusivu!$C$22=\"kyllä\",25.5%,0%)","v":0.255},0,0,0,0,0,0,0,null,{"$f":"IF(P336>0,IF(Q336<1,\" !\",\"\"),\"\")","v":""},0,null,{"$f":"IF(S336>0,IF(T336<1,\" !\",\"\"),\"\")","v":""},0,null,{"$f":"IF(V336>0,IF(W336<1,\" !\",\"\"),\"\")","v":""},null,null,null,0]
[null,524,null,null,null,null,null,1,{"$f":"IF(Etusivu!$C$22=\"kyllä\",25.5%,0%)","v":0.255},{"$f":"H337*((G337-(AD337+AE337+AF337)*(1+I337))-((G337-(AD337+AE337+AF337)*(1+I337))/(1+I337)))","v":0},{"$f":"H337*(G337/(1+I337))","v":0},0,0,0,0,0,null,"",0,null,"",0,null,"",null,null,null,0]
[null,525,null,null,null,null,null,1,{"$f":"IF(Etusivu!$C$22=\"kyllä\",25.5%,0%)","v":0.255},0,0,0,0,0,0,0,null,"",0,null,"",0,null,"",null,null,null,0]
[null,526,null,null,null,null,null,1,{"$f":"IF(Etusivu!$C$22=\"kyllä\",25.5%,0%)","v":0.255},0,0,0,0,0,0,0,null,"",0,null,"",0,null,"",null,null,null,0]
[null,527,null,null,null,null,null,1,{"$f":"IF(Etusivu!$C$22=\"kyllä\",25.5%,0%)","v":0.255},0,0,0,0,0,0,0,null,"",0,null,"",0,null,"",null,null,null,0]
[null,528,null,null,null,null,null,1,{"$f":"IF(Etusivu!$C$22=\"kyllä\",25.5%,0%)","v":0.255},0,0,0,0,0,0,0,null,"",0,null,"",0,null,"",null,null,null,0]
[null,529,null,null,null,null,null,1,{"$f":"IF(Etusivu!$C$22=\"kyllä\",25.5%,0%)","v":0.255},0,0,0,0,0,0,0,null,"",0,null,"",0,null,"",null,null,null,0]
[null,530,null,null,null,null,null,1,{"$f":"IF(Etusivu!$C$22=\"kyllä\",25.5%,0%)","v":0.255},0,0,0,0,0,0,0,null,"",0,null,"",0,null,"",null,null,null,0]
[null,531,null,null,null,null,null,1,{"$f":"IF(Etusivu!$C$22=\"kyllä\",25.5%,0%)","v":0.255},0,0,0,0,0,0,0,null,"",0,null,"",0,null,"",null,null,null,0]
[null,532,null,null,null,null,null,1,{"$f":"IF(Etusivu!$C$22=\"kyllä\",25.5%,0%)","v":0.255},0,0,0,0,0,0,0,null,"",0,null,"",0,null,"",null,null,null,0]
[null,533,null,null,null,null,null,1,{"$f":"IF(Etusivu!$C$22=\"kyllä\",25.5%,0%)","v":0.255},0,0,0,0,0,0,0,null,"",0,null,"",0,null,"",null,null,null,0]
[null,534,null,null,null,null,null,1,{"$f":"IF(Etusivu!$C$22=\"kyllä\",25.5%,0%)","v":0.255},0,0,0,0,0,0,0,null,"",0,null,"",0,null,"",null,null,null,0]
[null,535,null,null,null,null,null,1,{"$f":"IF(Etusivu!$C$22=\"kyllä\",25.5%,0%)","v":0.255},0,0,0,0,0,0,0,null,"",0,null,"",0,null,"",null,null,null,0]
[null,536,null,null,null,null,null,1,{"$f":"IF(Etusivu!$C$22=\"kyllä\",25.5%,0%)","v":0.255},0,0,0,0,0,0,0,null,"",0,null,"",0,null,"",null,null,null,0]
[null,537,null,null,null,null,null,1,{"$f":"IF(Etusivu!$C$22=\"kyllä\",25.5%,0%)","v":0.255},0,0,0,0,0,0,0,null,"",0,null,"",0,null,"",null,null,null,0]
[null,538,null,null,null,null,null,1,{"$f":"IF(Etusivu!$C$22=\"kyllä\",25.5%,0%)","v":0.255},0,0,0,0,0,0,0,null,"",0,null,"",0,null,"",null,null,null,0]
[null,539,null,null,null,null,null,1,{"$f":"IF(Etusivu!$C$22=\"kyllä\",25.5%,0%)","v":0.255},0,0,0,0,0,0,0,null,"",0,null,"",0,null,"",null,null,null,0]
[null,540,null,null,null,null,null,1,{"$f":"IF(Etusivu!$C$22=\"kyllä\",25.5%,0%)","v":0.255},0,0,0,0,0,0,0,null,"",0,null,"",0,null,"",null,null,null,0]
[null,541,null,null,null,null,null,1,{"$f":"IF(Etusivu!$C$22=\"kyllä\",25.5%,0%)","v":0.255},0,0,0,0,0,0,0,null,"",0,null,"",0,null,"",null,null,null,0]
[null,542,null,null,null,null,null,1,{"$f":"IF(Etusivu!$C$22=\"kyllä\",25.5%,0%)","v":0.255},0,0,0,0,0,0,0,null,"",0,null,"",0,null,"",null,null,null,0]
[null,543,null,null,null,null,null,1,{"$f":"IF(Etusivu!$C$22=\"kyllä\",25.5%,0%)","v":0.255},0,0,0,0,0,0,0,null,"",0,null,"",0,null,"",null,null,null,0]
[null,544,null,null,null,null,null,1,{"$f":"IF(Etusivu!$C$22=\"kyllä\",25.5%,0%)","v":0.255},0,0,0,0,0,0,0,null,"",0,null,"",0,null,"",null,null,null,0]
[null,545,null,null,null,null,null,1,{"$f":"IF(Etusivu!$C$22=\"kyllä\",25.5%,0%)","v":0.255},0,0,0,0,0,0,0,null,"",0,null,"",0,null,"",null,null,null,0]
[null,546,null,null,null,null,null,1,{"$f":"IF(Etusivu!$C$22=\"kyllä\",25.5%,0%)","v":0.255},0,0,0,0,0,0,0,null,"",0,null,"",0,null,"",null,null,null,0]
[null,547,null,null,null,null,null,1,{"$f":"IF(Etusivu!$C$22=\"kyllä\",25.5%,0%)","v":0.255},0,0,0,0,0,0,0,null,"",0,null,"",0,null,"",null,null,null,0]
[null,548,null,null,null,null,null,1,{"$f":"IF(Etusivu!$C$22=\"kyllä\",25.5%,0%)","v":0.255},0,0,0,0,0,0,0,null,"",0,null,"",0,null,"",null,null,null,0]
[null,549,null,null,null,null,null,1,{"$f":"IF(Etusivu!$C$22=\"kyllä\",25.5%,0%)","v":0.255},0,0,0,0,0,0,0,null,"",0,null,"",0,null,"",null,null,null,0]
[null,550,null,null,null,null,null,1,{"$f":"IF(Etusivu!$C$22=\"kyllä\",25.5%,0%)","v":0.255},0,0,0,0,0,0,0,null,"",0,null,"",0,null,"",null,null,null,0]
[null,551,null,null,null,null,null,1,{"$f":"IF(Etusivu!$C$22=\"kyllä\",25.5%,0%)","v":0.255},0,0,0,0,0,0,0,null,"",0,null,"",0,null,"",null,null,null,0]
[null,552,null,null,null,null,null,1,{"$f":"IF(Etusivu!$C$22=\"kyllä\",25.5%,0%)","v":0.255},0,0,0,0,0,0,0,null,"",0,null,"",0,null,"",null,null,null,0]
[null,553,null,null,null,null,null,1,{"$f":"IF(Etusivu!$C$22=\"kyllä\",25.5%,0%)","v":0.255},0,0,0,0,0,0,0,null,"",0,null,"",0,null,"",null,null,null,0]
[null,554,null,null,null,null,null,1,{"$f":"IF(Etusivu!$C$22=\"kyllä\",25.5%,0%)","v":0.255},0,0,0,0,0,0,0,null,"",0,null,"",0,null,"",null,null,null,0]
[null,555,null,null,null,null,null,1,{"$f":"IF(Etusivu!$C$22=\"kyllä\",25.5%,0%)","v":0.255},0,0,0,0,0,0,0,null,"",0,null,"",0,null,"",null,null,null,0]
[null,556,null,null,null,null,null,1,{"$f":"IF(Etusivu!$C$22=\"kyllä\",25.5%,0%)","v":0.255},0,0,0,0,0,0,0,null,"",0,null,"",0,null,"",null,null,null,0]
[null,557,null,null,null,null,null,1,{"$f":"IF(Etusivu!$C$22=\"kyllä\",25.5%,0%)","v":0.255},0,0,0,0,0,0,0,null,"",0,null,"",0,null,"",null,null,null,0]
[null,558,null,null,null,null,null,1,{"$f":"IF(Etusivu!$C$22=\"kyllä\",25.5%,0%)","v":0.255},0,0,0,0,0,0,0,null,"",0,null,"",0,null,"",null,null,null,0]
[null,559,null,null,null,null,null,1,{"$f":"IF(Etusivu!$C$22=\"kyllä\",25.5%,0%)","v":0.255},0,0,0,0,0,0,0,null,"",0,null,"",0,null,"",null,null,null,0]
[null,560,null,null,null,null,null,1,{"$f":"IF(Etusivu!$C$22=\"kyllä\",25.5%,0%)","v":0.255},0,0,0,0,0,0,0,null,"",0,null,"",0,null,"",null,null,null,0]
[null,561,null,null,null,null,null,1,{"$f":"IF(Etusivu!$C$22=\"kyllä\",25.5%,0%)","v":0.255},0,0,0,0,0,0,0,null,"",0,null,"",0,null,"",null,null,null,0]
[null,562,null,null,null,null,null,1,{"$f":"IF(Etusivu!$C$22=\"kyllä\",25.5%,0%)","v":0.255},0,0,0,0,0,0,0,null,"",0,null,"",0,null,"",null,null,null,0]
[null,563,null,null,null,null,null,1,{"$f":"IF(Etusivu!$C$22=\"kyllä\",25.5%,0%)","v":0.255},0,0,0,0,0,0,0,null,"",0,null,"",0,null,"",null,null,null,0]
[null,564,null,null,null,null,null,1,{"$f":"IF(Etusivu!$C$22=\"kyllä\",25.5%,0%)","v":0.255},0,0,0,0,0,0,0,null,"",0,null,"",0,null,"",null,null,null,0]
[null,565,null,null,null,null,null,1,{"$f":"IF(Etusivu!$C$22=\"kyllä\",25.5%,0%)","v":0.255},0,0,{"$f":"IF($F378=L$12,$K378,0)","v":0},0,0,0,0,null,"",0,null,"",0,null,"",null,null,null,0]
[null,566,null,null,null,null,null,1,{"$f":"IF(Etusivu!$C$22=\"kyllä\",25.5%,0%)","v":0.255},0,0,0,0,0,0,0,null,"",0,null,"",0,null,"",null,null,null,0]
[null,567,null,null,null,null,null,1,{"$f":"IF(Etusivu!$C$22=\"kyllä\",25.5%,0%)","v":0.255},0,0,0,0,0,0,0,null,"",0,null,"",0,null,"",null,null,null,0]
[null,568,null,null,null,null,null,1,{"$f":"IF(Etusivu!$C$22=\"kyllä\",25.5%,0%)","v":0.255},0,0,0,0,0,0,0,null,"",0,null,"",0,null,"",null,null,null,0]
[null,569,null,null,null,null,null,1,{"$f":"IF(Etusivu!$C$22=\"kyllä\",25.5%,0%)","v":0.255},0,0,0,0,0,0,0,null,"",0,null,"",0,null,"",null,null,null,0]
[null,570,null,null,null,null,null,1,{"$f":"IF(Etusivu!$C$22=\"kyllä\",25.5%,0%)","v":0.255},0,0,0,0,0,0,0,null,"",0,null,"",0,null,"",null,null,null,0]
[null,571,null,null,null,null,null,1,{"$f":"IF(Etusivu!$C$22=\"kyllä\",25.5%,0%)","v":0.255},0,0,0,0,0,0,0,null,"",0,null,"",0,null,"",null,null,null,0]
[null,572,null,null,null,null,null,1,{"$f":"IF(Etusivu!$C$22=\"kyllä\",25.5%,0%)","v":0.255},0,0,0,0,0,0,0,null,"",0,null,"",0,null,"",null,null,null,0]
[null,573,null,null,null,null,null,1,{"$f":"IF(Etusivu!$C$22=\"kyllä\",25.5%,0%)","v":0.255},0,0,0,0,0,0,0,null,"",0,null,"",0,null,"",null,null,null,0]
[null,574,null,null,null,null,null,1,{"$f":"IF(Etusivu!$C$22=\"kyllä\",25.5%,0%)","v":0.255},0,0,0,0,0,0,0,null,"",0,null,"",0,null,"",null,null,null,0]
[null,575,null,null,null,null,null,1,{"$f":"IF(Etusivu!$C$22=\"kyllä\",25.5%,0%)","v":0.255},0,0,0,0,0,0,0,null,"",0,null,"",0,null,"",null,null,null,0]
[null,576,null,null,null,null,null,1,{"$f":"IF(Etusivu!$C$22=\"kyllä\",25.5%,0%)","v":0.255},0,0,0,0,0,0,0,null,"",0,null,"",0,null,"",null,null,null,0]
[null,577,null,null,null,null,null,1,{"$f":"IF(Etusivu!$C$22=\"kyllä\",25.5%,0%)","v":0.255},0,0,0,0,0,0,0,null,"",0,null,"",0,null,"",null,null,null,0]
[null,578,null,null,null,null,null,1,{"$f":"IF(Etusivu!$C$22=\"kyllä\",25.5%,0%)","v":0.255},0,0,0,0,0,0,0,null,"",0,null,"",0,null,"",null,null,null,0]
[null,579,null,null,null,null,null,1,{"$f":"IF(Etusivu!$C$22=\"kyllä\",25.5%,0%)","v":0.255},0,0,0,0,0,0,0,null,"",0,null,"",0,null,"",null,null,null,0]
[null,580,null,null,null,null,null,1,{"$f":"IF(Etusivu!$C$22=\"kyllä\",25.5%,0%)","v":0.255},0,0,0,0,0,0,0,null,"",0,null,"",0,null,"",null,null,null,0]
[null,581,null,null,null,null,null,1,{"$f":"IF(Etusivu!$C$22=\"kyllä\",25.5%,0%)","v":0.255},0,0,0,0,0,0,0,null,"",0,null,"",0,null,"",null,null,null,0]
[null,582,null,null,null,null,null,1,{"$f":"IF(Etusivu!$C$22=\"kyllä\",25.5%,0%)","v":0.255},0,0,0,0,0,0,0,null,"",0,null,"",0,null,"",null,null,null,0]
[null,583,null,null,null,null,null,1,{"$f":"IF(Etusivu!$C$22=\"kyllä\",25.5%,0%)","v":0.255},0,0,0,0,0,0,0,null,"",0,null,"",0,null,"",null,null,null,0]
[null,584,null,null,null,null,null,1,{"$f":"IF(Etusivu!$C$22=\"kyllä\",25.5%,0%)","v":0.255},0,0,0,0,0,0,0,null,"",0,null,"",0,null,"",null,null,null,0]
[null,585,null,null,null,null,null,1,{"$f":"IF(Etusivu!$C$22=\"kyllä\",25.5%,0%)","v":0.255},0,0,0,0,0,0,0,null,"",0,null,"",0,null,"",null,null,null,{"$f":"IF($F398=AB$12,$K398,0)","v":0}]
[null,586,null,null,null,null,null,1,{"$f":"IF(Etusivu!$C$22=\"kyllä\",25.5%,0%)","v":0.255},0,0,0,0,0,0,0,null,"",{"$f":"IF($F399=S$12,$K399,0)","v":0},null,"",{"$f":"IF($F399=V$12,$K399,0)","v":0},null,"",null,null,null,0]
[null,587,null,null,null,null,null,1,{"$f":"IF(Etusivu!$C$22=\"kyllä\",25.5%,0%)","v":0.255},0,0,0,0,0,0,0,null,{"$f":"IF(P400>0,IF(Q400<1,\" !\",\"\"),\"\")","v":""},0,null,{"$f":"IF(S400>0,IF(T400<1,\" !\",\"\"),\"\")","v":""},0,null,{"$f":"IF(V400>0,IF(W400<1,\" !\",\"\"),\"\")","v":""},null,null,null,0]
[null,588,null,null,null,null,null,1,{"$f":"IF(Etusivu!$C$22=\"kyllä\",25.5%,0%)","v":0.255},{"$f":"H401*((G401-(AD401+AE401+AF401)*(1+I401))-((G401-(AD401+AE401+AF401)*(1+I401))/(1+I401)))","v":0},{"$f":"H401*(G401/(1+I401))","v":0},0,0,0,0,0,null,"",0,null,"",0,null,"",null,null,null,0]
[null,589,null,null,null,null,null,1,{"$f":"IF(Etusivu!$C$22=\"kyllä\",25.5%,0%)","v":0.255},0,0,0,0,0,0,0,null,"",0,null,"",0,null,"",null,null,null,0]
[null,590,null,null,null,null,null,1,{"$f":"IF(Etusivu!$C$22=\"kyllä\",25.5%,0%)","v":0.255},0,0,0,0,0,0,0,null,"",0,null,"",0,null,"",null,null,null,0]
[null,591,null,null,null,null,null,1,{"$f":"IF(Etusivu!$C$22=\"kyllä\",25.5%,0%)","v":0.255},0,0,0,0,0,0,0,null,"",0,null,"",0,null,"",null,null,null,0]
[null,592,null,null,null,null,null,1,{"$f":"IF(Etusivu!$C$22=\"kyllä\",25.5%,0%)","v":0.255},0,0,0,0,0,0,0,null,"",0,null,"",0,null,"",null,null,null,0]
[null,593,null,null,null,null,null,1,{"$f":"IF(Etusivu!$C$22=\"kyllä\",25.5%,0%)","v":0.255},0,0,0,0,0,0,0,null,"",0,null,"",0,null,"",null,null,null,0]
[null,594,null,null,null,null,null,1,{"$f":"IF(Etusivu!$C$22=\"kyllä\",25.5%,0%)","v":0.255},0,0,0,0,0,0,0,null,"",0,null,"",0,null,"",null,null,null,0]
[null,595,null,null,null,null,null,1,{"$f":"IF(Etusivu!$C$22=\"kyllä\",25.5%,0%)","v":0.255},0,0,0,0,0,0,0,null,"",0,null,"",0,null,"",null,null,null,0]
[null,596,null,null,null,null,null,1,{"$f":"IF(Etusivu!$C$22=\"kyllä\",25.5%,0%)","v":0.255},0,0,0,0,0,0,0,null,"",0,null,"",0,null,"",null,null,null,0]
[null,597,null,null,null,null,null,1,{"$f":"IF(Etusivu!$C$22=\"kyllä\",25.5%,0%)","v":0.255},0,0,0,0,0,0,0,null,"",0,null,"",0,null,"",null,null,null,0]
[null,598,null,null,null,null,null,1,{"$f":"IF(Etusivu!$C$22=\"kyllä\",25.5%,0%)","v":0.255},0,0,0,0,0,0,0,null,"",0,null,"",0,null,"",null,null,null,0]
[null,599,null,null,null,null,null,1,{"$f":"IF(Etusivu!$C$22=\"kyllä\",25.5%,0%)","v":0.255},0,0,0,0,0,0,0,null,"",0,null,"",0,null,"",null,null,null,0]
[null,600,null,null,null,null,null,1,{"$f":"IF(Etusivu!$C$22=\"kyllä\",25.5%,0%)","v":0.255},0,0,0,0,0,0,0,null,"",0,null,"",0,null,"",null,null,null,0]
[null,601,null,null,null,null,null,1,{"$f":"IF(Etusivu!$C$22=\"kyllä\",25.5%,0%)","v":0.255},0,0,0,0,0,0,0,null,"",0,null,"",0,null,"",null,null,null,0]
[null,602,null,null,null,null,null,1,{"$f":"IF(Etusivu!$C$22=\"kyllä\",25.5%,0%)","v":0.255},0,0,0,0,0,0,0,null,"",0,null,"",0,null,"",null,null,null,0]
[null,603,null,null,null,null,null,1,{"$f":"IF(Etusivu!$C$22=\"kyllä\",25.5%,0%)","v":0.255},0,0,0,0,0,0,0,null,"",0,null,"",0,null,"",null,null,null,0]
[null,604,null,null,null,null,null,1,{"$f":"IF(Etusivu!$C$22=\"kyllä\",25.5%,0%)","v":0.255},0,0,0,0,0,0,0,null,"",0,null,"",0,null,"",null,null,null,0]
[null,605,null,null,null,null,null,1,{"$f":"IF(Etusivu!$C$22=\"kyllä\",25.5%,0%)","v":0.255},0,0,0,0,0,0,0,null,"",0,null,"",0,null,"",null,null,null,0]
[null,606,null,null,null,null,null,1,{"$f":"IF(Etusivu!$C$22=\"kyllä\",25.5%,0%)","v":0.255},0,0,0,0,0,0,0,null,"",0,null,"",0,null,"",null,null,null,0]
[null,607,null,null,null,null,null,1,{"$f":"IF(Etusivu!$C$22=\"kyllä\",25.5%,0%)","v":0.255},0,0,0,0,0,0,0,null,"",0,null,"",0,null,"",null,null,null,0]
[null,608,null,null,null,null,null,1,{"$f":"IF(Etusivu!$C$22=\"kyllä\",25.5%,0%)","v":0.255},0,0,0,0,0,0,0,null,"",0,null,"",0,null,"",null,null,null,0]
[null,609,null,null,null,null,null,1,{"$f":"IF(Etusivu!$C$22=\"kyllä\",25.5%,0%)","v":0.255},0,0,0,0,0,0,0,null,"",0,null,"",0,null,"",null,null,null,0]
[null,610,null,null,null,null,null,1,{"$f":"IF(Etusivu!$C$22=\"kyllä\",25.5%,0%)","v":0.255},0,0,0,0,0,0,0,null,"",0,null,"",0,null,"",null,null,null,0]
[null,611,null,null,null,null,null,1,{"$f":"IF(Etusivu!$C$22=\"kyllä\",25.5%,0%)","v":0.255},0,0,0,0,0,0,0,null,"",0,null,"",0,null,"",null,null,null,0]
[null,612,null,null,null,null,null,1,{"$f":"IF(Etusivu!$C$22=\"kyllä\",25.5%,0%)","v":0.255},0,0,0,0,0,0,0,null,"",0,null,"",0,null,"",null,null,null,0]
[null,613,null,null,null,null,null,1,{"$f":"IF(Etusivu!$C$22=\"kyllä\",25.5%,0%)","v":0.255},0,0,0,0,0,0,0,null,"",0,null,"",0,null,"",null,null,null,0]
[null,614,null,null,null,null,null,1,{"$f":"IF(Etusivu!$C$22=\"kyllä\",25.5%,0%)","v":0.255},0,0,0,0,0,0,0,null,"",0,null,"",0,null,"",null,null,null,0]
[null,615,null,null,null,null,null,1,{"$f":"IF(Etusivu!$C$22=\"kyllä\",25.5%,0%)","v":0.255},0,0,0,0,0,0,0,null,"",0,null,"",0,null,"",null,null,null,0]
[null,616,null,null,null,null,null,1,{"$f":"IF(Etusivu!$C$22=\"kyllä\",25.5%,0%)","v":0.255},0,0,{"$f":"IF($F429=L$12,$K429,0)","v":0},0,0,0,0,null,"",0,null,"",0,null,"",null,null,null,0]
[null,617,null,null,null,null,null,1,{"$f":"IF(Etusivu!$C$22=\"kyllä\",25.5%,0%)","v":0.255},0,0,0,0,0,0,0,null,"",0,null,"",0,null,"",null,null,null,0]
[null,618,null,null,null,null,null,1,{"$f":"IF(Etusivu!$C$22=\"kyllä\",25.5%,0%)","v":0.255},0,0,0,0,0,0,0,null,"",0,null,"",0,null,"",null,null,null,0]
[null,619,null,null,null,null,null,1,{"$f":"IF(Etusivu!$C$22=\"kyllä\",25.5%,0%)","v":0.255},0,0,0,0,0,0,0,null,"",0,null,"",0,null,"",null,null,null,0]
[null,620,null,null,null,null,null,1,{"$f":"IF(Etusivu!$C$22=\"kyllä\",25.5%,0%)","v":0.255},0,0,0,0,0,0,0,null,"",0,null,"",0,null,"",null,null,null,0]
[null,621,null,null,null,null,null,1,{"$f":"IF(Etusivu!$C$22=\"kyllä\",25.5%,0%)","v":0.255},0,0,0,0,0,0,0,null,"",0,null,"",0,null,"",null,null,null,0]
[null,622,null,null,null,null,null,1,{"$f":"IF(Etusivu!$C$22=\"kyllä\",25.5%,0%)","v":0.255},0,0,0,0,0,0,0,null,"",0,null,"",0,null,"",null,null,null,0]
[null,623,null,null,null,null,null,1,{"$f":"IF(Etusivu!$C$22=\"kyllä\",25.5%,0%)","v":0.255},0,0,0,0,0,0,0,null,"",0,null,"",0,null,"",null,null,null,0]
[null,624,null,null,null,null,null,1,{"$f":"IF(Etusivu!$C$22=\"kyllä\",25.5%,0%)","v":0.255},0,0,0,0,0,0,0,null,"",0,null,"",0,null,"",null,null,null,0]
[null,625,null,null,null,null,null,1,{"$f":"IF(Etusivu!$C$22=\"kyllä\",25.5%,0%)","v":0.255},0,0,0,0,0,0,0,null,"",0,null,"",0,null,"",null,null,null,0]
[null,626,null,null,null,null,null,1,{"$f":"IF(Etusivu!$C$22=\"kyllä\",25.5%,0%)","v":0.255},0,0,0,0,0,0,0,null,"",0,null,"",0,null,"",null,null,null,0]
[null,627,null,null,null,null,null,1,{"$f":"IF(Etusivu!$C$22=\"kyllä\",25.5%,0%)","v":0.255},0,0,0,0,0,0,0,null,"",0,null,"",0,null,"",null,null,null,0]
[null,628,null,null,null,null,null,1,{"$f":"IF(Etusivu!$C$22=\"kyllä\",25.5%,0%)","v":0.255},0,0,0,0,0,0,0,null,"",0,null,"",0,null,"",null,null,null,0]
[null,629,null,null,null,null,null,1,{"$f":"IF(Etusivu!$C$22=\"kyllä\",25.5%,0%)","v":0.255},0,0,0,0,0,0,0,null,"",0,null,"",0,null,"",null,null,null,0]
[null,630,null,null,null,null,null,1,{"$f":"IF(Etusivu!$C$22=\"kyllä\",25.5%,0%)","v":0.255},0,0,0,0,0,0,0,null,"",0,null,"",0,null,"",null,null,null,0]
[null,631,null,null,null,null,null,1,{"$f":"IF(Etusivu!$C$22=\"kyllä\",25.5%,0%)","v":0.255},0,0,0,0,0,0,0,null,"",0,null,"",0,null,"",null,null,null,0]
[null,632,null,null,null,null,null,1,{"$f":"IF(Etusivu!$C$22=\"kyllä\",25.5%,0%)","v":0.255},0,0,0,0,0,0,0,null,"",0,null,"",0,null,"",null,null,null,0]
[null,633,null,null,null,null,null,1,{"$f":"IF(Etusivu!$C$22=\"kyllä\",25.5%,0%)","v":0.255},0,0,0,0,0,0,0,null,"",0,null,"",0,null,"",null,null,null,0]
[null,634,null,null,null,null,null,1,{"$f":"IF(Etusivu!$C$22=\"kyllä\",25.5%,0%)","v":0.255},0,0,0,0,0,0,0,null,"",0,null,"",0,null,"",null,null,null,0]
[null,635,null,null,null,null,null,1,{"$f":"IF(Etusivu!$C$22=\"kyllä\",25.5%,0%)","v":0.255},0,0,0,0,0,0,0,null,"",0,null,"",0,null,"",null,null,null,0]
[null,636,null,null,null,null,null,1,{"$f":"IF(Etusivu!$C$22=\"kyllä\",25.5%,0%)","v":0.255},0,0,0,0,0,0,0,null,"",0,null,"",0,null,"",null,null,null,0]
[null,637,null,null,null,null,null,1,{"$f":"IF(Etusivu!$C$22=\"kyllä\",25.5%,0%)","v":0.255},0,0,0,0,0,0,0,null,"",0,null,"",0,null,"",null,null,null,0]
[null,638,null,null,null,null,null,1,{"$f":"IF(Etusivu!$C$22=\"kyllä\",25.5%,0%)","v":0.255},0,0,0,0,0,0,0,null,"",0,null,"",0,null,"",null,null,null,0]
[null,639,null,null,null,null,null,1,{"$f":"IF(Etusivu!$C$22=\"kyllä\",25.5%,0%)","v":0.255},0,0,0,0,0,0,0,null,"",0,null,"",0,null,"",null,null,null,0]
[null,640,null,null,null,null,null,1,{"$f":"IF(Etusivu!$C$22=\"kyllä\",25.5%,0%)","v":0.255},0,0,0,0,0,0,0,null,"",0,null,"",0,null,"",null,null,null,0]
[null,641,null,null,null,null,null,1,{"$f":"IF(Etusivu!$C$22=\"kyllä\",25.5%,0%)","v":0.255},0,0,0,0,0,0,0,null,"",0,null,"",0,null,"",null,null,null,0]
[null,642,null,null,null,null,null,1,{"$f":"IF(Etusivu!$C$22=\"kyllä\",25.5%,0%)","v":0.255},0,0,0,0,0,0,0,null,"",0,null,"",0,null,"",null,null,null,0]
[null,643,null,null,null,null,null,1,{"$f":"IF(Etusivu!$C$22=\"kyllä\",25.5%,0%)","v":0.255},0,0,0,0,0,0,0,null,"",0,null,"",0,null,"",null,null,null,0]
[null,644,null,null,null,null,null,1,{"$f":"IF(Etusivu!$C$22=\"kyllä\",25.5%,0%)","v":0.255},0,0,0,0,0,0,0,null,"",0,null,"",0,null,"",null,null,null,0]
[null,645,null,null,null,null,null,1,{"$f":"IF(Etusivu!$C$22=\"kyllä\",25.5%,0%)","v":0.255},0,0,0,0,0,0,0,null,"",0,null,"",0,null,"",null,null,null,0]
[null,646,null,null,null,null,null,1,{"$f":"IF(Etusivu!$C$22=\"kyllä\",25.5%,0%)","v":0.255},0,0,0,0,0,0,0,null,"",0,null,"",0,null,"",null,null,null,0]
[null,647,null,null,null,null,null,1,{"$f":"IF(Etusivu!$C$22=\"kyllä\",25.5%,0%)","v":0.255},0,0,0,0,0,0,0,null,"",0,null,"",0,null,"",null,null,null,0]
[null,648,null,null,null,null,null,1,{"$f":"IF(Etusivu!$C$22=\"kyllä\",25.5%,0%)","v":0.255},0,0,0,0,0,0,0,null,"",0,null,"",0,null,"",null,null,null,0]
[null,649,null,null,null,null,null,1,{"$f":"IF(Etusivu!$C$22=\"kyllä\",25.5%,0%)","v":0.255},0,0,0,0,0,0,0,null,"",0,null,"",0,null,"",null,null,null,{"$f":"IF($F462=AB$12,$K462,0)","v":0}]
[null,650,null,null,null,null,null,1,{"$f":"IF(Etusivu!$C$22=\"kyllä\",25.5%,0%)","v":0.255},0,0,0,0,0,0,0,null,"",{"$f":"IF($F463=S$12,$K463,0)","v":0},null,"",{"$f":"IF($F463=V$12,$K463,0)","v":0},null,"",null,null,null,0]
[null,651,null,null,null,null,null,1,{"$f":"IF(Etusivu!$C$22=\"kyllä\",25.5%,0%)","v":0.255},0,0,0,0,0,0,0,null,{"$f":"IF(P464>0,IF(Q464<1,\" !\",\"\"),\"\")","v":""},0,null,{"$f":"IF(S464>0,IF(T464<1,\" !\",\"\"),\"\")","v":""},0,null,{"$f":"IF(V464>0,IF(W464<1,\" !\",\"\"),\"\")","v":""},null,null,null,0]
[null,652,null,null,null,null,null,1,{"$f":"IF(Etusivu!$C$22=\"kyllä\",25.5%,0%)","v":0.255},{"$f":"H465*((G465-(AD465+AE465+AF465)*(1+I465))-((G465-(AD465+AE465+AF465)*(1+I465))/(1+I465)))","v":0},{"$f":"H465*(G465/(1+I465))","v":0},0,0,0,0,0,null,"",0,null,"",0,null,"",null,null,null,0]
[null,653,null,null,null,null,null,1,{"$f":"IF(Etusivu!$C$22=\"kyllä\",25.5%,0%)","v":0.255},0,0,0,0,0,0,0,null,"",0,null,"",0,null,"",null,null,null,0]
[null,654,null,null,null,null,null,1,{"$f":"IF(Etusivu!$C$22=\"kyllä\",25.5%,0%)","v":0.255},0,0,0,0,0,0,0,null,"",0,null,"",0,null,"",null,null,null,0]
[null,655,null,null,null,null,null,1,{"$f":"IF(Etusivu!$C$22=\"kyllä\",25.5%,0%)","v":0.255},0,0,0,0,0,0,0,null,"",0,null,"",0,null,"",null,null,null,0]
[null,656,null,null,null,null,null,1,{"$f":"IF(Etusivu!$C$22=\"kyllä\",25.5%,0%)","v":0.255},0,0,0,0,0,0,0,null,"",0,null,"",0,null,"",null,null,null,0]
[null,657,null,null,null,null,null,1,{"$f":"IF(Etusivu!$C$22=\"kyllä\",25.5%,0%)","v":0.255},0,0,0,0,0,0,0,null,"",0,null,"",0,null,"",null,null,null,0]
[null,658,null,null,null,null,null,1,{"$f":"IF(Etusivu!$C$22=\"kyllä\",25.5%,0%)","v":0.255},0,0,0,0,0,0,0,null,"",0,null,"",0,null,"",null,null,null,0]
[null,659,null,null,null,null,null,1,{"$f":"IF(Etusivu!$C$22=\"kyllä\",25.5%,0%)","v":0.255},0,0,0,0,0,0,0,null,"",0,null,"",0,null,"",null,null,null,0]
[null,660,null,null,null,null,null,1,{"$f":"IF(Etusivu!$C$22=\"kyllä\",25.5%,0%)","v":0.255},0,0,0,0,0,0,0,null,"",0,null,"",0,null,"",null,null,null,0]
[null,661,null,null,null,null,null,1,{"$f":"IF(Etusivu!$C$22=\"kyllä\",25.5%,0%)","v":0.255},0,0,0,0,0,0,0,null,"",0,null,"",0,null,"",null,null,null,0]
[null,662,null,null,null,null,null,1,{"$f":"IF(Etusivu!$C$22=\"kyllä\",25.5%,0%)","v":0.255},0,0,0,0,0,0,0,null,"",0,null,"",0,null,"",null,null,null,0]
[null,663,null,null,null,null,null,1,{"$f":"IF(Etusivu!$C$22=\"kyllä\",25.5%,0%)","v":0.255},0,0,0,0,0,0,0,null,"",0,null,"",0,null,"",null,null,null,0]
[null,664,null,null,null,null,null,1,{"$f":"IF(Etusivu!$C$22=\"kyllä\",25.5%,0%)","v":0.255},0,0,0,0,0,0,0,null,"",0,null,"",0,null,"",null,null,null,0]
[null,665,null,null,null,null,null,1,{"$f":"IF(Etusivu!$C$22=\"kyllä\",25.5%,0%)","v":0.255},0,0,0,0,0,0,0,null,"",0,null,"",0,null,"",null,null,null,0]
[null,666,null,null,null,null,null,1,{"$f":"IF(Etusivu!$C$22=\"kyllä\",25.5%,0%)","v":0.255},0,0,0,0,0,0,0,null,"",0,null,"",0,null,"",null,null,null,0]
[null,667,null,null,null,null,null,1,{"$f":"IF(Etusivu!$C$22=\"kyllä\",25.5%,0%)","v":0.255},0,0,{"$f":"IF($F480=L$12,$K480,0)","v":0},0,0,0,0,null,"",0,null,"",0,null,"",null,null,null,0]
[null,668,null,null,null,null,null,1,{"$f":"IF(Etusivu!$C$22=\"kyllä\",25.5%,0%)","v":0.255},0,0,0,0,0,0,0,null,"",0,null,"",0,null,"",null,null,null,0]
[null,669,null,null,null,null,null,1,{"$f":"IF(Etusivu!$C$22=\"kyllä\",25.5%,0%)","v":0.255},0,0,0,0,0,0,0,null,"",0,null,"",0,null,"",null,null,null,0]
[null,670,null,null,null,null,null,1,{"$f":"IF(Etusivu!$C$22=\"kyllä\",25.5%,0%)","v":0.255},0,0,0,0,0,0,0,null,"",0,null,"",0,null,"",null,null,null,0]
[null,671,null,null,null,null,null,1,{"$f":"IF(Etusivu!$C$22=\"kyllä\",25.5%,0%)","v":0.255},0,0,0,0,0,0,0,null,"",0,null,"",0,null,"",null,null,null,0]
[null,672,null,null,null,null,null,1,{"$f":"IF(Etusivu!$C$22=\"kyllä\",25.5%,0%)","v":0.255},0,0,0,0,0,0,0,null,"",0,null,"",0,null,"",null,null,null,0]
[null,673,null,null,null,null,null,1,{"$f":"IF(Etusivu!$C$22=\"kyllä\",25.5%,0%)","v":0.255},0,0,0,0,0,0,0,null,"",0,null,"",0,null,"",null,null,null,0]
[null,674,null,null,null,null,null,1,{"$f":"IF(Etusivu!$C$22=\"kyllä\",25.5%,0%)","v":0.255},0,0,0,0,0,0,0,null,"",0,null,"",0,null,"",null,null,null,0]
[null,675,null,null,null,null,null,1,{"$f":"IF(Etusivu!$C$22=\"kyllä\",25.5%,0%)","v":0.255},0,0,0,0,0,0,0,null,"",0,null,"",0,null,"",null,null,null,0]
[null,676,null,null,null,null,null,1,{"$f":"IF(Etusivu!$C$22=\"kyllä\",25.5%,0%)","v":0.255},0,0,0,0,0,0,0,null,"",0,null,"",0,null,"",null,null,null,0]
[null,677,null,null,null,null,null,1,{"$f":"IF(Etusivu!$C$22=\"kyllä\",25.5%,0%)","v":0.255},0,0,0,0,0,0,0,null,"",0,null,"",0,null,"",null,null,null,0]
[null,678,null,null,null,null,null,1,{"$f":"IF(Etusivu!$C$22=\"kyllä\",25.5%,0%)","v":0.255},0,0,0,0,0,0,0,null,"",0,null,"",0,null,"",null,null,null,0]
[null,679,null,null,null,null,null,1,{"$f":"IF(Etusivu!$C$22=\"kyllä\",25.5%,0%)","v":0.255},0,0,0,0,0,0,0,null,"",0,null,"",0,null,"",null,null,null,0]
[null,680,null,null,null,null,null,1,{"$f":"IF(Etusivu!$C$22=\"kyllä\",25.5%,0%)","v":0.255},0,0,0,0,0,0,0,null,"",0,null,"",0,null,"",null,null,null,0]
[null,681,null,null,null,null,null,1,{"$f":"IF(Etusivu!$C$22=\"kyllä\",25.5%,0%)","v":0.255},0,0,0,0,0,0,0,null,"",0,null,"",0,null,"",null,null,null,0]
[null,682,null,null,null,null,null,1,{"$f":"IF(Etusivu!$C$22=\"kyllä\",25.5%,0%)","v":0.255},0,0,0,0,0,0,0,null,"",0,null,"",0,null,"",null,null,null,0]
[null,683,null,null,null,null,null,1,{"$f":"IF(Etusivu!$C$22=\"kyllä\",25.5%,0%)","v":0.255},0,0,0,0,0,0,0,null,"",0,null,"",0,null,"",null,null,null,0]
[null,684,null,null,null,null,null,1,{"$f":"IF(Etusivu!$C$22=\"kyllä\",25.5%,0%)","v":0.255},0,0,0,0,0,0,0,null,"",0,null,"",0,null,"",null,null,null,0]
[null,685,null,null,null,null,null,1,{"$f":"IF(Etusivu!$C$22=\"kyllä\",25.5%,0%)","v":0.255},0,0,0,0,0,0,0,null,"",0,null,"",0,null,"",null,null,null,0]
[null,686,null,null,null,null,null,1,{"$f":"IF(Etusivu!$C$22=\"kyllä\",25.5%,0%)","v":0.255},0,0,0,0,0,0,0,null,"",0,null,"",0,null,"",null,null,null,0]
[null,687,null,null,null,null,null,1,{"$f":"IF(Etusivu!$C$22=\"kyllä\",25.5%,0%)","v":0.255},0,0,0,0,0,0,0,null,"",0,null,"",0,null,"",null,null,null,0]
[null,688,null,null,null,null,null,1,{"$f":"IF(Etusivu!$C$22=\"kyllä\",25.5%,0%)","v":0.255},0,0,0,0,0,0,0,null,"",0,null,"",0,null,"",null,null,null,0]
[null,689,null,null,null,null,null,1,{"$f":"IF(Etusivu!$C$22=\"kyllä\",25.5%,0%)","v":0.255},0,0,0,0,0,0,0,null,"",0,null,"",0,null,"",null,null,null,0]
[null,690,null,null,null,null,null,1,{"$f":"IF(Etusivu!$C$22=\"kyllä\",25.5%,0%)","v":0.255},0,0,0,0,0,0,0,null,"",0,null,"",0,null,"",null,null,null,0]
[null,691,null,null,null,null,null,1,{"$f":"IF(Etusivu!$C$22=\"kyllä\",25.5%,0%)","v":0.255},0,0,0,0,0,0,0,null,"",0,null,"",0,null,"",null,null,null,0]
[null,692,null,null,null,null,null,1,{"$f":"IF(Etusivu!$C$22=\"kyllä\",25.5%,0%)","v":0.255},0,0,0,0,0,0,0,null,"",0,null,"",0,null,"",null,null,null,0]
[null,693,null,null,null,null,null,1,{"$f":"IF(Etusivu!$C$22=\"kyllä\",25.5%,0%)","v":0.255},0,0,0,0,0,0,0,null,"",0,null,"",0,null,"",null,null,null,0]
[null,694,null,null,null,null,null,1,{"$f":"IF(Etusivu!$C$22=\"kyllä\",25.5%,0%)","v":0.255},0,0,0,0,0,0,0,null,"",0,null,"",0,null,"",null,null,null,0]
[null,695,null,null,null,null,null,1,{"$f":"IF(Etusivu!$C$22=\"kyllä\",25.5%,0%)","v":0.255},0,0,0,0,0,0,0,null,"",0,null,"",0,null,"",null,null,null,0]
[null,696,null,null,null,null,null,1,{"$f":"IF(Etusivu!$C$22=\"kyllä\",25.5%,0%)","v":0.255},0,0,0,0,0,0,0,null,"",0,null,"",0,null,"",null,null,null,0]
[null,697,null,null,null,null,null,1,{"$f":"IF(Etusivu!$C$22=\"kyllä\",25.5%,0%)","v":0.255},0,0,0,0,0,0,0,null,"",0,null,"",0,null,"",null,null,null,0]
[null,698,null,null,null,null,null,1,{"$f":"IF(Etusivu!$C$22=\"kyllä\",25.5%,0%)","v":0.255},0,0,0,0,0,0,0,null,"",0,null,"",0,null,"",null,null,null,0]
[null,699,null,null,null,null,null,1,{"$f":"IF(Etusivu!$C$22=\"kyllä\",25.5%,0%)","v":0.255},0,0,0,0,0,0,0,null,"",0,null,"",0,null,"",null,null,null,0]
[null,700,null,null,null,null,null,1,{"$f":"IF(Etusivu!$C$22=\"kyllä\",25.5%,0%)","v":0.255},0,0,0,0,0,0,0,null,"",0,null,"",0,null,"",null,null,null,0]
[null,701,null,null,null,null,null,1,{"$f":"IF(Etusivu!$C$22=\"kyllä\",25.5%,0%)","v":0.255},0,0,0,0,0,0,0,null,"",0,null,"",0,null,"",null,null,null,0]
[null,702,null,null,null,null,null,1,{"$f":"IF(Etusivu!$C$22=\"kyllä\",25.5%,0%)","v":0.255},0,0,0,0,0,0,0,null,"",0,null,"",0,null,"",null,null,null,0]
[null,703,null,null,null,null,null,1,{"$f":"IF(Etusivu!$C$22=\"kyllä\",25.5%,0%)","v":0.255},0,0,0,0,0,0,0,null,"",0,null,"",0,null,"",null,null,null,0]
[null,704,null,null,null,null,null,1,{"$f":"IF(Etusivu!$C$22=\"kyllä\",25.5%,0%)","v":0.255},0,0,0,0,0,0,0,null,"",0,null,"",0,null,"",null,null,null,0]
[null,705,null,null,null,null,null,1,{"$f":"IF(Etusivu!$C$22=\"kyllä\",25.5%,0%)","v":0.255},0,0,0,0,0,0,0,null,"",0,null,"",0,null,"",null,null,null,0]
[null,706,null,null,null,null,null,1,{"$f":"IF(Etusivu!$C$22=\"kyllä\",25.5%,0%)","v":0.255},0,0,0,0,0,0,0,null,"",0,null,"",0,null,"",null,null,null,0]
[null,707,null,null,null,null,null,1,{"$f":"IF(Etusivu!$C$22=\"kyllä\",25.5%,0%)","v":0.255},0,0,0,0,0,0,0,null,"",0,null,"",0,null,"",null,null,null,0]
[null,708,null,null,null,null,null,1,{"$f":"IF(Etusivu!$C$22=\"kyllä\",25.5%,0%)","v":0.255},0,0,0,0,0,0,0,null,"",0,null,"",0,null,"",null,null,null,0]
[null,709,null,null,null,null,null,1,{"$f":"IF(Etusivu!$C$22=\"kyllä\",25.5%,0%)","v":0.255},0,0,0,0,0,0,0,null,"",0,null,"",0,null,"",null,null,null,0]
[null,710,null,null,null,null,null,1,{"$f":"IF(Etusivu!$C$22=\"kyllä\",25.5%,0%)","v":0.255},0,0,0,0,0,0,0,null,"",0,null,"",0,null,"",null,null,null,0]
[null,711,null,null,null,null,null,1,{"$f":"IF(Etusivu!$C$22=\"kyllä\",25.5%,0%)","v":0.255},0,0,0,0,0,0,0,null,"",0,null,"",0,null,"",null,null,null,0]
[null,712,null,null,null,null,null,1,{"$f":"IF(Etusivu!$C$22=\"kyllä\",25.5%,0%)","v":0.255},0,0,0,0,0,0,0,null,"",0,null,"",0,null,"",null,null,null,0]
[null,713,null,null,null,null,null,1,{"$f":"IF(Etusivu!$C$22=\"kyllä\",25.5%,0%)","v":0.255},0,0,0,0,0,0,0,null,"",0,null,"",0,null,"",null,null,null,{"$f":"IF($F526=AB$12,$K526,0)","v":0}]
[null,714,null,null,null,null,null,1,{"$f":"IF(Etusivu!$C$22=\"kyllä\",25.5%,0%)","v":0.255},0,0,0,0,0,0,0,null,"",{"$f":"IF($F527=S$12,$K527,0)","v":0},null,"",{"$f":"IF($F527=V$12,$K527,0)","v":0},null,"",null,null,null,0]
[null,715,null,null,null,null,null,1,{"$f":"IF(Etusivu!$C$22=\"kyllä\",25.5%,0%)","v":0.255},0,0,0,0,0,0,0,null,{"$f":"IF(P528>0,IF(Q528<1,\" !\",\"\"),\"\")","v":""},0,null,{"$f":"IF(S528>0,IF(T528<1,\" !\",\"\"),\"\")","v":""},0,null,{"$f":"IF(V528>0,IF(W528<1,\" !\",\"\"),\"\")","v":""},null,null,null,0]
[null,716,null,null,null,null,null,1,{"$f":"IF(Etusivu!$C$22=\"kyllä\",25.5%,0%)","v":0.255},{"$f":"H529*((G529-(AD529+AE529+AF529)*(1+I529))-((G529-(AD529+AE529+AF529)*(1+I529))/(1+I529)))","v":0},{"$f":"H529*(G529/(1+I529))","v":0},0,0,0,0,0,null,"",0,null,"",0,null,"",null,null,null,0]
[null,717,null,null,null,null,null,1,{"$f":"IF(Etusivu!$C$22=\"kyllä\",25.5%,0%)","v":0.255},0,0,0,0,0,0,0,null,"",0,null,"",0,null,"",null,null,null,0]
[null,718,null,null,null,null,null,1,{"$f":"IF(Etusivu!$C$22=\"kyllä\",25.5%,0%)","v":0.255},0,0,{"$f":"IF($F531=L$12,$K531,0)","v":0},0,0,0,0,null,"",0,null,"",0,null,"",null,null,null,0]
[null,719,null,null,null,null,null,1,{"$f":"IF(Etusivu!$C$22=\"kyllä\",25.5%,0%)","v":0.255},0,0,0,0,0,0,0,null,"",0,null,"",0,null,"",null,null,null,0]
[null,720,null,null,null,null,null,1,{"$f":"IF(Etusivu!$C$22=\"kyllä\",25.5%,0%)","v":0.255},0,0,0,0,0,0,0,null,"",0,null,"",0,null,"",null,null,null,0]
[null,721,null,null,null,null,null,1,{"$f":"IF(Etusivu!$C$22=\"kyllä\",25.5%,0%)","v":0.255},0,0,0,0,0,0,0,null,"",0,null,"",0,null,"",null,null,null,0]
[null,722,null,null,null,null,null,1,{"$f":"IF(Etusivu!$C$22=\"kyllä\",25.5%,0%)","v":0.255},0,0,0,0,0,0,0,null,"",0,null,"",0,null,"",null,null,null,0]
[null,723,null,null,null,null,null,1,{"$f":"IF(Etusivu!$C$22=\"kyllä\",25.5%,0%)","v":0.255},0,0,0,0,0,0,0,null,"",0,null,"",0,null,"",null,null,null,0]
[null,724,null,null,null,null,null,1,{"$f":"IF(Etusivu!$C$22=\"kyllä\",25.5%,0%)","v":0.255},0,0,0,0,0,0,0,null,"",0,null,"",0,null,"",null,null,null,0]
[null,725,null,null,null,null,null,1,{"$f":"IF(Etusivu!$C$22=\"kyllä\",25.5%,0%)","v":0.255},0,0,0,0,0,0,0,null,"",0,null,"",0,null,"",null,null,null,0]
[null,726,null,null,null,null,null,1,{"$f":"IF(Etusivu!$C$22=\"kyllä\",25.5%,0%)","v":0.255},0,0,0,0,0,0,0,null,"",0,null,"",0,null,"",null,null,null,0]
[null,727,null,null,null,null,null,1,{"$f":"IF(Etusivu!$C$22=\"kyllä\",25.5%,0%)","v":0.255},0,0,0,0,0,0,0,null,"",0,null,"",0,null,"",null,null,null,0]
[null,728,null,null,null,null,null,1,{"$f":"IF(Etusivu!$C$22=\"kyllä\",25.5%,0%)","v":0.255},0,0,0,0,0,0,0,null,"",0,null,"",0,null,"",null,null,null,0]
[null,729,null,null,null,null,null,1,{"$f":"IF(Etusivu!$C$22=\"kyllä\",25.5%,0%)","v":0.255},0,0,0,0,0,0,0,null,"",0,null,"",0,null,"",null,null,null,0]
[null,730,null,null,null,null,null,1,{"$f":"IF(Etusivu!$C$22=\"kyllä\",25.5%,0%)","v":0.255},0,0,0,0,0,0,0,null,"",0,null,"",0,null,"",null,null,null,0]
[null,731,null,null,null,null,null,1,{"$f":"IF(Etusivu!$C$22=\"kyllä\",25.5%,0%)","v":0.255},0,0,0,0,0,0,0,null,"",0,null,"",0,null,"",null,null,null,0]
[null,732,null,null,null,null,null,1,{"$f":"IF(Etusivu!$C$22=\"kyllä\",25.5%,0%)","v":0.255},0,0,0,0,0,0,0,null,"",0,null,"",0,null,"",null,null,null,0]
[null,733,null,null,null,null,null,1,{"$f":"IF(Etusivu!$C$22=\"kyllä\",25.5%,0%)","v":0.255},0,0,0,0,0,0,0,null,"",0,null,"",0,null,"",null,null,null,0]
[null,734,null,null,null,null,null,1,{"$f":"IF(Etusivu!$C$22=\"kyllä\",25.5%,0%)","v":0.255},0,0,0,0,0,0,0,null,"",0,null,"",0,null,"",null,null,null,0]
[null,735,null,null,null,null,null,1,{"$f":"IF(Etusivu!$C$22=\"kyllä\",25.5%,0%)","v":0.255},0,0,0,0,0,0,0,null,"",0,null,"",0,null,"",null,null,null,0]
[null,736,null,null,null,null,null,1,{"$f":"IF(Etusivu!$C$22=\"kyllä\",25.5%,0%)","v":0.255},0,0,0,0,0,0,0,null,"",0,null,"",0,null,"",null,null,null,0]
[null,737,null,null,null,null,null,1,{"$f":"IF(Etusivu!$C$22=\"kyllä\",25.5%,0%)","v":0.255},0,0,0,0,0,0,0,null,"",0,null,"",0,null,"",null,null,null,0]
[null,738,null,null,null,null,null,1,{"$f":"IF(Etusivu!$C$22=\"kyllä\",25.5%,0%)","v":0.255},0,0,0,0,0,0,0,null,"",0,null,"",0,null,"",null,null,null,0]
[null,739,null,null,null,null,null,1,{"$f":"IF(Etusivu!$C$22=\"kyllä\",25.5%,0%)","v":0.255},0,0,0,0,0,0,0,null,"",0,null,"",0,null,"",null,null,null,0]
[null,740,null,null,null,null,null,1,{"$f":"IF(Etusivu!$C$22=\"kyllä\",25.5%,0%)","v":0.255},0,0,0,0,0,0,0,null,"",0,null,"",0,null,"",null,null,null,0]
[null,741,null,null,null,null,null,1,{"$f":"IF(Etusivu!$C$22=\"kyllä\",25.5%,0%)","v":0.255},0,0,0,0,0,0,0,null,"",0,null,"",0,null,"",null,null,null,0]
[null,742,null,null,null,null,null,1,{"$f":"IF(Etusivu!$C$22=\"kyllä\",25.5%,0%)","v":0.255},0,0,0,0,0,0,0,null,"",0,null,"",0,null,"",null,null,null,0]
[null,743,null,null,null,null,null,1,{"$f":"IF(Etusivu!$C$22=\"kyllä\",25.5%,0%)","v":0.255},0,0,0,0,0,0,0,null,"",0,null,"",0,null,"",null,null,null,0]
[null,744,null,null,null,null,null,1,{"$f":"IF(Etusivu!$C$22=\"kyllä\",25.5%,0%)","v":0.255},0,0,0,0,0,0,0,null,"",0,null,"",0,null,"",null,null,null,0]
[null,745,null,null,null,null,null,1,{"$f":"IF(Etusivu!$C$22=\"kyllä\",25.5%,0%)","v":0.255},0,0,0,0,0,0,0,null,"",0,null,"",0,null,"",null,null,null,0]
[null,746,null,null,null,null,null,1,{"$f":"IF(Etusivu!$C$22=\"kyllä\",25.5%,0%)","v":0.255},0,0,0,0,0,0,0,null,"",0,null,"",0,null,"",null,null,null,0]
[null,747,null,null,null,null,null,1,{"$f":"IF(Etusivu!$C$22=\"kyllä\",25.5%,0%)","v":0.255},0,0,0,0,0,0,0,null,"",0,null,"",0,null,"",null,null,null,0]
[null,748,null,null,null,null,null,1,{"$f":"IF(Etusivu!$C$22=\"kyllä\",25.5%,0%)","v":0.255},0,0,0,0,0,0,0,null,"",0,null,"",0,null,"",null,null,null,0]
[null,749,null,null,null,null,null,1,{"$f":"IF(Etusivu!$C$22=\"kyllä\",25.5%,0%)","v":0.255},0,0,0,0,0,0,0,null,"",0,null,"",0,null,"",null,null,null,0]
[null,750,null,null,null,null,null,1,{"$f":"IF(Etusivu!$C$22=\"kyllä\",25.5%,0%)","v":0.255},0,0,0,0,0,0,0,null,"",0,null,"",0,null,"",null,null,null,0]
[null,751,null,null,null,null,null,1,{"$f":"IF(Etusivu!$C$22=\"kyllä\",25.5%,0%)","v":0.255},0,0,0,0,0,0,0,null,"",0,null,"",0,null,"",null,null,null,0]
[null,752,null,null,null,null,null,1,{"$f":"IF(Etusivu!$C$22=\"kyllä\",25.5%,0%)","v":0.255},0,0,0,0,0,0,0,null,"",0,null,"",0,null,"",null,null,null,0]
[null,753,null,null,null,null,null,1,{"$f":"IF(Etusivu!$C$22=\"kyllä\",25.5%,0%)","v":0.255},0,0,0,0,0,0,0,null,"",0,null,"",0,null,"",null,null,null,0]
[null,754,null,null,null,null,null,1,{"$f":"IF(Etusivu!$C$22=\"kyllä\",25.5%,0%)","v":0.255},0,0,0,0,0,0,0,null,"",0,null,"",0,null,"",null,null,null,0]
[null,755,null,null,null,null,null,1,{"$f":"IF(Etusivu!$C$22=\"kyllä\",25.5%,0%)","v":0.255},0,0,0,0,0,0,0,null,"",0,null,"",0,null,"",null,null,null,0]
[null,756,null,null,null,null,null,1,{"$f":"IF(Etusivu!$C$22=\"kyllä\",25.5%,0%)","v":0.255},0,0,0,0,0,0,0,null,"",0,null,"",0,null,"",null,null,null,0]
[null,757,null,null,null,null,null,1,{"$f":"IF(Etusivu!$C$22=\"kyllä\",25.5%,0%)","v":0.255},0,0,0,0,0,0,0,null,"",0,null,"",0,null,"",null,null,null,0]
[null,758,null,null,null,null,null,1,{"$f":"IF(Etusivu!$C$22=\"kyllä\",25.5%,0%)","v":0.255},0,0,0,0,0,0,0,null,"",0,null,"",0,null,"",null,null,null,0]
[null,759,null,null,null,null,null,1,{"$f":"IF(Etusivu!$C$22=\"kyllä\",25.5%,0%)","v":0.255},0,0,0,0,0,0,0,null,"",0,null,"",0,null,"",null,null,null,0]
[null,760,null,null,null,null,null,1,{"$f":"IF(Etusivu!$C$22=\"kyllä\",25.5%,0%)","v":0.255},0,0,0,0,0,0,0,null,"",0,null,"",0,null,"",null,null,null,0]
[null,761,null,null,null,null,null,1,{"$f":"IF(Etusivu!$C$22=\"kyllä\",25.5%,0%)","v":0.255},0,0,0,0,0,0,0,null,"",0,null,"",0,null,"",null,null,null,0]
[null,762,null,null,null,null,null,1,{"$f":"IF(Etusivu!$C$22=\"kyllä\",25.5%,0%)","v":0.255},0,0,0,0,0,0,0,null,"",0,null,"",0,null,"",null,null,null,0]
[null,763,null,null,null,null,null,1,{"$f":"IF(Etusivu!$C$22=\"kyllä\",25.5%,0%)","v":0.255},0,0,0,0,0,0,0,null,"",0,null,"",0,null,"",null,null,null,0]
[null,764,null,null,null,null,null,1,{"$f":"IF(Etusivu!$C$22=\"kyllä\",25.5%,0%)","v":0.255},0,0,0,0,0,0,0,null,"",0,null,"",0,null,"",null,null,null,0]
[null,765,null,null,null,null,null,1,{"$f":"IF(Etusivu!$C$22=\"kyllä\",25.5%,0%)","v":0.255},0,0,0,0,0,0,0,null,"",0,null,"",0,null,"",null,null,null,0]
[null,766,null,null,null,null,null,1,{"$f":"IF(Etusivu!$C$22=\"kyllä\",25.5%,0%)","v":0.255},0,0,0,0,0,0,0,null,"",0,null,"",0,null,"",null,null,null,0]
[null,767,null,null,null,null,null,1,{"$f":"IF(Etusivu!$C$22=\"kyllä\",25.5%,0%)","v":0.255},0,0,0,0,0,0,0,null,"",0,null,"",0,null,"",null,null,null,0]
[null,768,null,null,null,null,null,1,{"$f":"IF(Etusivu!$C$22=\"kyllä\",25.5%,0%)","v":0.255},0,0,0,0,0,0,0,null,"",0,null,"",0,null,"",null,null,null,0]
[null,769,null,null,null,null,null,1,{"$f":"IF(Etusivu!$C$22=\"kyllä\",25.5%,0%)","v":0.255},0,0,{"$f":"IF($F582=L$12,$K582,0)","v":0},0,0,0,0,null,"",0,null,"",0,null,"",null,null,null,0]
[null,770,null,null,null,null,null,1,{"$f":"IF(Etusivu!$C$22=\"kyllä\",25.5%,0%)","v":0.255},0,0,0,0,0,0,0,null,"",0,null,"",0,null,"",null,null,null,0]
[null,771,null,null,null,null,null,1,{"$f":"IF(Etusivu!$C$22=\"kyllä\",25.5%,0%)","v":0.255},0,0,0,0,0,0,0,null,"",0,null,"",0,null,"",null,null,null,0]
[null,772,null,null,null,null,null,1,{"$f":"IF(Etusivu!$C$22=\"kyllä\",25.5%,0%)","v":0.255},0,0,0,0,0,0,0,null,"",0,null,"",0,null,"",null,null,null,0]
[null,773,null,null,null,null,null,1,{"$f":"IF(Etusivu!$C$22=\"kyllä\",25.5%,0%)","v":0.255},0,0,0,0,0,0,0,null,"",0,null,"",0,null,"",null,null,null,0]
[null,774,null,null,null,null,null,1,{"$f":"IF(Etusivu!$C$22=\"kyllä\",25.5%,0%)","v":0.255},0,0,0,0,0,0,0,null,"",0,null,"",0,null,"",null,null,null,0]
[null,775,null,null,null,null,null,1,{"$f":"IF(Etusivu!$C$22=\"kyllä\",25.5%,0%)","v":0.255},0,0,0,0,0,0,0,null,"",0,null,"",0,null,"",null,null,null,0]
[null,776,null,null,null,null,null,1,{"$f":"IF(Etusivu!$C$22=\"kyllä\",25.5%,0%)","v":0.255},0,0,0,0,0,0,0,null,"",0,null,"",0,null,"",null,null,null,0]
[null,777,null,null,null,null,null,1,{"$f":"IF(Etusivu!$C$22=\"kyllä\",25.5%,0%)","v":0.255},0,0,0,0,0,0,0,null,"",0,null,"",0,null,"",null,null,null,{"$f":"IF($F590=AB$12,$K590,0)","v":0}]
[null,778,null,null,null,null,null,1,{"$f":"IF(Etusivu!$C$22=\"kyllä\",25.5%,0%)","v":0.255},0,0,0,0,0,0,0,null,"",{"$f":"IF($F591=S$12,$K591,0)","v":0},null,"",{"$f":"IF($F591=V$12,$K591,0)","v":0},null,"",null,null,null,0]
[null,779,null,null,null,null,null,1,{"$f":"IF(Etusivu!$C$22=\"kyllä\",25.5%,0%)","v":0.255},0,0,0,0,0,0,0,null,{"$f":"IF(P592>0,IF(Q592<1,\" !\",\"\"),\"\")","v":""},0,null,{"$f":"IF(S592>0,IF(T592<1,\" !\",\"\"),\"\")","v":""},0,null,{"$f":"IF(V592>0,IF(W592<1,\" !\",\"\"),\"\")","v":""},null,null,null,0]
[null,780,null,null,null,null,null,1,{"$f":"IF(Etusivu!$C$22=\"kyllä\",25.5%,0%)","v":0.255},{"$f":"H593*((G593-(AD593+AE593+AF593)*(1+I593))-((G593-(AD593+AE593+AF593)*(1+I593))/(1+I593)))","v":0},{"$f":"H593*(G593/(1+I593))","v":0},0,0,0,0,0,null,"",0,null,"",0,null,"",null,null,null,0]
[null,781,null,null,null,null,null,1,{"$f":"IF(Etusivu!$C$22=\"kyllä\",25.5%,0%)","v":0.255},0,0,0,0,0,0,0,null,"",0,null,"",0,null,"",null,null,null,0]
[null,782,null,null,null,null,null,1,{"$f":"IF(Etusivu!$C$22=\"kyllä\",25.5%,0%)","v":0.255},0,0,0,0,0,0,0,null,"",0,null,"",0,null,"",null,null,null,0]
[null,783,null,null,null,null,null,1,{"$f":"IF(Etusivu!$C$22=\"kyllä\",25.5%,0%)","v":0.255},0,0,0,0,0,0,0,null,"",0,null,"",0,null,"",null,null,null,0]
[null,784,null,null,null,null,null,1,{"$f":"IF(Etusivu!$C$22=\"kyllä\",25.5%,0%)","v":0.255},0,0,0,0,0,0,0,null,"",0,null,"",0,null,"",null,null,null,0]
[null,785,null,null,null,null,null,1,{"$f":"IF(Etusivu!$C$22=\"kyllä\",25.5%,0%)","v":0.255},0,0,0,0,0,0,0,null,"",0,null,"",0,null,"",null,null,null,0]
[null,786,null,null,null,null,null,1,{"$f":"IF(Etusivu!$C$22=\"kyllä\",25.5%,0%)","v":0.255},0,0,0,0,0,0,0,null,"",0,null,"",0,null,"",null,null,null,0]
[null,787,null,null,null,null,null,1,{"$f":"IF(Etusivu!$C$22=\"kyllä\",25.5%,0%)","v":0.255},0,0,0,0,0,0,0,null,"",0,null,"",0,null,"",null,null,null,0]
[null,788,null,null,null,null,null,1,{"$f":"IF(Etusivu!$C$22=\"kyllä\",25.5%,0%)","v":0.255},0,0,0,0,0,0,0,null,"",0,null,"",0,null,"",null,null,null,0]
[null,789,null,null,null,null,null,1,{"$f":"IF(Etusivu!$C$22=\"kyllä\",25.5%,0%)","v":0.255},0,0,0,0,0,0,0,null,"",0,null,"",0,null,"",null,null,null,0]
[null,790,null,null,null,null,null,1,{"$f":"IF(Etusivu!$C$22=\"kyllä\",25.5%,0%)","v":0.255},0,0,0,0,0,0,0,null,"",0,null,"",0,null,"",null,null,null,0]
[null,791,null,null,null,null,null,1,{"$f":"IF(Etusivu!$C$22=\"kyllä\",25.5%,0%)","v":0.255},0,0,0,0,0,0,0,null,"",0,null,"",0,null,"",null,null,null,0]
[null,792,null,null,null,null,null,1,{"$f":"IF(Etusivu!$C$22=\"kyllä\",25.5%,0%)","v":0.255},0,0,0,0,0,0,0,null,"",0,null,"",0,null,"",null,null,null,0]
[null,793,null,null,null,null,null,1,{"$f":"IF(Etusivu!$C$22=\"kyllä\",25.5%,0%)","v":0.255},0,0,0,0,0,0,0,null,"",0,null,"",0,null,"",null,null,null,0]
[null,794,null,null,null,null,null,1,{"$f":"IF(Etusivu!$C$22=\"kyllä\",25.5%,0%)","v":0.255},0,0,0,0,0,0,0,null,"",0,null,"",0,null,"",null,null,null,0]
[null,795,null,null,null,null,null,1,{"$f":"IF(Etusivu!$C$22=\"kyllä\",25.5%,0%)","v":0.255},0,0,0,0,0,0,0,null,"",0,null,"",0,null,"",null,null,null,0]
[null,796,null,null,null,null,null,1,{"$f":"IF(Etusivu!$C$22=\"kyllä\",25.5%,0%)","v":0.255},0,0,0,0,0,0,0,null,"",0,null,"",0,null,"",null,null,null,0]
[null,797,null,null,null,null,null,1,{"$f":"IF(Etusivu!$C$22=\"kyllä\",25.5%,0%)","v":0.255},0,0,0,0,0,0,0,null,"",0,null,"",0,null,"",null,null,null,0]
[null,798,null,null,null,null,null,1,{"$f":"IF(Etusivu!$C$22=\"kyllä\",25.5%,0%)","v":0.255},0,0,0,0,0,0,0,null,"",0,null,"",0,null,"",null,null,null,0]
[null,799,null,null,null,null,null,1,{"$f":"IF(Etusivu!$C$22=\"kyllä\",25.5%,0%)","v":0.255},0,0,0,0,0,0,0,null,"",0,null,"",0,null,"",null,null,null,0]
[null,800,null,null,null,null,null,1,{"$f":"IF(Etusivu!$C$22=\"kyllä\",25.5%,0%)","v":0.255},0,0,0,0,0,0,0,null,"",0,null,"",0,null,"",null,null,null,0]
[null,801,null,null,null,null,null,1,{"$f":"IF(Etusivu!$C$22=\"kyllä\",25.5%,0%)","v":0.255},0,0,0,0,0,0,0,null,"",0,null,"",0,null,"",null,null,null,0]
[null,802,null,null,null,null,null,1,{"$f":"IF(Etusivu!$C$22=\"kyllä\",25.5%,0%)","v":0.255},0,0,0,0,0,0,0,null,"",0,null,"",0,null,"",null,null,null,0]
[null,803,null,null,null,null,null,1,{"$f":"IF(Etusivu!$C$22=\"kyllä\",25.5%,0%)","v":0.255},0,0,0,0,0,0,0,null,"",0,null,"",0,null,"",null,null,null,0]
[null,804,null,null,null,null,null,1,{"$f":"IF(Etusivu!$C$22=\"kyllä\",25.5%,0%)","v":0.255},0,0,0,0,0,0,0,null,"",0,null,"",0,null,"",null,null,null,0]
[null,805,null,null,null,null,null,1,{"$f":"IF(Etusivu!$C$22=\"kyllä\",25.5%,0%)","v":0.255},0,0,0,0,0,0,0,null,"",0,null,"",0,null,"",null,null,null,0]
[null,806,null,null,null,null,null,1,{"$f":"IF(Etusivu!$C$22=\"kyllä\",25.5%,0%)","v":0.255},0,0,0,0,0,0,0,null,"",0,null,"",0,null,"",null,null,null,0]
[null,807,null,null,null,null,null,1,{"$f":"IF(Etusivu!$C$22=\"kyllä\",25.5%,0%)","v":0.255},0,0,0,0,0,0,0,null,"",0,null,"",0,null,"",null,null,null,0]
[null,808,null,null,null,null,null,1,{"$f":"IF(Etusivu!$C$22=\"kyllä\",25.5%,0%)","v":0.255},0,0,0,0,0,0,0,null,"",0,null,"",0,null,"",null,null,null,0]
[null,809,null,null,null,null,null,1,{"$f":"IF(Etusivu!$C$22=\"kyllä\",25.5%,0%)","v":0.255},0,0,0,0,0,0,0,null,"",0,null,"",0,null,"",null,null,null,0]
[null,810,null,null,null,null,null,1,{"$f":"IF(Etusivu!$C$22=\"kyllä\",25.5%,0%)","v":0.255},0,0,0,0,0,0,0,null,"",0,null,"",0,null,"",null,null,null,0]
[null,811,null,null,null,null,null,1,{"$f":"IF(Etusivu!$C$22=\"kyllä\",25.5%,0%)","v":0.255},0,0,0,0,0,0,0,null,"",0,null,"",0,null,"",null,null,null,0]
[null,812,null,null,null,null,null,1,{"$f":"IF(Etusivu!$C$22=\"kyllä\",25.5%,0%)","v":0.255},0,0,0,0,0,0,0,null,"",0,null,"",0,null,"",null,null,null,0]
[null,813,null,null,null,null,null,1,{"$f":"IF(Etusivu!$C$22=\"kyllä\",25.5%,0%)","v":0.255},0,0,0,0,0,0,0,null,"",0,null,"",0,null,"",null,null,null,0]
[null,814,null,null,null,null,null,1,{"$f":"IF(Etusivu!$C$22=\"kyllä\",25.5%,0%)","v":0.255},0,0,0,0,0,0,0,null,"",0,null,"",0,null,"",null,null,null,0]
[null,815,null,null,null,null,null,1,{"$f":"IF(Etusivu!$C$22=\"kyllä\",25.5%,0%)","v":0.255},0,0,0,0,0,0,0,null,"",0,null,"",0,null,"",null,null,null,0]
[null,816,null,null,null,null,null,1,{"$f":"IF(Etusivu!$C$22=\"kyllä\",25.5%,0%)","v":0.255},0,0,0,0,0,0,0,null,"",0,null,"",0,null,"",null,null,null,0]
[null,817,null,null,null,null,null,1,{"$f":"IF(Etusivu!$C$22=\"kyllä\",25.5%,0%)","v":0.255},0,0,0,0,0,0,0,null,"",0,null,"",0,null,"",null,null,null,0]
[null,818,null,null,null,null,null,1,{"$f":"IF(Etusivu!$C$22=\"kyllä\",25.5%,0%)","v":0.255},0,0,0,0,0,0,0,null,"",0,null,"",0,null,"",null,null,null,0]
[null,819,null,null,null,null,null,1,{"$f":"IF(Etusivu!$C$22=\"kyllä\",25.5%,0%)","v":0.255},0,0,0,0,0,0,0,null,"",0,null,"",0,null,"",null,null,null,0]
[null,820,null,null,null,null,null,1,{"$f":"IF(Etusivu!$C$22=\"kyllä\",25.5%,0%)","v":0.255},0,0,{"$f":"IF($F633=L$12,$K633,0)","v":0},0,0,0,0,null,"",0,null,"",0,null,"",null,null,null,0]
[null,821,null,null,null,null,null,1,{"$f":"IF(Etusivu!$C$22=\"kyllä\",25.5%,0%)","v":0.255},0,0,0,0,0,0,0,null,"",0,null,"",0,null,"",null,null,null,0]

{"sheet":"Poistot","index":7,"n_rows":99,"n_cols":24,"rows_kept":99,"cut":false,"hidden":false,"merged":[[5,2,6,2],[12,17,22,17],[5,7,5,9],[5,17,6,18],[5,3,6,3],[4,13,5,15]]}
[null,null,null,null,null,null,null,null,null,null,null,null,null,null,null,null,null,null,null,"Maksimi"]
[null,{"$f":"Etusivu!C10","v":"Matti Metsänen"},null,null,null,null,null,null,null,null,null,null,null,null,null,null,null,null,null,"Prosentteina"]
[null,{"$f":"Etusivu!C16","v":"123456-7"},null,null,null,null,null,null,null,null,null,null,null,null,null,null,null,null,null,"Euroina"]
[]
[null,"POISTOJEN LASKENTA",null,null,null,null,null,null,null,null,null,null,null,"11.  Muistiinpanoihin (Poistoihin) sisältyvät \nmuun toiminnan menot (alv 0%)"]
[null,null,null,"Valitse poisto- tapa","Menojäännös","Lisäykset","Vähennykset","Haluttu poisto ",null,null,"Poisto","Menojäännös",null,null,null,null,null,"OHJEITA"]
[null,null,null,null,{"$f":"CONCATENATE(\"1.1.\",Etusivu!C8)","v":"1.1.2025"},"verovuonna","verovuonna","%","Euroina",null,"€",{"$f":"CONCATENATE(\"31.12.\",Etusivu!C8)","v":"31.12.2025"},null,"11.1 Maatalous","11.2 Elinkeinotoiminta","11.3 Yksityismenot"," "]
[null," nro","Koneet ja laitteet, yhteensä",null,{"$f":"SUM(E9:E68)","v":750},{"$f":"SUM(F9:F68)","v":717.13},{"$f":"SUM(G9:G68)","v":0},null,null,null,{"$f":"SUM(K9:K68)","v":287.5},{"$f":"SUM(L9:L68)","v":1179.6300000000001},null,{"$f":"SUM(N9:N68)","v":0},{"$f":"SUM(O9:O68)","v":0},{"$f":"SUM(P9:P68)","v":0},null,"o Kirjaa uudet poistoviennit menot välilehden kautta (Menoluokat: Konepoisto, rakennuspoisto ja oja/tiepoisto)",null,null,"%","Euro",600,"maksimi"]
[null,1,"Raivaussaha 2024","Maksimi",750,{"$f":"SUMIF(Menot!Q$13:Q$634,B9,Menot!P$13:P$634)","v":0},null,0.25,null,{"$f":"IF(I9>X9,\"!\",IF(H9>0.25,\"!\",\"\"))","v":""},{"$f":"IF(D9=T$1,X9,IF(D9=T$2,U9,V9))","v":187.5},{"$f":"E9+F9-G9-K9","v":562.5},null,null,null,null,null,"o Kirjaa poistojen menojäännökset edellisen vuoden kirjanpidosta sarakkeelle \"Menojäännös 1.1.202x\". ",null,null,{"$f":"(E9+F9-G9)*H9","v":187.5},{"$f":"IF(I9<=X9,I9,X9)","v":0},{"$f":"IF(E9+F9-G9<600.01,E9+F9-G9,0)","v":0},{"$f":"IF(U9>W9,U9,W9)","v":187.5}]
[null,2,"Moottorisaha 2025","Euroina",null,{"$f":"SUMIF(Menot!Q$13:Q$634,B10,Menot!P$13:P$634)","v":717.13},null,0.25,100,{"$f":"IF(I10>X10,\"!\",IF(H10>0.25,\"!\",\"\"))","v":""},{"$f":"IF(D10=T$1,X10,IF(D10=T$2,U10,V10))","v":100},{"$f":"E10+F10-G10-K10","v":617.13},null,null,null,null,null,"o Verovuoden lisäys kirjataan Menot-taulukon kautta, jotta alv saadaan eroteltua. ",null,null,179.2825,{"$f":"I10","v":100},0,{"$f":"IF(U10>W10,U10,W10)","v":179.2825}]
[null,3,null,"Maksimi",null,{"$f":"SUMIF(Menot!Q$13:Q$634,B11,Menot!P$13:P$634)","v":0},null,0.25,null,{"$f":"IF(I11>X11,\"!\",IF(H11>0.25,\"!\",\"\"))","v":""},{"$f":"IF(D11=T$1,X11,IF(D11=T$2,U11,V11))","v":0},{"$f":"E11+F11-G11-K11","v":0},null,null,null,null,null,"o Kullekin koneelle (tai muulle poistomenolle) annetaan yksillöllinen nro tämän taulukon sarakkeelta B, jota kytetään menot taulussa, poistomenoa kirjatessa.",null,null,0,0,0,0]
[null,4,null,"Maksimi",null,{"$f":"SUMIF(Menot!Q$13:Q$634,B12,Menot!P$13:P$634)","v":0},null,0.25,null,"",{"$f":"IF(D12=T$1,X12,IF(D12=T$2,U12,V12))","v":0},{"$f":"E12+F12-G12-K12","v":0},null,null,null,null,null,"o Yhtä konetta, rakennusta tai tietä käsitellään yhdellä rivillä poistot taulussa.",null,null,0,0,0,0]
[null,5,null,"Maksimi",null,{"$f":"SUMIF(Menot!Q$13:Q$634,B13,Menot!P$13:P$634)","v":0},null,0.25,null,{"$f":"IF(I13>X13,\"!\",IF(H13>0.25,\"!\",\"\"))","v":""},0,0,null,null,null,null,null,"o Poistojen alv, jos poistomenoihin sisältyy muun toiminnan menoja\n   Verottajan ohjeen mukaan:\n    jos poistoina käsiteltäviin menoihin sisältyy muun toiminnan menoja, \n   esim. yksityismenoja, tulee vähennettävästä arvonlisäverosta ottaa\n   kerralla pois se osuus, joka arvioidaan olevan muun toiminnan osuutta.\n\n   Esimerkki:\n   Mönkijästä arvellaan metsätaloudelle kuuluvan 45 % koko mönkijän\n   käyttöajalle. Alv:stä vähennyskelpoista on tuo 45 %.\n   Mönkijän menoa poistetaan vuosittain poistomenettelyssä. Yksityiskäytön \n   osuudeksi merkitään vuosittain toteutunut todellisen käytön osuus. ",null,null,0,0,0,0]
[null,6,null,"Maksimi",null,{"$f":"SUMIF(Menot!Q$13:Q$634,B14,Menot!P$13:P$634)","v":0},null,0.25,null,"",0,0,null,null,null,null,null,null,null,null,0,0,0,0]
[null,7,null,"Maksimi",null,{"$f":"SUMIF(Menot!Q$13:Q$634,B15,Menot!P$13:P$634)","v":0},null,0.25,null,"",0,0,null,null,null,null,null,null,null,null,0,0,0,0]
[null,8,null,"Maksimi",null,{"$f":"SUMIF(Menot!Q$13:Q$634,B16,Menot!P$13:P$634)","v":0},null,0.25,null,"",0,0,null,null,null,null,null,null,null,null,0,0,0,0]
[null,9,null,"Maksimi",null,{"$f":"SUMIF(Menot!Q$13:Q$634,B17,Menot!P$13:P$634)","v":0},null,0.25,null,"",0,0,null,null,null,null,null,null,null,null,0,0,0,0]
[null,10,null,"Maksimi",null,{"$f":"SUMIF(Menot!Q$13:Q$634,B18,Menot!P$13:P$634)","v":0},null,0.25,null,"",0,0,null,null,null,null,null,null,null,null,0,0,0,0]
[null,11,null,"Maksimi",null,{"$f":"SUMIF(Menot!Q$13:Q$634,B19,Menot!P$13:P$634)","v":0},null,0.25,null,"",0,0,null,null,null,null,null,null,null,null,0,0,0,0]
[null,12,null,"Maksimi",null,{"$f":"SUMIF(Menot!Q$13:Q$634,B20,Menot!P$13:P$634)","v":0},null,0.25,null,"",0,0,null,null,null,null,null,null,null,null,0,0,0,0]
[null,13,null,"Maksimi",null,{"$f":"SUMIF(Menot!Q$13:Q$634,B21,Menot!P$13:P$634)","v":0},null,0.25,null,"",0,0,null,null,null,null,null,null,null,null,0,0,0,0]
[null,14,null,"Maksimi",null,{"$f":"SUMIF(Menot!Q$13:Q$634,B22,Menot!P$13:P$634)","v":0},null,0.25,null,"",0,0,null,null,null,null,null,null,null,null,0,0,0,0]
[null,15,null,"Maksimi",null,{"$f":"SUMIF(Menot!Q$13:Q$634,B23,Menot!P$13:P$634)","v":0},null,0.25,null,"",0,0,null,null,null,null,null,null,null,null,0,0,0,0]
[null,16,null,"Maksimi",null,{"$f":"SUMIF(Menot!Q$13:Q$634,B24,Menot!P$13:P$634)","v":0},null,0.25,null,"",0,0,null,null,null,null,null,null,null,null,0,0,0,0]
[null,17,null,"Maksimi",null,{"$f":"SUMIF(Menot!Q$13:Q$634,B25,Menot!P$13:P$634)","v":0},null,0.25,null,"",0,0,null,null,null,null,null,null,null,null,0,0,0,0]
[null,18,null,"Maksimi",null,{"$f":"SUMIF(Menot!Q$13:Q$634,B26,Menot!P$13:P$634)","v":0},null,0.25,null,"",0,0,null,null,null,null,null,null,null,null,0,0,0,0]
[null,19,null,"Maksimi",null,{"$f":"SUMIF(Menot!Q$13:Q$634,B27,Menot!P$13:P$634)","v":0},null,0.25,null,"",0,0,null,null,null,null,null,null,null,null,0,0,0,0]
[null,20,null,"Maksimi",null,{"$f":"SUMIF(Menot!Q$13:Q$634,B28,Menot!P$13:P$634)","v":0},null,0.25,null,"",0,0,null,null,null,null,null,null,null,null,0,0,0,0]
[null,21,null,"Maksimi",null,{"$f":"SUMIF(Menot!Q$13:Q$634,B29,Menot!P$13:P$634)","v":0},null,0.25,null,"",{"$f":"IF(D29=T$1,X29,IF(D29=T$2,U29,V29))","v":0},{"$f":"E29+F29-G29-K29","v":0},null,null,null,null,null,null,null,null,0,0,0,0]
[null,22,null,"Maksimi",null,{"$f":"SUMIF(Menot!Q$13:Q$634,B30,Menot!P$13:P$634)","v":0},null,0.25,null,"",0,0,null,null,null,null,null,null,null,null,0,0,0,0]
[null,23,null,"Maksimi",null,{"$f":"SUMIF(Menot!Q$13:Q$634,B31,Menot!P$13:P$634)","v":0},null,0.25,null,"",0,0,null,null,null,null,null,null,null,null,0,0,0,0]
[null,24,null,"Maksimi",null,{"$f":"SUMIF(Menot!Q$13:Q$634,B32,Menot!P$13:P$634)","v":0},null,0.25,null,"",0,0,null,null,null,null,null,null,null,null,0,0,0,0]
[null,25,null,"Maksimi",null,{"$f":"SUMIF(Menot!Q$13:Q$634,B33,Menot!P$13:P$634)","v":0},null,0.25,null,"",0,0,null,null,null,null,null,null,null,null,0,0,0,0]
[null,26,null,"Maksimi",null,{"$f":"SUMIF(Menot!Q$13:Q$634,B34,Menot!P$13:P$634)","v":0},null,0.25,null,"",0,0,null,null,null,null,null,null,null,null,0,0,0,0]
[null,27,null,"Maksimi",null,{"$f":"SUMIF(Menot!Q$13:Q$634,B35,Menot!P$13:P$634)","v":0},null,0.25,null,"",0,0,null,null,null,null,null,null,null,null,0,0,0,0]
[null,28,null,"Maksimi",null,{"$f":"SUMIF(Menot!Q$13:Q$634,B36,Menot!P$13:P$634)","v":0},null,0.25,null,"",0,0,null,null,null,null,null,null,null,null,0,0,0,0]
[null,29,null,"Maksimi",null,{"$f":"SUMIF(Menot!Q$13:Q$634,B37,Menot!P$13:P$634)","v":0},null,0.25,null,"",0,0,null,null,null,null,null,null,null,null,0,0,0,0]
[null,30,null,"Maksimi",null,{"$f":"SUMIF(Menot!Q$13:Q$634,B38,Menot!P$13:P$634)","v":0},null,0.25,null,"",0,0,null,null,null,null,null,null,null,null,0,0,0,0]
[null,31,null,"Maksimi",null,{"$f":"SUMIF(Menot!Q$13:Q$634,B39,Menot!P$13:P$634)","v":0},null,0.25,null,"",0,0,null,null,null,null,null,null,null,null,0,0,0,0]
[null,32,null,"Maksimi",null,{"$f":"SUMIF(Menot!Q$13:Q$634,B40,Menot!P$13:P$634)","v":0},null,0.25,null,"",0,0,null,null,null,null,null,null,null,null,0,0,0,0]
[null,33,null,"Maksimi",null,{"$f":"SUMIF(Menot!Q$13:Q$634,B41,Menot!P$13:P$634)","v":0},null,0.25,null,"",{"$f":"IF(D41=T$1,X41,IF(D41=T$2,U41,V41))","v":0},{"$f":"E41+F41-G41-K41","v":0},null,null,null,null,null,null,null,null,{"$f":"(E41+F41-G41)*H41","v":0},0,{"$f":"IF(E41+F41-G41<600.01,E41+F41-G41,0)","v":0},0]
[null,34,null,"Maksimi",null,{"$f":"SUMIF(Menot!Q$13:Q$634,B42,Menot!P$13:P$634)","v":0},null,0.25,null,"",0,0,null,null,null,null,null,null,null,null,0,{"$f":"I42","v":0},0,0]
[null,35,null,"Maksimi",null,{"$f":"SUMIF(Menot!Q$13:Q$634,B43,Menot!P$13:P$634)","v":0},null,0.25,null,"",0,0,null,null,null,null,null,null,null,null,0,0,0,0]
[null,36,null,"Maksimi",null,{"$f":"SUMIF(Menot!Q$13:Q$634,B44,Menot!P$13:P$634)","v":0},null,0.25,null,"",0,0,null,null,null,null,null,null,null,null,0,0,0,0]
[null,37,null,"Maksimi",null,{"$f":"SUMIF(Menot!Q$13:Q$634,B45,Menot!P$13:P$634)","v":0},null,0.25,null,"",0,0,null,null,null,null,null,null,null,null,0,0,0,0]
[null,38,null,"Maksimi",null,{"$f":"SUMIF(Menot!Q$13:Q$634,B46,Menot!P$13:P$634)","v":0},null,0.25,null,"",0,0,null,null,null,null,null,null,null,null,0,0,0,0]
[null,39,null,"Maksimi",null,{"$f":"SUMIF(Menot!Q$13:Q$634,B47,Menot!P$13:P$634)","v":0},null,0.25,null,"",0,0,null,null,null,null,null,null,null,null,0,0,0,0]
[null,40,null,"Maksimi",null,{"$f":"SUMIF(Menot!Q$13:Q$634,B48,Menot!P$13:P$634)","v":0},null,0.25,null,"",0,0,null,null,null,null,null,null,null,null,0,0,0,0]
[null,41,null,"Maksimi",null,{"$f":"SUMIF(Menot!Q$13:Q$634,B49,Menot!P$13:P$634)","v":0},null,0.25,null,"",0,0,null,null,null,null,null,null,null,null,0,0,0,0]
[null,42,null,"Maksimi",null,{"$f":"SUMIF(Menot!Q$13:Q$634,B50,Menot!P$13:P$634)","v":0},null,0.25,null,"",0,0,null,null,null,null,null,null,null,null,0,0,0,0]
[null,43,null,"Maksimi",null,{"$f":"SUMIF(Menot!Q$13:Q$634,B51,Menot!P$13:P$634)","v":0},null,0.25,null,"",0,0,null,null,null,null,null,null,null,null,0,0,0,0]
[null,44,null,"Maksimi",null,{"$f":"SUMIF(Menot!Q$13:Q$634,B52,Menot!P$13:P$634)","v":0},null,0.25,null,"",0,0,null,null,null,null,null,null,null,null,0,0,0,0]
[null,45,null,"Maksimi",null,{"$f":"SUMIF(Menot!Q$13:Q$634,B53,Menot!P$13:P$634)","v":0},null,0.25,null,"",0,0,null,null,null,null,null,null,null,null,0,0,0,0]
[null,46,null,"Maksimi",null,{"$f":"SUMIF(Menot!Q$13:Q$634,B54,Menot!P$13:P$634)","v":0},null,0.25,null,"",0,0,null,null,null,null,null,null,null,null,0,0,0,0]
[null,47,null,"Maksimi",null,{"$f":"SUMIF(Menot!Q$13:Q$634,B55,Menot!P$13:P$634)","v":0},null,0.25,null,"",0,0,null,null,null,null,null,null,null,null,0,0,0,0]
[null,48,null,"Maksimi",null,{"$f":"SUMIF(Menot!Q$13:Q$634,B56,Menot!P$13:P$634)","v":0},null,0.25,null,"",0,0,null,null,null,null,null,null,null,null,0,0,0,0]
[null,49,null,"Maksimi",null,{"$f":"SUMIF(Menot!Q$13:Q$634,B57,Menot!P$13:P$634)","v":0},null,0.25,null,"",0,0,null,null,null,null,null,null,null,null,0,0,0,0]
[null,50,null,"Maksimi",null,{"$f":"SUMIF(Menot!Q$13:Q$634,B58,Menot!P$13:P$634)","v":0},null,0.25,null,"",0,0,null,null,null,null,null,null,null,null,0,0,0,0]
[null,51,null,"Maksimi",null,{"$f":"SUMIF(Menot!Q$13:Q$634,B59,Menot!P$13:P$634)","v":0},null,0.25,null,"",0,0,null,null,null,null,null,null,null,null,0,0,0,0]
[null,52,null,"Maksimi",null,{"$f":"SUMIF(Menot!Q$13:Q$634,B60,Menot!P$13:P$634)","v":0},null,0.25,null,"",0,0,null,null,null,null,null,null,null,null,0,0,0,0]
[null,53,null,"Maksimi",null,{"$f":"SUMIF(Menot!Q$13:Q$634,B61,Menot!P$13:P$634)","v":0},null,0.25,null,"",0,0,null,null,null,null,null,null,null,null,0,0,0,0]
[null,54,null,"Maksimi",null,{"$f":"SUMIF(Menot!Q$13:Q$634,B62,Menot!P$13:P$634)","v":0},null,0.25,null,"",0,0,null,null,null,null,null,null,null,null,0,0,0,0]
[null,55,null,"Maksimi",null,{"$f":"SUMIF(Menot!Q$13:Q$634,B63,Menot!P$13:P$634)","v":0},null,0.25,null,"",0,0,null,null,null,null,null,null,null,null,0,0,0,0]
[null,56,null,"Maksimi",null,{"$f":"SUMIF(Menot!Q$13:Q$634,B64,Menot!P$13:P$634)","v":0},null,0.25,null,"",0,0,null,null,null,null,null,null,null,null,0,0,0,0]
[null,57,null,"Maksimi",null,{"$f":"SUMIF(Menot!Q$13:Q$634,B65,Menot!P$13:P$634)","v":0},null,0.25,null,"",0,0,null,null,null,null,null,null,null,null,0,0,0,0]
[null,58,null,"Maksimi",null,{"$f":"SUMIF(Menot!Q$13:Q$634,B66,Menot!P$13:P$634)","v":0},null,0.25,null,"",0,0,null,null,null,null,null,null,null,null,0,0,0,0]
[null,59,null,"Maksimi",null,{"$f":"SUMIF(Menot!Q$13:Q$634,B67,Menot!P$13:P$634)","v":0},null,0.25,null,"",0,0,null,null,null,null,null,null,null,null,0,0,0,0]
[null,60,null,"Maksimi",null,{"$f":"SUMIF(Menot!Q$13:Q$634,B68,Menot!P$13:P$634)","v":0},null,0.25,null,"",0,0,null,null,null,null,null,null,null,null,0,0,0,0]
[]
[null," nro","Rakennukset, yhteensä",null,{"$f":"SUM(E71:E75)","v":0},{"$f":"SUM(F71:F75)","v":0},{"$f":"SUM(G71:G75)","v":0},null,null,null,{"$f":"SUM(K71:K75)","v":0},{"$f":"E70+F70-G70-K70","v":0},null,{"$f":"SUM(N71:N75)","v":0},{"$f":"SUM(O71:O75)","v":0},{"$f":"SUM(P71:P75)","v":0},null,null,null,null,{"$f":"(E70+F70-G70)*H70","v":0},{"$f":"I70","v":0},{"$f":"IF(E70+F70-G70<600.01,E70+F70-G70,0)","v":0},0]
[null,1,null,"Maksimi",null,{"$f":"SUMIF(Menot!T$13:T$634,B71,Menot!S$13:S$634)","v":0},null,0.1,null,{"$f":"IF(I71>X71,\"!\",IF(H71>0.1,\"!\",\"\"))","v":""},{"$f":"IF(D71=T$1,X71,IF(D71=T$2,U71,V71))","v":0},0,null,null,null,null,null,null,null,null,0,0,0,0]
[null,2,null,"Maksimi",null,{"$f":"SUMIF(Menot!T$13:T$634,B72,Menot!S$13:S$634)","v":0},null,0.1,null,{"$f":"IF(I72>X72,\"!\",IF(H72>0.1,\"!\",\"\"))","v":""},{"$f":"IF(D72=T$1,X72,IF(D72=T$2,U72,V72))","v":0},0,null,null,null,null,null,null,null,null,0,0,0,0]
[null,3,null,"Maksimi",null,{"$f":"SUMIF(Menot!T$13:T$634,B73,Menot!S$13:S$634)","v":0},null,0.1,null,{"$f":"IF(I73>X73,\"!\",IF(H73>0.1,\"!\",\"\"))","v":""},{"$f":"IF(D73=T$1,X73,IF(D73=T$2,U73,V73))","v":0},0,null,null,null,null,null,null,null,null,0,0,0,0]
[null,4,null,"Maksimi",null,{"$f":"SUMIF(Menot!T$13:T$634,B74,Menot!S$13:S$634)","v":0},null,0.1,null,{"$f":"IF(I74>X74,\"!\",IF(H74>0.1,\"!\",\"\"))","v":""},{"$f":"IF(D74=T$1,X74,IF(D74=T$2,U74,V74))","v":0},0,null,null,null,null,null,null,null,null,0,0,0,{"$f":"IF(U74>W74,U74,W74)","v":0}]
[null,5,null,"Maksimi",null,{"$f":"SUMIF(Menot!T$13:T$634,B75,Menot!S$13:S$634)","v":0},null,0.1,null,{"$f":"IF(I75>X75,\"!\",IF(H75>0.1,\"!\",\"\"))","v":""},{"$f":"IF(D75=T$1,X75,IF(D75=T$2,U75,V75))","v":0},0,null,null,null,null,null,null,null,null,0,0,0,0]
[]
[null," nro","Ojat ja tiet, yhteensä",null,{"$f":"SUM(E78:E97)","v":3200},{"$f":"SUM(F78:F97)","v":0},{"$f":"SUM(G78:G97)","v":0},null,null,null,{"$f":"SUM(K78:K97)","v":480},{"$f":"E77+F77-G77-K77","v":2720},null,{"$f":"SUM(N78:N97)","v":0},{"$f":"SUM(O78:O97)","v":0},{"$f":"SUM(P78:P97)","v":0},null,null,null,null,{"$f":"(E77+F77-G77)*H77","v":0},{"$f":"I77","v":0},{"$f":"IF(E77+F77-G77<600.01,E77+F77-G77,0)","v":0},0]
[null,1,"tien peruskorjaus Vilpotie 2019","Maksimi",3200,{"$f":"SUMIF(Menot!W$13:W$634,B78,Menot!V$13:V$634)","v":0},null,0.15,null,{"$f":"IF(I78>X78,\"!\",IF(H78>0.15,\"!\",\"\"))","v":""},{"$f":"IF(D78=T$1,X78,IF(D78=T$2,U78,V78))","v":480},2720,null,null,null,null,null,null,null,null,480,0,0,480]
[null,2,null,"Maksimi",null,{"$f":"SUMIF(Menot!W$13:W$634,B79,Menot!V$13:V$634)","v":0},null,0.15,null,{"$f":"IF(I79>X79,\"!\",IF(H79>0.15,\"!\",\"\"))","v":""},0,0,null,null,null,null,null,null,null,null,0,0,0,0]
[null,3,null,"Maksimi",null,{"$f":"SUMIF(Menot!W$13:W$634,B80,Menot!V$13:V$634)","v":0},null,0.15,null,{"$f":"IF(I80>X80,\"!\",IF(H80>0.15,\"!\",\"\"))","v":""},0,0,null,null,null,null,null,null,null,null,0,0,0,0]
[null,4,null,"Maksimi",null,{"$f":"SUMIF(Menot!W$13:W$634,B81,Menot!V$13:V$634)","v":0},null,0.15,null,"",0,0,null,null,null,null,null,null,null,null,0,0,0,0]
[null,5,null,"Maksimi",null,{"$f":"SUMIF(Menot!W$13:W$634,B82,Menot!V$13:V$634)","v":0},null,0.15,null,"",0,0,null,null,null,null,null,null,null,null,0,0,0,0]
[null,6,null,"Maksimi",null,{"$f":"SUMIF(Menot!W$13:W$634,B83,Menot!V$13:V$634)","v":0},null,0.15,null,"",0,0,null,null,null,null,null,null,null,null,0,0,0,0]
[null,7,null,"Maksimi",null,{"$f":"SUMIF(Menot!W$13:W$634,B84,Menot!V$13:V$634)","v":0},null,0.15,null,"",0,0,null,null,null,null,null,null,null,null,0,0,0,0]
[null,8,null,"Maksimi",null,{"$f":"SUMIF(Menot!W$13:W$634,B85,Menot!V$13:V$634)","v":0},null,0.15,null,"",0,0,null,null,null,null,null,null,null,null,0,0,0,0]
[null,9,null,"Maksimi",null,{"$f":"SUMIF(Menot!W$13:W$634,B86,Menot!V$13:V$634)","v":0},null,0.15,null,"",0,0,null,null,null,null,null,null,null,null,0,0,0,0]
[null,10,null,"Maksimi",null,{"$f":"SUMIF(Menot!W$13:W$634,B87,Menot!V$13:V$634)","v":0},null,0.15,null,"",0,0,null,null,null,null,null,null,null,null,0,0,0,0]
[null,11,null,"Maksimi",null,{"$f":"SUMIF(Menot!W$13:W$634,B88,Menot!V$13:V$634)","v":0},null,0.15,null,"",0,0,null,null,null,null,null,null,null,null,0,0,0,0]
[null,12,null,"Maksimi",null,{"$f":"SUMIF(Menot!W$13:W$634,B89,Menot!V$13:V$634)","v":0},null,0.15,null,"",0,0,null,null,null,null,null,null,null,null,0,0,0,0]
[null,13,null,"Maksimi",null,{"$f":"SUMIF(Menot!W$13:W$634,B90,Menot!V$13:V$634)","v":0},null,0.15,null,"",0,0,null,null,null,null,null,null,null,null,0,0,0,0]
[null,14,null,"Maksimi",null,{"$f":"SUMIF(Menot!W$13:W$634,B91,Menot!V$13:V$634)","v":0},null,0.15,null,"",0,0,null,null,null,null,null,null,null,null,0,0,0,0]
[null,15,null,"Maksimi",null,{"$f":"SUMIF(Menot!W$13:W$634,B92,Menot!V$13:V$634)","v":0},null,0.15,null,"",0,0,null,null,null,null,null,null,null,null,0,0,0,0]
[null,16,null,"Maksimi",null,{"$f":"SUMIF(Menot!W$13:W$634,B93,Menot!V$13:V$634)","v":0},null,0.15,null,"",0,0,null,null,null,null,null,null,null,null,0,0,0,0]
[null,17,null,"Maksimi",null,{"$f":"SUMIF(Menot!W$13:W$634,B94,Menot!V$13:V$634)","v":0},null,0.15,null,"",0,0,null,null,null,null,null,null,null,null,0,0,0,0]
[null,18,null,"Maksimi",null,{"$f":"SUMIF(Menot!W$13:W$634,B95,Menot!V$13:V$634)","v":0},null,0.15,null,"",0,0,null,null,null,null,null,null,null,null,0,0,0,0]
[null,19,null,"Maksimi",null,{"$f":"SUMIF(Menot!W$13:W$634,B96,Menot!V$13:V$634)","v":0},null,0.15,null,"",0,0,null,null,null,null,null,null,null,null,0,0,0,0]
[null,20,null,"Maksimi",null,{"$f":"SUMIF(Menot!W$13:W$634,B97,Menot!V$13:V$634)","v":0},null,0.15,null,"",0,0,null,null,null,null,null,null,null,null,0,0,0,0]
[]
[null,null,"Ohjelma poistaa enintään 600 euron menon tai menojäännöksen kerralla. "]

{"sheet":"Ajopäiv.","index":8,"n_rows":149,"n_cols":19,"rows_kept":149,"cut":false,"hidden":false,"merged":[[2,1,2,3],[6,3,6,4],[6,1,6,2],[29,14,29,15],[4,9,4,10],[4,11,4,12],[3,11,3,12],[5,5,5,6]]}
[]
[null,{"$f":"Etusivu!C10","v":"Matti Metsänen"}]
[null,{"$f":"Etusivu!C16","v":"123456-7"}]
[null,null,null,null,null,"Kilometrikustannus ja päivärahat yhteensä",null,null,null,null,null,{"$f":"SUM(I6:M6)","v":44.64}]
[null,"AJOPÄIVÄKIRJA",null,null,null,null,null,null,"Matkakulu","puolipäiväraha",null,"kokopäiväraha"]
[null,null,null,"ohje","Yhteensä     ",{"$f":"CONCATENATE(SUMIF(G8:G149,\">3\",F8:F149), \" km ja \", SUMIF(G8:G149,\"<4\",F8:F149), \" tuntia\")","v":"144 km ja 0 tuntia"},null,null,{"$f":"SUM(I8:I149)","v":44.64},null,{"$f":"SUM(K8:K149)","v":0},null,{"$f":"SUM(M8:M149)","v":0}]
[null,"Päiväys       pv    kk",null,"Selite",null,"km\ntai tuntia","ajoneuvo- luokka","lisä-\nhenkilöt","koko summa\n€","kpl","koko summa\n€","kpl","koko summa\n€",null,"Päivärahat",null,"€",null,"OHJEITA"]
[null,4,6,"Käynti metsässä",null,144,4,1,{"$f":"(((SUMIF(O$13:O$27,G8,Q$13:Q$27))+(H8*Q$30))*F8)","v":44.64},null,{"$f":"J8*$Q$8","v":0},null,{"$f":"L8*$Q$9","v":0},null,"Puolipäiväraha",null,19,null,"o Verottaja vahvistaa metsätalouden kilometrikorvaukset vuodenvaihteessa"]
[null,null,null,null,null,null,null,null,{"$f":"(((SUMIF(O$13:O$27,G9,Q$13:Q$27))+(H9*Q$30))*F9)","v":0},null,{"$f":"J9*$Q$8","v":0},null,{"$f":"L9*$Q$9","v":0},null,"Kokopäiväraha",null,34,null,"o Tässä ohjelmaversiossa luvut ovat verovuoden 2024 arvoja"]
[null,null,null,null,null,null,null,null,{"$f":"(((SUMIF(O$13:O$27,G10,Q$13:Q$27))+(H10*Q$30))*F10)","v":0},null,{"$f":"J10*$Q$8","v":0},null,{"$f":"L10*$Q$9","v":0},null,null,null,null,null,"o Arvot voi itse muuttaa taulukoon."]
[null,null,null,null,null,null,null,null,{"$f":"(((SUMIF(O$13:O$27,G11,Q$13:Q$27))+(H11*Q$30))*F11)","v":0},null,{"$f":"J11*$Q$8","v":0},null,{"$f":"L11*$Q$9","v":0},null,"Kilometrikorvaukset",null,"€/km tai €/h",null,"o Jaa matka tarvittaessa useille riveille, jos ajoneuvoluokka on matkan eri vaiheissa erilainen."]
[null,null,null,null,null,null,null,null,0,null,0,null,0,null,"Ajoneuvoluokka",null,null,null,"o Päivärahan edellytyksenä on matka muualle, kuin omaan metsään ja sen kesto yli 6 h (puolipäiväraha) "]
[null,null,null,null,null,null,null,null,0,null,0,null,0,null,1,"mönkijä",15,null,"   tai yli 10 h (kokopäiväraha). Esim koulutusmatka. Etäisyys kotoa tulee lisäksi olla yli 15 km.  (Yhtenäistämisohje 2024)"]
[null,null,null,null,null,null,null,null,0,null,0,null,0,null,2,"moottorikelkka",15]
[null,null,null,null,null,null,null,null,0,null,0,null,0,null,3,"Traktori",12]
[null,null,null,null,null,null,null,null,0,null,0,null,0,null,4,"henkilöauto",0.27]
[null,null,null,null,null,null,null,null,0,null,0,null,0,null,5,"mopo",0.12]
[null,null,null,null,null,null,null,null,0,null,0,null,0,null,6,"moottoripyörä",0.21]
[null,null,null,null,null,null,null,null,0,null,0,null,0,null,7,"moottorivene <50 hv"]
[null,null,null,null,null,null,null,null,0,null,0,null,0,null,8,"moottorivene >50 hv"]
[null,null,null,null,null,null,null,null,0,null,0,null,0,null,9,"auto + perävaunu",{"$f":"Q16+0.1","v":0.37}]
[null,null,null,null,null,null,null,null,0,null,0,null,0,null,10,"auto + asuntovaunu",{"$f":"+Q16+0.15","v":0.42}]
[null,null,null,null,null,null,null,null,0,null,0,null,0,null,11,"auto + taukotupa",{"$f":"+Q16+0.3","v":0.56999999999999995}]
[null,null,null,null,null,null,null,null,0,null,0,null,0,null,12,"auto + metsätie",{"$f":"+Q16+0.11","v":0.38}]
[null,null,null,null,null,null,null,null,0,null,0,null,0,null,13,"auto + perävaunu+metsätie",{"$f":"+Q16+0.1+0.11","v":0.48}]
[null,null,null,null,null,null,null,null,0,null,0,null,0,null,14,"auto + asuntovaunu+metsätie",{"$f":"+Q16+0.14+0.11","v":0.52}]
[null,null,null,null,null,null,null,null,0,null,0,null,0,null,15,"auto + taukotupa+metsätie",{"$f":"+Q16+0.27+0.11","v":0.65}]
[null,null,null,null,null,null,null,null,0,null,0,null,0]
[null,null,null,null,null,null,null,null,0,null,0,null,0,null,null,null,"euroa/km/hlö"]
[null,null,null,null,null,null,null,null,0,null,0,null,0,null,"Lisämatkustaja",null,0.04]
[null,null,null,null,null,null,null,null,0,null,0,null,0]
[null,null,null,null,null,null,null,null,0,null,0,null,0]
[null,null,null,null,null,null,null,null,0,null,0,null,0]
[null,null,null,null,null,null,null,null,0,null,0,null,0]
[null,null,null,null,null,null,null,null,0,null,0,null,0]
[null,null,null,null,null,null,null,null,0,null,0,null,0]
[null,null,null,null,null,null,null,null,0,null,0,null,0]
[null,null,null,null,null,null,null,null,0,null,0,null,0]
[null,null,null,null,null,null,null,null,0,null,0,null,0]
[null,null,null,null,null,null,null,null,0,null,0,null,0]
[null,null,null,null,null,null,null,null,0,null,0,null,0]
[null,null,null,null,null,null,null,null,0,null,0,null,0]
[null,null,null,null,null,null,null,null,0,null,0,null,0]
[null,null,null,null,null,null,null,null,0,null,0,null,0]
[null,null,null,null,null,null,null,null,0,null,0,null,0]
[null,null,null,null,null,null,null,null,0,null,0,null,0]
[null,null,null,null,null,null,null,null,0,null,0,null,0]
[null,null,null,null,null,null,null,null,0,null,0,null,0]
[null,null,null,null,null,null,null,null,0,null,0,null,0]
[null,null,null,null,null,null,null,null,0,null,0,null,0]
[null,null,null,null,null,null,null,null,0,null,0,null,0]
[null,null,null,null,null,null,null,null,0,null,0,null,0]
[null,null,null,null,null,null,null,null,0,null,0,null,0]
[null,null,null,null,null,null,null,null,0,null,0,null,0]
[null,null,null,null,null,null,null,null,0,null,0,null,0]
[null,null,null,null,null,null,null,null,0,null,0,null,0]
[null,null,null,null,null,null,null,null,0,null,0,null,0]
[null,null,null,null,null,null,null,null,0,null,0,null,0]
[null,null,null,null,null,null,null,null,0,null,0,null,0]
[null,null,null,null,null,null,null,null,0,null,0,null,0]
[null,null,null,null,null,null,null,null,0,null,0,null,0]
[null,null,null,null,null,null,null,null,0,null,0,null,0]
[null,null,null,null,null,null,null,null,0,null,0,null,0]
[null,null,null,null,null,null,null,null,0,null,0,null,0]
[null,null,null,null,null,null,null,null,0,null,0,null,0]
[null,null,null,null,null,null,null,null,0,null,0,null,0]
[null,null,null,null,null,null,null,null,0,null,0,null,0]
[null,null,null,null,null,null,null,null,0,null,0,null,0]
[null,null,null,null,null,null,null,null,0,null,0,null,0]
[null,null,null,null,null,null,null,null,0,null,0,null,0]
[null,null,null,null,null,null,null,null,0,null,0,null,0]
[null,null,null,null,null,null,null,null,0,null,0,null,0]
[null,null,null,null,null,null,null,null,0,null,0,null,0]
[null,null,null,null,null,null,null,null,0,null,0,null,0]
[null,null,null,null,null,null,null,null,{"$f":"(((SUMIF(O$13:O$27,G75,Q$13:Q$27))+(H75*Q$30))*F75)","v":0},null,{"$f":"J75*$Q$8","v":0},null,{"$f":"L75*$Q$9","v":0}]
[null,null,null,null,null,null,null,null,0,null,0,null,0]
[null,null,null,null,null,null,null,null,0,null,0,null,0]
[null,null,null,null,null,null,null,null,0,null,0,null,0]
[null,null,null,null,null,null,null,null,0,null,0,null,0]
[null,null,null,null,null,null,null,null,0,null,0,null,0]
[null,null,null,null,null,null,null,null,0,null,0,null,0]
[null,null,null,null,null,null,null,null,0,null,0,null,0]
[null,null,null,null,null,null,null,null,0,null,0,null,0]
[null,null,null,null,null,null,null,null,0,null,0,null,0]
[null,null,null,null,null,null,null,null,0,null,0,null,0]
[null,null,null,null,null,null,null,null,0,null,0,null,0]
[null,null,null,null,null,null,null,null,0,null,0,null,0]
[null,null,null,null,null,null,null,null,0,null,0,null,0]
[null,null,null,null,null,null,null,null,0,null,0,null,0]
[null,null,null,null,null,null,null,null,0,null,0,null,0]
[null,null,null,null,null,null,null,null,0,null,0,null,0]
[null,null,null,null,null,null,null,null,0,null,0,null,0]
[null,null,null,null,null,null,null,null,0,null,0,null,0]
[null,null,null,null,null,null,null,null,0,null,0,null,0]
[null,null,null,null,null,null,null,null,0,null,0,null,0]
[null,null,null,null,null,null,null,null,0,null,0,null,0]
[null,null,null,null,null,null,null,null,0,null,0,null,0]
[null,null,null,null,null,null,null,null,0,null,0,null,0]
[null,null,null,null,null,null,null,null,0,null,0,null,0]
[null,null,null,null,null,null,null,null,0,null,0,null,0]
[null,null,null,null,null,null,null,null,0,null,0,null,0]
[null,null,null,null,null,null,null,null,0,null,0,null,0]
[null,null,null,null,null,null,null,null,0,null,0,null,0]
[null,null,null,null,null,null,null,null,0,null,0,null,0]
[null,null,null,null,null,null,null,null,0,null,0,null,0]
[null,null,null,null,null,null,null,null,0,null,0,null,0]
[null,null,null,null,null,null,null,null,0,null,0,null,0]
[null,null,null,null,null,null,null,null,0,null,0,null,0]
[null,null,null,null,null,null,null,null,0,null,0,null,0]
[null,null,null,null,null,null,null,null,0,null,0,null,0]
[null,null,null,null,null,null,null,null,0,null,0,null,0]
[null,null,null,null,null,null,null,null,0,null,0,null,0]
[null,null,null,null,null,null,null,null,0,null,0,null,0]
[null,null,null,null,null,null,null,null,0,null,0,null,0]
[null,null,null,null,null,null,null,null,0,null,0,null,0]
[null,null,null,null,null,null,null,null,0,null,0,null,0]
[null,null,null,null,null,null,null,null,0,null,0,null,0]
[null,null,null,null,null,null,null,null,0,null,0,null,0]
[null,null,null,null,null,null,null,null,0,null,0,null,0]
[null,null,null,null,null,null,null,null,0,null,0,null,0]
[null,null,null,null,null,null,null,null,0,null,0,null,0]
[null,null,null,null,null,null,null,null,0,null,0,null,0]
[null,null,null,null,null,null,null,null,0,null,0,null,0]
[null,null,null,null,null,null,null,null,0,null,0,null,0]
[null,null,null,null,null,null,null,null,0,null,0,null,0]
[null,null,null,null,null,null,null,null,0,null,0,null,0]
[null,null,null,null,null,null,null,null,0,null,0,null,0]
[null,null,null,null,null,null,null,null,0,null,0,null,0]
[null,null,null,null,null,null,null,null,0,null,0,null,0]
[null,null,null,null,null,null,null,null,0,null,0,null,0]
[null,null,null,null,null,null,null,null,0,null,0,null,0]
[null,null,null,null,null,null,null,null,0,null,0,null,0]
[null,null,null,null,null,null,null,null,0,null,0,null,0]
[null,null,null,null,null,null,null,null,0,null,0,null,0]
[null,null,null,null,null,null,null,null,0,null,0,null,0]
[null,null,null,null,null,null,null,null,0,null,0,null,0]
[null,null,null,null,null,null,null,null,0,null,0,null,0]
[null,null,null,null,null,null,null,null,0,null,0,null,0]
[null,null,null,null,null,null,null,null,{"$f":"(((SUMIF(O$13:O$27,G139,Q$13:Q$27))+(H139*Q$30))*F139)","v":0},null,{"$f":"J139*$Q$8","v":0},null,{"$f":"L139*$Q$9","v":0}]
[null,null,null,null,null,null,null,null,0,null,0,null,0]
[null,null,null,null,null,null,null,null,0,null,0,null,0]
[null,null,null,null,null,null,null,null,0,null,0,null,0]
[null,null,null,null,null,null,null,null,0,null,0,null,0]
[null,null,null,null,null,null,null,null,0,null,0,null,0]
[null,null,null,null,null,null,null,null,0,null,0,null,0]
[null,null,null,null,null,null,null,null,0,null,0,null,0]
[null,null,null,null,null,null,null,null,0,null,0,null,0]
[null,null,null,null,null,null,null,null,0,null,0,null,0]
[null,null,null,null,null,null,null,null,0,null,0,null,0]

{"sheet":"Arvionvaraiset","index":9,"n_rows":35,"n_cols":30,"rows_kept":35,"cut":false,"hidden":false,"merged":[[29,1,30,12],[26,5,26,6],[26,12,26,13],[8,1,8,2],[8,8,8,9],[26,1,27,4],[26,8,27,11],[2,1,2,4],[2,5,2,6],[26,26,26,27],[26,19,26,20],[8,15,8,16],[8,22,8,23],[26,22,27,25],[26,15,27,18]]}
[]
[null,{"$f":"Etusivu!C10","v":"Matti Metsänen"}]
[null,{"$f":"Etusivu!C16","v":"123456-7"}]
[]
[null,"ARVIONVARAISET"]
[]
[null,"Matkapuhelinkulut",null,null,null,null,null,null,"Puhelin- ja tietotekniikakulut",null,null,null,null,null,null,"Sähkökulut",null,null,null,null,null,null,"Nimeä itse",null,null,null,null,null,null,"Ohje"]
[null,null,null,null,null,null,null,null,null,null,null,null,null,null,null,"Sähkön käyttöpaikka"]
[null,"päiväys",null,null,null,null,null,null,"päiväys",null,null,null,null,null,null,"päiväys",null,null,null,null,null,null,"päiväys"]
[null,"pv","kk","Summa (sis. alv)","Alv %","Alv","Euroa Alv 0 %",null,"pv","kk","Summa (sis. alv)","Alv %","Alv","Euroa Alv 0 %",null,"pv","kk","Summa (sis. alv)","Alv %","Alv","Euroa Alv 0 %",null,"pv","kk","Summa (sis. alv)","Alv %","Alv","Euroa Alv 0 %"]
[null,null,null,null,{"$f":"IF(Etusivu!$C$22=\"kyllä\",25.5%,0%)","v":0.255},{"$f":"+D11-G11","v":0},{"$f":"+D11/(1+E11)","v":0},null,null,null,null,{"$f":"IF(Etusivu!$C$22=\"kyllä\",25.5%,0%)","v":0.255},{"$f":"+K11-N11","v":0},{"$f":"+K11/(1+L11)","v":0},null,null,null,null,{"$f":"IF(Etusivu!$C$22=\"kyllä\",25.5%,0%)","v":0.255},{"$f":"+R11-U11","v":0},{"$f":"+R11/(1+S11)","v":0},null,null,null,null,{"$f":"IF(Etusivu!$C$22=\"kyllä\",25.5%,0%)","v":0.255},{"$f":"+Y11-AB11","v":0},{"$f":"+Y11/(1+Z11)","v":0}]
[null,null,null,null,{"$f":"IF(Etusivu!$C$22=\"kyllä\",25.5%,0%)","v":0.255},{"$f":"+D12-G12","v":0},{"$f":"+D12/(1+E12)","v":0},null,null,null,null,{"$f":"IF(Etusivu!$C$22=\"kyllä\",25.5%,0%)","v":0.255},{"$f":"+K12-N12","v":0},{"$f":"+K12/(1+L12)","v":0},null,null,null,null,{"$f":"IF(Etusivu!$C$22=\"kyllä\",25.5%,0%)","v":0.255},{"$f":"+R12-U12","v":0},{"$f":"+R12/(1+S12)","v":0},null,null,null,null,{"$f":"IF(Etusivu!$C$22=\"kyllä\",25.5%,0%)","v":0.255},{"$f":"+Y12-AB12","v":0},{"$f":"+Y12/(1+Z12)","v":0}]
[null,null,null,null,{"$f":"IF(Etusivu!$C$22=\"kyllä\",25.5%,0%)","v":0.255},{"$f":"+D13-G13","v":0},{"$f":"+D13/(1+E13)","v":0},null,null,null,null,{"$f":"IF(Etusivu!$C$22=\"kyllä\",25.5%,0%)","v":0.255},0,0,null,null,null,null,{"$f":"IF(Etusivu!$C$22=\"kyllä\",25.5%,0%)","v":0.255},0,0,null,null,null,null,{"$f":"IF(Etusivu!$C$22=\"kyllä\",25.5%,0%)","v":0.255},0,0]
[null,null,null,null,{"$f":"IF(Etusivu!$C$22=\"kyllä\",25.5%,0%)","v":0.255},{"$f":"+D14-G14","v":0},{"$f":"+D14/(1+E14)","v":0},null,null,null,null,{"$f":"IF(Etusivu!$C$22=\"kyllä\",25.5%,0%)","v":0.255},0,0,null,null,null,null,{"$f":"IF(Etusivu!$C$22=\"kyllä\",25.5%,0%)","v":0.255},0,0,null,null,null,null,{"$f":"IF(Etusivu!$C$22=\"kyllä\",25.5%,0%)","v":0.255},0,0]
[null,null,null,null,{"$f":"IF(Etusivu!$C$22=\"kyllä\",25.5%,0%)","v":0.255},0,0,null,null,null,null,{"$f":"IF(Etusivu!$C$22=\"kyllä\",25.5%,0%)","v":0.255},0,0,null,null,null,null,{"$f":"IF(Etusivu!$C$22=\"kyllä\",25.5%,0%)","v":0.255},0,0,null,null,null,null,{"$f":"IF(Etusivu!$C$22=\"kyllä\",25.5%,0%)","v":0.255},0,0]
[null,null,null,null,{"$f":"IF(Etusivu!$C$22=\"kyllä\",25.5%,0%)","v":0.255},0,0,null,null,null,null,{"$f":"IF(Etusivu!$C$22=\"kyllä\",25.5%,0%)","v":0.255},0,0,null,null,null,null,{"$f":"IF(Etusivu!$C$22=\"kyllä\",25.5%,0%)","v":0.255},0,0,null,null,null,null,{"$f":"IF(Etusivu!$C$22=\"kyllä\",25.5%,0%)","v":0.255},0,0]
[null,null,null,null,{"$f":"IF(Etusivu!$C$22=\"kyllä\",25.5%,0%)","v":0.255},0,0,null,null,null,null,{"$f":"IF(Etusivu!$C$22=\"kyllä\",25.5%,0%)","v":0.255},0,0,null,null,null,null,{"$f":"IF(Etusivu!$C$22=\"kyllä\",25.5%,0%)","v":0.255},0,0,null,null,null,null,{"$f":"IF(Etusivu!$C$22=\"kyllä\",25.5%,0%)","v":0.255},0,0]
[null,null,null,null,{"$f":"IF(Etusivu!$C$22=\"kyllä\",25.5%,0%)","v":0.255},0,0,null,null,null,null,{"$f":"IF(Etusivu!$C$22=\"kyllä\",25.5%,0%)","v":0.255},0,0,null,null,null,null,{"$f":"IF(Etusivu!$C$22=\"kyllä\",25.5%,0%)","v":0.255},0,0,null,null,null,null,{"$f":"IF(Etusivu!$C$22=\"kyllä\",25.5%,0%)","v":0.255},0,0]
[null,null,null,null,{"$f":"IF(Etusivu!$C$22=\"kyllä\",25.5%,0%)","v":0.255},0,0,null,null,null,null,{"$f":"IF(Etusivu!$C$22=\"kyllä\",25.5%,0%)","v":0.255},0,0,null,null,null,null,{"$f":"IF(Etusivu!$C$22=\"kyllä\",25.5%,0%)","v":0.255},0,0,null,null,null,null,{"$f":"IF(Etusivu!$C$22=\"kyllä\",25.5%,0%)","v":0.255},0,0]
[null,null,null,null,{"$f":"IF(Etusivu!$C$22=\"kyllä\",25.5%,0%)","v":0.255},0,0,null,null,null,null,{"$f":"IF(Etusivu!$C$22=\"kyllä\",25.5%,0%)","v":0.255},0,0,null,null,null,null,{"$f":"IF(Etusivu!$C$22=\"kyllä\",25.5%,0%)","v":0.255},0,0,null,null,null,null,{"$f":"IF(Etusivu!$C$22=\"kyllä\",25.5%,0%)","v":0.255},0,0]
[null,null,null,null,{"$f":"IF(Etusivu!$C$22=\"kyllä\",25.5%,0%)","v":0.255},0,0,null,null,null,null,{"$f":"IF(Etusivu!$C$22=\"kyllä\",25.5%,0%)","v":0.255},0,0,null,null,null,null,{"$f":"IF(Etusivu!$C$22=\"kyllä\",25.5%,0%)","v":0.255},0,0,null,null,null,null,{"$f":"IF(Etusivu!$C$22=\"kyllä\",25.5%,0%)","v":0.255},0,0]
[null,null,null,null,{"$f":"IF(Etusivu!$C$22=\"kyllä\",25.5%,0%)","v":0.255},0,0,null,null,null,null,{"$f":"IF(Etusivu!$C$22=\"kyllä\",25.5%,0%)","v":0.255},0,0,null,null,null,null,{"$f":"IF(Etusivu!$C$22=\"kyllä\",25.5%,0%)","v":0.255},0,0,null,null,null,null,{"$f":"IF(Etusivu!$C$22=\"kyllä\",25.5%,0%)","v":0.255},0,0]
[null,null,null,null,{"$f":"IF(Etusivu!$C$22=\"kyllä\",25.5%,0%)","v":0.255},0,0,null,null,null,null,{"$f":"IF(Etusivu!$C$22=\"kyllä\",25.5%,0%)","v":0.255},0,0,null,null,null,null,{"$f":"IF(Etusivu!$C$22=\"kyllä\",25.5%,0%)","v":0.255},0,0,null,null,null,null,{"$f":"IF(Etusivu!$C$22=\"kyllä\",25.5%,0%)","v":0.255},0,0]
[null,"yhteensä",null,null,null,{"$f":"SUM(F11:F23)","v":0},{"$f":"SUM(G11:G23)","v":0},null,"yhteensä",null,null,null,{"$f":"SUM(M11:M23)","v":0},{"$f":"SUM(N11:N23)","v":0},null,"yhteensä",null,null,null,{"$f":"SUM(T11:T23)","v":0},{"$f":"SUM(U11:U23)","v":0},null,"yhteensä",null,null,null,{"$f":"SUM(AA11:AA23)","v":0},{"$f":"SUM(AB11:AB23)","v":0}]
[null,"€/kk Alv 0%",null,null,null,null,{"$f":"+G24/12","v":0},null,"€/kk Alv 0%",null,null,null,null,{"$f":"+N24/12","v":0},null,"€/kk Alv 0%",null,null,null,null,{"$f":"+U24/12","v":0},null,"€/kk Alv 0%",null,null,null,null,{"$f":"+AB24/12","v":0}]
[]
[null,"Metsätalouden osuus",null,null,null,0.25,null,null,"Metsätalouden osuus",null,null,null,0.1,null,null,"Metsätalouden osuus",null,null,null,0.1,null,null,"Metsätalouden osuus",null,null,null,0.5]
[null,null,null,null,null,{"$f":"+F24*F27","v":0},{"$f":"+F27*G24","v":0},null,null,null,null,null,{"$f":"+M24*M27","v":0},{"$f":"+M27*N24","v":0},null,null,null,null,null,{"$f":"+T27*T24","v":0},{"$f":"+T27*U24","v":0},null,null,null,null,null,{"$f":"+AA27*AA24","v":0},{"$f":"+AA27*AB24","v":0}]
[]
[null,"Työhuonevähennys: Jos selvitystä todellisista kuluista ei ole, mutta harjoitetun metsätalouden laajuus ja työhuonetilan tarve huomioon ottaen kuluja voidaan katsoa syntyneen, arvioituna kuluna voidaan muun selvityksen puuttuessa vähentää palkansaajan satunnaisten sivutulojen työhuonevähennyksen mukainen määrä (240 €/v). (Vuoden 2024 arvo)",null,null,null,null,null,null,null,null,null,null,null,"Euroa \nAlv 0 %"]
[]
[]
[null,"Arvionvaraiset yhteensä"]
[null,"Metsätaloudessa vähennyskelpoinen alv",null,null,null,null,{"$f":"+F28+M28+T28+AA28","v":0}]
[null,"Metsätaloudessa vähennyskelpoinen meno",null,null,null,null,{"$f":"+G28+N28+U28+AB28+N31","v":0}]

{"sheet":"Velat","index":10,"n_rows":70,"n_cols":13,"rows_kept":70,"cut":false,"hidden":false,"merged":[[54,1,54,4],[50,2,50,3],[7,2,7,3],[29,2,29,3],[12,8,13,9],[14,8,16,12],[11,1,11,4],[33,1,33,4]]}
[]
[null,{"$f":"Etusivu!C10","v":"Matti Metsänen"}]
[null,{"$f":"Etusivu!C16","v":"123456-7"}]
[]
[null,"VELAT JA KOROT"]
[null,"YHTYMÄT EIVÄT TÄYTÄ TÄTÄ LOMAKETTA"]
[]
[null,"VELAN NIMI","VELAN 1 NIMI",null,null,null,null,null,"LAINAT YHTEENSÄ"]
[null,"Velan määrä vuoden alussa",null,null,"Euroa",null,null,null,"Velan määrä vuoden alussa",null,null,{"$f":"D9+D31+D52","v":0},"euroa"]
[null,"Velan määrä vuoden lopussa",null,{"$f":"D9-D27","v":0},"Euroa",null,null,null,"Velan määrä vuoden lopussa",null,null,{"$f":"D10+D32+D53","v":0},"euroa"]
[null,null,null,null,null,null,null,null,"Lainan kulut yhteensä",null,null,{"$f":"E27+E49+E70","v":0},"euroa"]
[null,"LAINAN MAKSUERÄT",null,null,null,null,null,null,"Korot yhteensä",null,null,{"$f":"C27+C49+C70","v":0},"euroa"]
[null,"Päivä","Korko","Lyhennys","Lainan kulut","Yhteensä",null,null,"OHJEITA"]
[null,null,null,null,null,{"$f":"IF(C14+D14+E14>0,C14+D14+E14,\"\")","v":""}]
[null,null,null,null,null,{"$f":"IF(C15+D15+E15>0,C15+D15+E15,\"\")","v":""},null,null,"o Metsätalouden harjoittamiseen liittyvät velat ja niistä maksetut korot ilmoitetaan esitäytetyllä veroilmoituksella tulonhankkimismenona. "]
[null,null,null,null,null,{"$f":"IF(C16+D16+E16>0,C16+D16+E16,\"\")","v":""}]
[null,null,null,null,null,{"$f":"IF(C17+D17+E17>0,C17+D17+E17,\"\")","v":""}]
[null,null,null,null,null,"",null,null,"o Metsätalouden lainan kulut ovat metsätalouden muuta kulua "]
[null,null,null,null,null,"",null,null,"ja ne vähennetään automaattisesti verolomakkeen kohdassa 7.3 Muut vuosimenot"]
[null,null,null,null,null,""]
[null,null,null,null,null,""]
[null,null,null,null,null,""]
[null,null,null,null,null,""]
[null,null,null,null,null,""]
[null,null,null,null,null,{"$f":"IF(C25+D25+E25>0,C25+D25+E25,\"\")","v":""}]
[null,"YHTEENSÄ",{"$f":"IF(SUM(C14:C25)>0,SUM(C14:C25),\"\")","v":""},{"$f":"IF(SUM(D14:D25)>0,SUM(D14:D25),\"\")","v":""},{"$f":"IF(SUM(E14:E25)>0,SUM(E14:E25),\"\")","v":""},{"$f":"IF(SUM(F14:F25)>0,SUM(F14:F25),\"\")","v":""}]
[null,null,{"$f":"IF(C26>0,SUM(C14:C25),0)","v":0},{"$f":"IF(D26>0,SUM(D14:D25),0)","v":0},{"$f":"IF(E26>0,SUM(E14:E25),0)","v":0}]
[]
[]
[null,"VELAN NIMI","VELAN 2 NIMI"]
[null,"Velan määrä vuoden alussa",null,0,"Euroa"]
[null,"Velan määrä vuoden lopussa",null,{"$f":"D31-D49","v":0},"Euroa"]
[]
[null,"LAINAN MAKSUERÄT"]
[null,"Päivä","Korko","Lyhennys","Lainan kulut","Yhteensä"]
[null,null,null,null,null,{"$f":"IF(C36+D36>0,C36+D36+E36,\"\")","v":""}]
[null,null,null,null,null,{"$f":"IF(C37+D37>0,C37+D37+E37,\"\")","v":""}]
[null,null,null,null,null,{"$f":"IF(C38+D38>0,C38+D38+E38,\"\")","v":""}]
[null,null,null,null,null,{"$f":"IF(C39+D39>0,C39+D39+E39,\"\")","v":""}]
[null,null,null,null,null,""]
[null,null,null,null,null,""]
[null,null,null,null,null,""]
[null,null,null,null,null,""]
[null,null,null,null,null,""]
[null,null,null,null,null,""]
[null,null,null,null,null,""]
[null,null,null,null,null,{"$f":"IF(C47+D47>0,C47+D47+E47,\"\")","v":""}]
[null,"YHTEENSÄ",{"$f":"IF(SUM(C36:C47)>0,SUM(C36:C47),\"\")","v":""},{"$f":"IF(SUM(D36:D47)>0,SUM(D36:D47),\"\")","v":""},{"$f":"IF(SUM(E36:E47)>0,SUM(E36:E47),\"\")","v":""},{"$f":"IF(SUM(F36:F47)>0,SUM(F36:F47),\"\")","v":""}]
[null,null,{"$f":"IF(C48>0,SUM(C36:C47),0)","v":0},{"$f":"IF(D48>0,SUM(D36:D47),0)","v":0},{"$f":"IF(E48>0,SUM(E36:E47),0)","v":0}]
[]
[null,"VELAN NIMI","VELAN 3 NIMI"]
[null,"Velan määrä vuoden alussa",null,0,"Euroa"]
[null,"Velan määrä vuoden lopussa",null,{"$f":"D52-D70","v":0},"Euroa"]
[]
[null,"LAINAN MAKSUERÄT"]
[null,"Päivä","Korko","Lyhennys","Lainan kulut","Yhteensä"]
[null,null,null,null,null,{"$f":"IF(C57+D57>0,C57+D57+E57,\"\")","v":""}]
[null,null,null,null,null,{"$f":"IF(C58+D58>0,C58+D58+E58,\"\")","v":""}]
[null,null,null,null,null,{"$f":"IF(C59+D59>0,C59+D59+E59,\"\")","v":""}]
[null,null,null,null,null,{"$f":"IF(C60+D60>0,C60+D60+E60,\"\")","v":""}]
[null,null,null,null,null,""]
[null,null,null,null,null,""]
[null,null,null,null,null,""]
[null,null,null,null,null,""]
[null,null,null,null,null,""]
[null,null,null,null,null,""]
[null,null,null,null,null,""]
[null,null,null,null,null,{"$f":"IF(C68+D68>0,C68+D68+E68,\"\")","v":""}]
[null,"YHTEENSÄ",{"$f":"IF(SUM(C57:C68)>0,SUM(C57:C68),\"\")","v":""},{"$f":"IF(SUM(D57:D68)>0,SUM(D57:D68),\"\")","v":""},{"$f":"IF(SUM(E57:E68)>0,SUM(E57:E68),\"\")","v":""},{"$f":"IF(SUM(F57:F68)>0,SUM(F57:F68),\"\")","v":""}]
[null,null,{"$f":"IF(C69>0,SUM(C57:C68),0)","v":0},{"$f":"IF(D69>0,SUM(D57:D68),0)","v":0},{"$f":"IF(E69>0,SUM(E57:E68),0)","v":0}]

{"sheet":"Varaukset","index":11,"n_rows":37,"n_cols":13,"rows_kept":37,"cut":false,"hidden":false,"merged":[[8,10,10,10],[11,10,12,10],[13,6,13,8],[28,1,29,2],[9,1,10,2],[13,1,13,3],[14,1,14,3],[11,1,11,3],[15,1,15,3],[16,1,16,3],[16,6,16,8],[6,1,6,2],[8,5,10,5],[11,5,12,5],[9,6,10,7],[15,6,15,8],[11,6,11,8],[14,6,14,8]]}
[]
[null,{"$f":"Etusivu!C10","v":"Matti Metsänen"}]
[null,{"$f":"Etusivu!C16","v":"123456-7"}]
[]
[null,"VARAUKSET"]
[null,"Valitse alue"]
[null,"Etelä-Suomi"]
[]
[null,"MENOVARAUS",null,null,null,{"$f":"IF(C26>E14,CONCATENATE(\"HUOM! Määrä voi olla enintään 15 %\",\" tai \",E14,\" €\"),\"\")","v":""},"TUHOVARAUS",null,null,null,{"$f":"IF(H26>J14,CONCATENATE(\"HUOM! Määrä voi olla enintään vakuutuskorvauksen määrä \",J14,\" €\"),\"\")","v":""}]
[null,"Menovarauksen haluttu määrä",null,"Euroina tai",null,null,"Tuhovarauksen haluttu määrä",null,"Euroina tai",null,null,null,{"$f":"Etusivu!$C8-6","v":2019}]
[null,null,null,"Prosentteina",0.15,null,null,null,"Prosentteina",0.9,null,null,{"$f":"Etusivu!$C8-5","v":2020}]
[null,"Menovarauksen haluttu kokonaiskäyttö verovuonna",null,null,null,{"$f":"IF(E12=\"\",\"\",IF(E16>E12,CONCATENATE(\"Pakollinen tuloutus \",E16,\" €\"),\"\"))","v":""},"Tuhovarauksen haluttu kokonaiskäyttö verovuonna",null,null,null,{"$f":"IF(J12=\"\",\"\",IF(J16>J12,CONCATENATE(\"Pakollinen tuloutus \",J16,\" €\"),\"\"))","v":""}]
[null,null,null,null,null,null,null,null,null,null,null,null,"Etelä-Suomi"]
[null,"Menovarauksen enimmäismäärä verovuonna",null,null,{"$f":"IF(('2C'!S26-'2C'!S29+'2C'!S32+'2C'!S35-'2C'!B38)*0.15<0.01,0,('2C'!S26-'2C'!S29+'2C'!S32+'2C'!S35-'2C'!B38)*0.15)","v":948},null,"Tuhovarauksen enimmäismäärä verovuonna",null,null,{"$f":"'2C'!B32+'2C'!F32","v":0},null,null,"Pohjois-Suomi"]
[null,"Tehty menovaraus yhteensä, ennen varausten tuloutusta",null,null,{"$f":"SUM(C20:C26)","v":948},null,"Tehty tuhovaraus yhteensä, ennen varausten tuloutusta",null,null,{"$f":"SUM(H20:H26)","v":0}]
[null,"Mevovarauksen pakollinen tuloutus",null,null,{"$f":"IF(B7=M14,D20,D22)","v":0},null,"Mevovarauksen pakollinen tuloutus",null,null,{"$f":"IF(B7=M14,I20,I22)","v":0}]
[null,"Verovuoden tuloutettava menovaraus",null,null,{"$f":"SUM(D20:D26)","v":0},null,"Verovuoden tuloutettava tuhovaraus",null,null,{"$f":"SUM(I20:I26)","v":0}]
[]
[null,"Vuosi, jolloin varaus on tehty\n \n","Jäljellä vuoden alussa\nLisää aiemmat varaukset itse","Verovuoden käyttö\nOhjelma laskee määrän","Jäljelle jäävä  varaus\nSiirrä seuraavan vuoden Metteen",null,"Vuosi, jolloin varaus on tehty\n \n","Jäljellä vuoden alussa\nLisää aiemmat varaukset itse","Verovuoden käyttö\nOhjelma laskee määrän","Jäljelle jäävä  varaus\nSiirrä seuraavan vuoden Metteen"]
[null,{"$f":"IF($B7=$M14,Etusivu!$C8-6,\" \")","v":" "},null,{"$f":"IF(B7=M14,C20,0)","v":0},0,null,{"$f":"IF($B$7=$M$14,Etusivu!$C$8-6,\" \")","v":" "},null,{"$f":"IF(B7=M14,H20,0)","v":0},0]
[null,{"$f":"IF(B7=M14,Etusivu!C8-5,\" \")","v":" "},null,{"$f":"IF(B7=M14,C21-E21,0)","v":0},{"$f":"IF(B7=M13,0,IF(E12>=C21+C20,0,IF(C21+C20-E12>=C21,C21,C21-E12+E16)))","v":0},null,{"$f":"IF($B$7=$M$14,Etusivu!$C$8-5,\" \")","v":" "},null,{"$f":"IF(B7=M14,H21-J21,0)","v":0},{"$f":"IF(B7=M13,0,IF(J12>=H21+H20,0,IF(H21+H20-J12>=H21,H21,H21-J12+J16)))","v":0}]
[null,{"$f":"Etusivu!C8-4","v":2021},null,{"$f":"C22-E22","v":0},{"$f":"IF(B7=M13,0,IF(E12>=C22+C21+C20,0,IF(C22+C21+C20-E12>=C22,C22,C22-E12)))","v":0},null,{"$f":"Etusivu!$C$8-4","v":2021},null,{"$f":"H22-J22","v":0},{"$f":"IF(B7=M13,0,IF(J12>=H22+H21+H20,0,IF(H22+H21+H20-J12>=H22,H22,H22-J12)))","v":0}]
[null,{"$f":"Etusivu!C8-3","v":2022},null,{"$f":"C23-E23","v":0},{"$f":"IF(E12>=C23+C22+C21+C20,0,IF(C23+C22+C21+C20-E12>=C23,C23,C23+C22+C21+C20-E12))","v":0},null,{"$f":"Etusivu!$C$8-3","v":2022},null,{"$f":"H23-J23","v":0},{"$f":"IF(J12>=H23+H22+H21+H20,0,IF(H23+H22+H21+H20-J12>=H23,H23,H23+H22+H21+H20-J12))","v":0}]
[null,{"$f":"Etusivu!C8-2","v":2023},null,{"$f":"C24-E24","v":0},{"$f":"IF(E12>=C24+C23+C22+C21+C20,0,IF(C24+C23+C22+C21+C20-E12>=C24,C24,C24+C23+C22+C21+C20-E12))","v":0},null,{"$f":"Etusivu!$C$8-2","v":2023},null,{"$f":"H24-J24","v":0},{"$f":"IF(J12>=H24+H23+H22+H21+H20,0,IF(H24+H23+H22+H21+H20-J12>=H24,H24,H24+H23+H22+H21+H20-J12))","v":0}]
[null,{"$f":"Etusivu!C8-1","v":2024},null,{"$f":"C25-E25","v":0},{"$f":"IF(E12>=C25+C24+C23+C22+C21+C20,0,IF(C25+C24+C23+C22+C21+C20-E12>=C25,C25,C25+C24+C23+C22+C21+C20-E12))","v":0},null,{"$f":"Etusivu!$C$8-1","v":2024},null,{"$f":"H25-J25","v":0},{"$f":"IF(J12>=H25+H24+H23+H22+H21+H20,0,IF(H25+H24+H23+H22+H21+H20-J12>=H25,H25,H25+H24+H23+H22+H21+H20-J12))","v":0},{"$f":"IF($B7=$M13,IF(H20>0,\"Tarkista aluevalintasi\",\"\"),\"\")","v":""}]
[null,{"$f":"Etusivu!C8","v":2025},{"$f":"IF(E10=\"\",IF(('2C'!S26-'2C'!S29+'2C'!S32+'2C'!S35-'2C'!B38)<0,0,(('2C'!S26-'2C'!S29+'2C'!S32+'2C'!S35-'2C'!B38)*Varaukset!E11)),E10)","v":948},{"$f":"C26-E26","v":0},{"$f":"IF(E12>=C26+C25+C24+C23+C22,0,IF(C26+C25+C24+C23+C22-E12>=C26,C26,C26+C25+C24+C23+C22-E12))","v":948},{"$f":"IF($B7=$M13,IF(C20>0,\"Tarkista aluevalintasi\",\"\"),\"\")","v":""},{"$f":"Etusivu!$C$8","v":2025},{"$f":"IF(J10=\"\",(Tulot!O9+Tulot!P9)*J11,J10)","v":0},{"$f":"H26-J26","v":0},{"$f":"IF(J12>=H26+H25+H24+H23+H22,0,IF(H26+H25+H24+H23+H22-J12>=H26,H26,H26+H25+H24+H23+H22-J12))","v":0},{"$f":"IF(B7=M13,IF(H21>0,\"Tarkista aluevalintasi\",\"\"),\"\")","v":""}]
[null,null,null,null,null,{"$f":"IF($B7=$M13,IF(C21>0,\"Tarkista aluevalintasi\",\"\"),\"\")","v":""}]
[]
[null,"OHJEITA"]
[]
[null,"o Valitse meno- tai tuhovarauksen haluttu määrä, Euroina tai prosentteina. Jos muuta valintaa ei tehdä, ohjelma tekee automaattisesti maksimisuuruisen eli 15 % menovarauksen ja 100 % tuhovarauksen. "]
[null,"o Mikäli haluat tulouttaa tehtyjä meno- tai tuhovarauksia, kirjoita haluttu määrä soluun E12 tai J12. Ohjelma tulouttaa varauksia automaatisesti vanhemmasta varauksesta alkaen."]
[null,"o Sijoita aiemmilta vuosilta tulouttamatta olevat varaukset ko vuoden kohdalle sarakkeeseen \"Jäljellä verovuoden alussa\""]
[null,"o Sarakkeelle \"Verovuoden käyttö\", eli meno- tai tuhovarauksen tuloutuksen, ohjelma laskee automaattisesti sen mukaan minkä verran verovuoden halutuksi kokonaiskäytöksi on ylempänä annettu."]
[null,"o Jäljellejäävät menovarauksen määrät siirretään suraavan vuoden Metteen sen vuoden kohdalle, jolloin kyseinen varaus on tehty."]
[null,"o Tuhovaraus on korkeintaan uudistuskustannusten suuruinen.  "]
[null,{"$f":"CONCATENATE(\"o Vuodet \",M10,\" - \",M11,\"  käytössä vain Oulun- ja Lapin läänissä, Pohjois-Suomi -valinnalla\")","v":"o Vuodet 2019 - 2020  käytössä vain Oulun- ja Lapin läänissä, Pohjois-Suomi -valinnalla"}]

{"sheet":"Luovutusv.","index":12,"n_rows":29,"n_cols":25,"rows_kept":29,"cut":false,"hidden":false,"merged":[[31,1,32,8],[28,1,29,8],[5,2,5,3],[5,6,6,6],[5,5,6,5],[5,1,6,1],[19,1,20,7],[23,1,24,2],[25,1,25,8],[26,1,27,8]]}
[]
[null,{"$f":"Etusivu!C10","v":"Matti Metsänen"}]
[null,{"$f":"Etusivu!C16","v":"123456-7"}]
[]
[null,"KONEIDEN, KALUSTON JA METSÄTILAN LUOVUTUSVOITOT"]
[null,"Luovutuksen kohde","Päiväys",null,"Luovutus-","Hankintameno, hankintameno- olettama \ntai poistamaton hankintameno","Lisätään  metsävähennyksen määrä metsätilan myynnissä","Luovutus-","ALV"]
[null,null,"pv","kk","hinta",null,null,"voitto"]
[null,null,null,null,null,null,null,{"$f":"E8-F8+G8","v":0}]
[null,null,null,null,null,null,null,{"$f":"E9-F9+G9","v":0}]
[null,null,null,null,null,null,null,0,null,null,null,null,null,null,null,null,null,null,null,null,null,null,null,null,"Ei"]
[null,null,null,null,null,null,null,0,null,null,null,null,null,null,null,null,null,null,null,null,null,null,null,null,"Kyllä"]
[null,null,null,null,null,null,null,0]
[null,null,null,null,null,null,null,0]
[null,null,null,null,null,null,null,0]
[null,null,null,null,null,null,null,0]
[null,"Yhteensä",null,null,{"$f":"SUM(E8:E15)","v":0},{"$f":"SUM(F8:F15)","v":0},{"$f":"SUM(G8:G15)","v":0},{"$f":"SUM(H8:H15)","v":0},{"$f":"SUM(I8:I15)","v":0}]
[]
[]
[null,"Haluatko, että myyntivoittoon lisätty metsävähennyksen määrä siirretään puoliautomaattisesti Metsävähennyksen laskentataulukkoon?",null,null,null,null,null,null,"Kyllä",null,"TÄMÄ EI OLE TOIMINNASSA"]
[null,{"$f":"IF(I19=\"Kyllä\",\"Ohje: Jaa käytetty metsävähennys tiloittain viereiseen taulukkoon. Myydyille tiloille lisätään se määrä palautuvaa metsävähennystä, joka tilalla on käytetty. Loput muille metsävähennystiloille.\",\"Ohje: Luovutusvoittoja ei lisätä ollenkaan metsävähennyksen laskentaan. Siirrä luovutusvoittoihin lisätty metsävähennys itse kohtaan 16 (Luovutusvoittoihin lisätyn metsävähennyksen määrä) ja lisää siihen aiempien vuosien luvovutusvoittoihin lisätty määrä.\")","v":"Ohje: Jaa käytetty metsävähennys tiloittain viereiseen taulukkoon. Myydyille tiloille lisätään se määrä palautuvaa metsävähennystä, joka tilalla on käytetty. Loput muille metsävähennystiloille."}]
[]
[]
[]
[null,"OHJEITA"]
[]
[null,"o Metsätilan, metsätalouden koneiden, laitteiden, rakennusten ja rakennelmien myynnistä saadut voitot verotetaan luovutusvoittoina. Luovutusvoitto on pääomatuloa, mutta ei metsätalouden pääomatuloon. Luovutusvoitot ilmoitetaan verolomakkeella 9. \nLuovutusvoitto ei ole veronalaista tuloa, jos verovuonna luovutetun omaisuuden yhteenlasketut luovutushinnat ovat enintään 1 000 euroa."]
[null,"o Mikäli laitteella tai koneella on poistamatonta hankintamenoa, siirrä luovutuksen kohteen poistamaton hankintameno poistot-taulukon kyseisen kohteen sarakkeeseen \"Vähennykset verovuonna\". "]
[]
[null,{"$f":"CONCATENATE(\"o Mikäli luovutat metsävähennykseen oikeuttavan tilan, jonka luovutusvoittoon lisättiin käytettyä metsävähennystä, saa vastaavan summan palauttaa uudelleen käytettäväksi jäljellejäävillä metsävähennystiloilla. Metsävähennys voi  olla enintään \",Vähennys!C5*100,\" % verovuoden lopussa omistettujen tilojen hankintamenosta.\")","v":"o Mikäli luovutat metsävähennykseen oikeuttavan tilan, jonka luovutusvoittoon lisättiin käytettyä metsävähennystä, saa vastaavan summan palauttaa uudelleen käytettäväksi jäljellejäävillä metsävähennystiloilla. Metsävähennys voi  olla enintään 60 % verovuoden lopussa omistettujen tilojen hankintamenosta."}]

{"sheet":"Vähennys","index":13,"n_rows":48,"n_cols":24,"rows_kept":48,"cut":false,"hidden":false,"merged":[[41,1,42,2]]}
[]
[null,{"$f":"Etusivu!C10","v":"Matti Metsänen"}]
[null,{"$f":"Etusivu!C16","v":"123456-7"}]
[null,null,"Valitse metsä-vähennyksen-%"]
[null,"METSÄVÄHENNYKSEN LASKENTA",0.6,0.6,"Kyllä"]
[null,null,null,0.75,"Tilakohtainen metsävähennystietojen seuranta"]
[null,"Metsävähennystilan numero","Tilat yhteensä",null,1,2,3,4,5,6,7,8,9,10,11,12,13,14,15,16,17,18]
[null,"Merkitse tila verovuonna myydyksi kirjoittamalla tilan kohdalle \"Myyty\""]
[null,"Tilan nimi, päivittyy automaattisesti etusivulta",null,null,{"$f":"Etusivu!F11","v":"Mäntynen"},{"$f":"Etusivu!F12","v":0},{"$f":"Etusivu!F13","v":0},{"$f":"Etusivu!F14","v":0},{"$f":"Etusivu!F15","v":0},{"$f":"Etusivu!F16","v":0},{"$f":"Etusivu!F17","v":0},{"$f":"Etusivu!F18","v":0},{"$f":"Etusivu!F19","v":0},{"$f":"Etusivu!H11","v":0},{"$f":"Etusivu!H12","v":0},{"$f":"Etusivu!H13","v":0},{"$f":"Etusivu!H14","v":0},{"$f":"Etusivu!H15","v":0},{"$f":"Etusivu!H16","v":0},{"$f":"Etusivu!H17","v":0},{"$f":"Etusivu!H18","v":0},{"$f":"Etusivu!H19","v":0},null,"Myyty"]
[null,"Kiinteistötunnus",null,null,"790-401-1-11"]
[null,"Tilan hankinta-ajankohta, (muodossa ppkkvvvv)",null,null,20092001]
[null,"Tilan hankintameno, €",{"$f":"SUM(E12:V12)","v":45500},null,45500]
[null,"Metsän osuus hankintamenosta, €",45000,null,45000]
[null,"Hankintamenon lisäykset ja vähennykset verovuoden aikana, €",0]
["14.",{"$f":"CONCATENATE(\"josta \",C5*100,\" % = metsävähennyspohja (verovuoden lopussa)\")","v":"josta 60 % = metsävähennyspohja (verovuoden lopussa)"},27000,null,{"$f":"IF(E8=\"myyty\",0,(E13+E14)*$C5)","v":27000},{"$f":"IF(F8=\"myyty\",0,(F13+F14)*$C5)","v":0},0,0,0,0,0,0,0,0,0,0,0,0,0,0,0,0]
["15.",{"$f":"CONCATENATE(\"Ennen verovuotta \",Etusivu!C8,\" käytetty metsävähennys, ks. ohje alla\")","v":"Ennen verovuotta 2025 käytetty metsävähennys, ks. ohje alla"},6700,null,6700]
["16 a.",{"$f":"CONCATENATE(\"Ennen verovuotta  \",Etusivu!C8,\" luovutusvoittoihin lisätty metsävähennys\")","v":"Ennen verovuotta  2025 luovutusvoittoihin lisätty metsävähennys"},0]
["16 b.","Verovuonna myyntivoittoihin lisätty metsävähennysten määrä",{"$f":"Luovutusv.!G16","v":0},null,0]
["17.","Käytettävissä oleva metsävähennys tiloilta yhteensä",{"$f":"IF(SUM(E19:V19)<=0,0,SUM(E19:V19))","v":20300},null,{"$f":"IF(E8=\"Myyty\",0,IF(E15-E16>E15,E15,E15-E16+E17))","v":20300},{"$f":"IF(F8=\"Myyty\",0,IF(F15-F16>F15,F15,F15-F16+F17))","v":0},{"$f":"IF(G8=\"Myyty\",0,IF(G15-G16>G15,G15,G15-G16+G17))","v":0},0,0,0,0,0,0,0,0,0,0,0,0,0,0,0]
[]
["18.","Metsätalouden metsävähennyskelpoinen pääomatulo verovuonna yhteensä",{"$f":"SUMIF(Tulot!$K$11:$K$166,E5,Tulot!$G11:$G166)+SUMIF(Tulot!$K$11:$K$166,E5,Tulot!$O$11:$O$166)+SUMIF(Tulot!$K$11:$K$166,E5,Tulot!$P$11:$P$166)+SUMIF(Tulot!$K$11:$K$166,E5,Tulot!$Q$11:$Q$166)+'Oma käyttö'!L9+'Hank.työ 1'!R52+'Hank.työ 1'!R87+'Hank.työ 1'!R122+'Hank.työ 1'!R155+'Hank.työ 1'!R190+'Hank.työ 2'!R44+'Hank.työ 2'!R71+'Hank.työ 2'!R98+'Hank.työ 2'!R125+'Hank.työ 2'!R152","v":15800}]
[{"$f":"CONCATENATE(\"Vuodelle \",Etusivu!C8,\" käytettävissä oleva metsävähennys\")","v":"Vuodelle 2025 käytettävissä oleva metsävähennys"}]
[null,"Metsävähennyksen enimmäismäärä tiloilta yhteensä (60 % tulosta)",{"$f":"IF(C36*0.6<1500,0,IF(C36*0.6<=C35,C36*0.6,C35))","v":9480},null,{"$f":"IF(C23<1500,\"OHJETEKSTI: Ei metsävähennysoikeutta. Metsävähennyksen tulee olla vähintään 1500 €\", \"\")","v":""}]
[null,"Tiloille kohdistettu metsävähennys yhteensä",{"$f":"SUM(E25:V25)","v":9480},null,{"$f":"IF(C23>C24,CONCATENATE(\"Metsävähennyksestä kohdentamatta \",C23-C24,\"€\"),IF(C24>C23,\"Metsävähennystä kohdennettu liikaa. Ks rivi 23\",\"Kaikki metsävähennys kohdennettu tiloille\"))","v":"Kaikki metsävähennys kohdennettu tiloille"}]
[" ==>","Metsävähennyksen kohdistaminen tiloittain",{"$f":"IF($C23=0,0,IF(C21*0.6<=C19,C21*0.6-SUM(E25:V25),C19))","v":0},null,9480,null,0,0,0,0,0,0,0,0,0,0,0,0,0,0,0,0]
[null,"Jäljelle jäävä metsävähennys vuoden lopussa",{"$f":"SUM(E26:V26)","v":10820},null,{"$f":"E19-E25","v":10820},0,0,0,0,0,0,0,0,0,0,0,0,0,0,0,0,0]
[null,null,null,null,{"$f":"IF(E26>E15,\"Virhe, tarkista!\",\"\")","v":""},{"$f":"IF(F26>F15,IF(F16>F15,IF(F26>((F13+F14)*0.6),\"Virhe\",\"\"),\"Virhe, tarkista!\"),\"\")","v":""},{"$f":"IF(G26>G15,IF(G16>G15,IF(G26>((G13+G14)*0.6),\"Virhe\",\"\"),\"Virhe, tarkista!\"),\"\")","v":""},{"$f":"IF(H26>H15,\"Virhe, tarkista!\",\"\")","v":""},"","","","","","","","","","","","","",""]
[null,"Korjaa, jos et halua käyttää metsävähennyksen enimmäismäärää. ",{"$f":"C23","v":9480},null,{"$f":"IF(E26<0,\"korjaa\",\"\")","v":""},"","","","","","","","","","","","","","","","",""]
[null,null,{"$f":"IF(C28>C23,\"Virhe - Solussa C27 oleva luku ei saa olla suurempi kuin solussa C23\",\"\")","v":""},null,{"$f":"IF(E26<0,\"Ei sallittu\",\"\")","v":""},{"$f":"IF(F26<0,\"Ei sallittu\",\"\")","v":""},{"$f":"IF(G26<0,\"Ei sallittu\",\"\")","v":""},"","","","","","","","","","",{"$f":"IF(R26<0,\"Ei sallittu\",\"\")","v":""},{"$f":"IF(S26<0,\"Ei sallittu\",\"\")","v":""},{"$f":"IF(T26<0,\"Ei sallittu\",\"\")","v":""},{"$f":"IF(U26<0,\"Ei sallittu\",\"\")","v":""},{"$f":"IF(V26<0,\"Ei sallittu\",\"\")","v":""}]
[]
[null,"YHTEENVETO"]
["14.","Metsävähennyspohja yhteensä (sis. verovuoden aikana hankittujen tilojen metsävähennyspohjan)",{"$f":"C15","v":27000},null,"DEMOSSA mahdollista testata tiloja 2-5"]
["15.",{"$f":"CONCATENATE(\"Aikaisemmin, ennen vuotta \",Etusivu!C8,\", käytetty metsävähennys yhteensä\")","v":"Aikaisemmin, ennen vuotta 2025, käytetty metsävähennys yhteensä"},{"$f":"C16","v":6700}]
["16.","Luovutusvoittoihin lisätty metsävähennys (kumulatiivinen yhteismäärä vuodesta 2009 alkaen)",{"$f":"C18+C17","v":0}]
["17.","Käytettävissä oleva metsävähennys yhteensä   (14.-(15.-16.))",{"$f":"IF(C32-(C33-C34)<1500,0,C32-(C33-C34))","v":20300}]
["18.","Metsätalouden veronalainen pääomatulo metsävähennystiloilta yht.",{"$f":"C21","v":15800},null,{"$f":"IF(C36>=1500,\"\",\"  OHJETEKSTI: Tulon määrä on oltava vähintään 2500 €, jotta metsävähennyksen alaraja 1500 € täyttyy.\")","v":""}]
["19.","Verovuoden metsävähennys",{"$f":"IF(C23<1500,0,IF(C23<=C35,C28,C35))","v":9480},null,null,{"$f":"IF(C37>C23,\"OHJETEKSTI: Metsävähennystä jettu liikaa. Ks rivi 23\",\"\")","v":""}]
["20.","Käytetty metsävähennys yhteensä verovuoden lopussa    (15.+19.)",{"$f":"C33+C37","v":16180}]
[null,"Käyttämättä oleva metsävähennys vuoden lopussa yhteensä",{"$f":"C35-C37","v":10820}]
[]
[]
[null,"OHJEITA"]
[]
[null,"o Jos tila on hankittu ennen verovuotta, anna riville 16 (kohta 15.) mahdollinen käytetyn metsävähennyksen määrä."]
[null,"o Tilakohtainen erittely ei ole pakollista, mutta helpottaa esim siinä tilanteessa, kun myy metsävähennystilan."]
[null,"o Merkitse riville 8 \"Myyty\", jos tila on luovutettu verovuoden aikana. Ohjelma poistaa kyseisen tilan pääomatulon metsävähennyksen laskennasta. Verovuoden aikana luovutetuilta tiloilta saadusta tulosta ei voi tehdä metsävähennystä."]
[null,"o Jaa ohjelman ehdottama metsävähennys haluamallasi tavalla tiloittain rivillä 25."]
[null,{"$f":"IF(C39>=1500,\"o Metsävähennystä jää käytettäväksi tulevina vuosina\",\"o Metsävähennystä on jääämässä käyttämättä alle 1500 €, mahdollista loppuosaa ei voi käyttää ilman uuden metsätilan hankintaa.\")","v":"o Metsävähennystä jää käytettäväksi tulevina vuosina"}]

{"sheet":"Metsälahja","index":14,"n_rows":315,"n_cols":25,"rows_kept":315,"cut":false,"hidden":false,"merged":[[22,1,23,1],[22,2,23,2],[22,3,23,3],[4,21,4,22],[5,2,5,3],[6,2,6,3],[6,17,7,17],[6,18,7,18],[32,17,33,18],[28,2,28,3],[9,2,9,3],[6,8,15,14],[9,24,10,24],[9,22,10,22],[9,23,10,23],[9,19,10,20],[9,17,10,17],[9,18,10,18],[16,8,17,14]]}
[]
[null,{"$f":"Etusivu!C10","v":"Matti Metsänen"}]
[null,{"$f":"Etusivu!C16","v":"123456-7"}]
[]
[null,"METSÄLAHJAVÄHENNYKSEN LASKENTA"]
[]
[null,"Valitse kunta luettelosta","Keskimääräinen vuotuinen tuotto",null,null,">","Akaa",167.06," Verohallinnon päätös metsän keskimääräisestä vuotuisesta tuotosta\n\nAntopäivä 6.11.2024\nDiaarinumero VH/6817/00.01.00/2024\nVoimassaolo1.1.2025 - Toistaiseksi\n\nVerohallinto on varojen arvostamisesta verotuksessa annetun lain (1142/2005) 7 §:n 3 momentin, sellaisena kuin se on laissa 505/2010, nojalla vahvistanut metsän keskimääräisen vuotuisen tuoton vuodelta 2024 toimitettavaa verotusta varten seuraavasti:\n\n1 §\nMetsän keskimääräinen vuotuinen tuotto hehtaaria kohti eri kunnissa vahvistetaan seuraavassa esitetyiksi määriksi:",null,null,null,null,null,null,null,null,"Metsätalouden yrittäjävähennyksellä vähennetty metsätalouden positiivinen puhdas pääomatulo",{"$f":"IF('Metsätalouden Tulos'!D16>0,'Metsätalouden Tulos'!D16,0)","v":3597.07},null,null,"KÄYTÖN SEURANTA"]
[null,"Sastamala",{"$f":"VLOOKUP(B8,G7:H317,2,FALSE)","v":155.5},"e/ha",null,null,"Alajärvi",79.86,null,null,null,null,null,null,null,null,null,null,null,null,null,"Anna metsälahjan lahjoitusvuosi"]
[null,"Minimi pinta-ala metsälahjavähennykselle. \nYli 100 ha tiloilla, pinta-ala rajoite ei ole voimassa",{"$f":"30000/10/C8","v":19.29},"ha",null,null,"Alavieska",56.92,null,null,null,null,null,null,null,null,null,"Metsälahjavähennyspohja.\n",{"$f":"C22","v":0},null,null,"Anna metsävähennyspohja, €"]
[null,"Lahjoitusvuosi",2025,null,null,null,"Alavus",82.69,null,null,null,null,null,null,null,null,null,"Metsälahjavähennyksen maksimimäärä verovuoden puhtaalla pääomatulolla, 50 %",{"$f":"IF(T23>1499.99,S7*0.5,0)","v":0},{"$f":"IF(S10<1500,\"Vähennyksen minimimäärä 1500 eur/ vuosi ei toteudu\",\"\")","v":"Vähennyksen minimimäärä 1500 eur/ vuosi ei toteudu"},null,null,{"$f":"CONCATENATE(\"Metsälahja-vähennyksen käyttö \",Etusivu!C8)","v":"Metsälahja-vähennyksen käyttö 2025"},"Aiemmin käytetty","Metsälahja-vähennystä käyttämättä"]
[null,null,null,null,null,null,"Asikkala",199.22]
[null,"Metsälahjavähennyksen määrän laskenta",null,null,null,null,"Askola",197.01,null,null,null,null,null,null,null,null,null,"Verovuoden metsälahjavähennys",{"$f":"IF(S10>T23,T23,IF(S10>1500,S10,0))","v":0},null,null,{"$f":"IF(Y8>1,Y8,C10)","v":2025},{"$f":"IF(V12=Etusivu!C$8,S$12,\"\")","v":0},null,{"$f":"IF(V12<Etusivu!C$8,Y9-X12,IF(V12=Etusivu!C$8,W12,\"\"))","v":0}]
[null,"Lahjojen lukumäärä",null,"kpl",null,null,"Aura",148.75,null,null,null,null,null,null,null,null,null,null,null,null,null,{"$f":"V12+1","v":2026},{"$f":"IF(V13=Etusivu!C$8,S$12,\"\")","v":""},null,{"$f":"IF(V13<Etusivu!C$8,Y12-X13,IF(V13=Etusivu!C$8,Y12-W13,\"\"))","v":""}]
[null,"Lahjan osuus luovutuksesta",null,"%",null,null,"Brändö",6.71,null,null,null,null,null,null,null,null,null,"Viimeinen metsävähennyksen käyttövuosi",{"$f":"C10+15","v":2040},null,null,{"$f":"V13+1","v":2027},{"$f":"IF(V14=Etusivu!C$8,S$12,\"\")","v":""},null,{"$f":"IF(V14<Etusivu!C$8,Y13-X14,IF(V14=Etusivu!C$8,Y13-W14,\"\"))","v":""}]
[null,"Lahjan verotusarvo",null,"eur",{"$f":"C15/C13","v":{"$error":"#DIV/0!"}},null,"Eckerö",40.17,null,null,null,null,null,null,null,null,null,null,null,null,null,2028,{"$f":"IF(V15=Etusivu!C$8,S$12,\"\")","v":""},null,{"$f":"IF(V15<Etusivu!C$8,Y14-X15,IF(V15=Etusivu!C$8,Y14-W15,\"\"))","v":""}]
[null,"Veroluokka    (1 tai 2)",null,null,{"$f":"LVA/C13","v":{"$error":"#REF!"}},null,"Enonkoski",177.76,null,null,null,null,null,null,null,null,null,"Jos metsälahjavähennystilasta luovutetaan 15 vuoden aikana yli 10 % pinta-alasta,",null,null,null,2029,{"$f":"IF(V16=Etusivu!C$8,S$12,\"\")","v":""},null,{"$f":"IF(V16<Etusivu!C$8,Y15-X16,IF(V16=Etusivu!C$8,Y15-W16,\"\"))","v":""}]
[null,"Metsän pinta-ala",null,"ha",null,null,"Enontekiö",5.94,"2 § Tämä päätös tulee voimaan 1 päivänä tammikuuta 2025. Päätöstä sovelletaan vuodelta 2024 toimitettavassa verotuksessa.",null,null,null,null,null,null,null,null,"tuloutetaan tehdyt vähennykset  20 % korotettuna luovutusvuoden pääomatulona.",null,null,null,{"$f":"V16+1","v":2030},{"$f":"IF(V17=Etusivu!C$8,S$12,\"\")","v":""},null,{"$f":"IF(V17<Etusivu!C$8,Y16-X17,IF(V17=Etusivu!C$8,Y16-W17,\"\"))","v":""}]
[null,"Tilan lahjoitettu pinta-ala, (lahjan osuus) ",{"$f":"C17*C14","v":0},"ha",null,null,"Espoo",123.08,null,null,null,null,null,null,null,null,null,null,null,null,null,{"$f":"V17+1","v":2031},{"$f":"IF(V18=Etusivu!C$8,S$12,\"\")","v":""},null,{"$f":"IF(V18<Etusivu!C$8,Y17-X18,IF(V18=Etusivu!C$8,Y17-W18,\"\"))","v":""}]
[null,"Metsän arvo arvostamislain mukaan",{"$f":"C8*C18*10","v":0},"eur",null,null,"Eura",130.81,null,null,null,null,null,1,2,null,null,"Metsälahjavähennysilmoitus tehdään lomakkeella 2L ",null,null,null,{"$f":"V18+1","v":2032},{"$f":"IF(V19=Etusivu!C$8,S$12,\"\")","v":""},null,{"$f":"IF(V19<Etusivu!C$8,Y18-X19,IF(V19=Etusivu!C$8,Y18-W19,\"\"))","v":""}]
[null,"Metsän lahjoitusarvo €/ha",{"$f":"IFERROR(C15/C18,0)","v":0},"eur/ha",null,null,"Eurajoki",120.16,null,5000,25000,100,100,0.08,0.19,null,null,"Tarvittavat tiedot:",null,null,null,2033,{"$f":"IF(V20=Etusivu!C$8,S$12,\"\")","v":""},null,{"$f":"IF(V20<Etusivu!C$8,Y19-X20,IF(V20=Etusivu!C$8,Y19-W20,\"\"))","v":""}]
[null,"Lahjaveron määrä",{"$f":"IFERROR(E21*C13,0)","v":0},"eur",{"$f":"IF(C16=1,N27,O27)","v":{"$error":"#DIV/0!"}},null,"Evijärvi",88.13,null,25000.01,55000,1700,3900,0.1,0.25,null,null,"2.1 Lahjana saatujen metsien vähennyspohja yhteensä",null,{"$f":"IF(S9=0,Y9,S9)","v":0},null,2034,{"$f":"IF(V21=Etusivu!C$8,S$12,\"\")","v":""},null,{"$f":"IF(V21<Etusivu!C$8,Y20-X21,IF(V21=Etusivu!C$8,Y20-W21,\"\"))","v":""}]
[null,"Metsälahjavähennyspohja",{"$f":"IFERROR(IF(C28=1,C29,IF(C30<0,0,C30)),0)","v":0},"eur",{"$f":"IF(C16=1,N27,O27)","v":{"$error":"#DIV/0!"}},null,"Finström",46.6,null,null,null,null,null,null,null,null,null,"2.2 Aiemmin käytetty metsälahjavähennys",null,{"$f":"SUM(X12:X27)","v":0},null,2035,{"$f":"IF(V22=Etusivu!C$8,S$12,\"\")","v":""},null,{"$f":"IF(V22<Etusivu!C$8,Y21-X22,IF(V22=Etusivu!C$8,Y21-W22,\"\"))","v":""}]
[null,{"$f":"IF(C22>1500,\"Metsälahjavähennyksen maksimi verohyöty 30 % verokannalla\",\"Ei käytettävää metsälahjavähennystä\")","v":"Ei käytettävää metsälahjavähennystä"},{"$f":"IF(C22>1500,C22*0.3,0)","v":0},"eur",null,null,"Forssa",182.19,null,55000.01,200000,4700,11400,0.12,0.28999999999999998,null,null,"2.3 Käytettävissä oleva vähennyspohjan määrä",null,{"$f":"IF(T21-T22<1500,0,T21-T22)","v":0},null,2036,{"$f":"IF(V23=Etusivu!C$8,S$12,\"\")","v":""},null,{"$f":"IF(V23<Etusivu!C$8,Y22-X23,IF(V23=Etusivu!C$8,Y22-W23,\"\"))","v":""}]
[null,null,null,null,null,null,"Föglö",17.690000000000001,null,200000.01,1000000,22100,53450,0.15,0.31,null,null,"3.1 Verovuoden metsätalouden pääomatulot yhteensä",null,{"$f":"S7","v":3597.07},null,2037,{"$f":"IF(V24=Etusivu!C$8,S$12,\"\")","v":""},null,{"$f":"IF(V24<Etusivu!C$8,Y23-X24,IF(V24=Etusivu!C$8,Y23-W24,\"\"))","v":""}]
[null,"Huojennus lahjaverosta",{"$f":"IF(C23=0,IF(C21=0,0,C23/C21),C23/C21)","v":0},null,null,null,"Geta",37.4,null,999999.99,null,142100,302450,0.17,0.33,null,null,"3.2 Verovuoden metsälahjavähenys",null,{"$f":"S12","v":0},null,2038,{"$f":"IF(V25=Etusivu!C$8,S$12,\"\")","v":""},null,{"$f":"IF(V25<Etusivu!C$8,Y24-X25,IF(V25=Etusivu!C$8,Y24-W25,\"\"))","v":""}]
[null,null,null,null,null,null,"Haapajärvi",61.63,null,null,null,null,null,null,null,null,null,"3.3 Käytetty metsälahjavähennys yhteensä",null,{"$f":"T22+T25","v":0},null,2039,{"$f":"IF(V26=Etusivu!C$8,S$12,\"\")","v":""},null,{"$f":"IF(V26<Etusivu!C$8,Y25-X26,IF(V26=Etusivu!C$8,Y25-W26,\"\"))","v":""}]
[null,null,null,null,null,null,"Haapavesi",45.38,null,null,null,null,null,{"$f":"IF(E15<5000,0,IF(E15<K20,L20+((E15-J20)*N20),IF(E15<K21,L21+((E15-J21)*N21),IF(E15<K23,L23+((E15-J23)*N23),IF(E15<K24,L24+((E15-J24)*N24),IF(E15>J25,L25+((E15-J25)*N25)))))))","v":{"$error":"#DIV/0!"}},{"$f":"IF(E15<5000,0,IF(E15<K20,M20+((E15-J20)*O20),IF(E15<K21,M21+((E15-J21)*O21),IF(E15<K23,M23+((E15-J23)*O23),IF(E15<K24,M24+((E15-J24)*O24),IF(E15>J25,M25+((E15-J25)*O25)))))))","v":{"$error":"#DIV/0!"}},null,null,null,null,null,null,2040,{"$f":"IF(V27=Etusivu!C$8,S$12,\"\")","v":""},null,{"$f":"IF(V27<Etusivu!C$8,Y26-X27,IF(V27=Etusivu!C$8,Y26-W27,\"\"))","v":""}]
[null,"huomioidaan yli 100 ha",{"$f":"IF(C9>100,1,0)","v":0},null,null,null,"Hailuoto",34.51,null,null,null,null,null,null,null,null,null,null,null,null,null,null,null,null,{"$f":"IF(V28<=Etusivu!C24,Y27-X28,0)","v":{"$error":"#VALUE!"}}]
[null,"yli 100 ha:n lahjaveron arvo x 2,4",{"$f":"IFERROR(IF(C28=1,(C21/C18*(C18-100)),\"ei yli 100 ha käytäntöä\"),0)","v":"ei yli 100 ha käytäntöä"},null,null,null,"Halsua",47.08,null,null,null,null,null,null,null,null,null,null,null,null,null,null,null,null,{"$f":"IF(V29<=Etusivu!C26,Y28-X29,0)","v":{"$error":"#VALUE!"}}]
[null,"Teoreettinen metsälahjavähennyspohja ",{"$f":"2.4*((C8*(C18/C13)*10-30000)/(C8*(C18/C13)*10))*C21","v":{"$error":"#DIV/0!"}},null,null,null,"Hamina",139.13,null,null,null,null,null,null,null,null,null,null,null,null,null,null,null,null,{"$f":"IF(V30<=Etusivu!C26,Y29-X30,0)","v":{"$error":"#VALUE!"}}]
[null,null,null,null,null,null,"Hammarland",47.28,null,null,null,null,null,null,null,null,null,null,null,null,null,null,null,null,{"$f":"IF(V31<=Etusivu!C28,Y30-X31,0)","v":{"$error":"#VALUE!"}}]
[null,null,{"$f":"(C17/100)*(C21/(C17/100))","v":{"$error":"#DIV/0!"}},null,null,null,"Hankasalmi",185.38,null,null,null,null,null,null,null,null,null,null,null,null,null,null,null,null,{"$f":"IF(V32<=Etusivu!C28,Y31-X32,0)","v":{"$error":"#VALUE!"}}]
[null,null,null,null,null,null,"Hanko",61.06,null,null,null,null,null,null,null,null,null,"OHJEITA"]
[null,null,null,null,null,null,"Harjavalta",151.69]
[null,"Joissain vanhoissa Exceleissä saattaa esiintyä virheilmoitus #NIMI",null,null,null,null,"Hartola",178.23,null,null,null,null,null,null,null,null,null,"o Varmista lahjaveropäätöksestä että laskettu lahjaveron määrä on sama"]
[null,"Kyseessä ei ole virhe vaan ominaisuus, jossa kyseinen Excel ei osaa tulkita kaavaa oikein.",null,null,null,null,"Hattula",195.3,null,null,null,null,null,null,null,null,null,"o Metsälahjan enimmäisenä vuotena seurantaan tulee valmiiksi laskettu metsälahjavähennyspohja. Jatkossa merkitse seurantataulukkoon arvo aiemmasta Mettestä."]
[null,null,null,null,null,null,"Hausjärvi",211.83,null,null,null,null,null,null,null,null,null,"o Metsälahjavähennystä ei myönnetä automaattisesti, vaan sitä täytyy itse hakea omaverossa tai lomakkeella L2."]
[null,null,null,null,null,null,"Heinola",166.01]
[null,null,null,null,null,null,"Heinävesi",165.41]
[null,null,null,null,null,null,"Helsinki",123.5]
[null,null,null,null,null,null,"Hirvensalmi",188.4]
[null,null,null,null,null,null,"Hollola",215.38]
[null,null,null,null,null,null,"Huittinen",166.08]
[null,null,null,null,null,null,"Humppila",173.85]
[null,null,null,null,null,null,"Hyrynsalmi",43.68]
[null,null,null,null,null,null,"Hyvinkää",180.97]
[null,null,null,null,null,null,"Hämeenkyrö",161.52000000000001]
[null,null,null,null,null,null,"Hämeenlinna",185.33]
[null,null,null,null,null,null,"Ii",29.46]
[null,null,null,null,null,null,"Iisalmi",135.86000000000001]
[null,null,null,null,null,null,"Iitti",177.77]
[null,null,null,null,null,null,"Ikaalinen",128.79]
[null,null,null,null,null,null,"Ilmajoki",91.42]
[null,null,null,null,null,null,"Ilomantsi",82.44]
[null,null,null,null,null,null,"Imatra",173.9]
[null,null,null,null,null,null,"Inari",6.99]
[null,null,null,null,null,null,"Inkoo",106.32]
[null,null,null,null,null,null,"Isojoki",82.49]
[null,null,null,null,null,null,"Isokyrö",89.85]
[null,null,null,null,null,null,"Janakkala",185.31]
[null,null,null,null,null,null,"Joensuu",118.79]
[null,null,null,null,null,null,"Jokioinen",186.69]
[null,null,null,null,null,null,"Jomala",47.68]
[null,null,null,null,null,null,"Joroinen",173.4]
[null,null,null,null,null,null,"Joutsa",166.22]
[null,null,null,null,null,null,"Juuka",90.15]
[null,null,null,null,null,null,"Juupajoki",163.87]
[null,null,null,null,null,null,"Juva",172.73]
[null,null,null,null,null,null,"Jyväskylä",179.96]
[null,null,null,null,null,null,"Jämijärvi",106.75]
[null,null,null,null,null,null,"Jämsä",169.25]
[null,null,null,null,null,null,"Järvenpää",187.42]
[null,null,null,null,null,null,"Kaarina",101.64]
[null,null,null,null,null,null,"Kaavi",115.27]
[null,null,null,null,null,null,"Kajaani",46.53]
[null,null,null,null,null,null,"Kalajoki",49.41]
[null,null,null,null,null,null,"Kangasala",164.18]
[null,null,null,null,null,null,"Kangasniemi",177.72]
[null,null,null,null,null,null,"Kankaanpää",89.52]
[null,null,null,null,null,null,"Kannonkoski",116.74]
[null,null,null,null,null,null,"Kannus",54.6]
[null,null,null,null,null,null,"Karijoki",90.98]
[null,null,null,null,null,null,"Karkkila",188.22]
[null,null,null,null,null,null,"Karstula",93.94]
[null,null,null,null,null,null,"Karvia",76.790000000000006]
[null,null,null,null,null,null,"Kaskinen",56.84]
[null,null,null,null,null,null,"Kauhajoki",89.7]
[null,null,null,null,null,null,"Kauhava",83.16]
[null,null,null,null,null,null,"Kauniainen",107.59]
[null,null,null,null,null,null,"Kaustinen",65.42]
[null,null,null,null,null,null,"Keitele",119.05]
[null,null,null,null,null,null,"Kemi",31.05]
[null,null,null,null,null,null,"Kemijärvi",25.41]
[null,null,null,null,null,null,"Keminmaa",32.75]
[null,null,null,null,null,null,"Kemiönsaari",93.93]
[null,null,null,null,null,null,"Kempele",44.25]
[null,null,null,null,null,null,"Kerava",184.87]
[null,null,null,null,null,null,"Keuruu",131.58000000000001]
[null,null,null,null,null,null,"Kihniö",91.02]
[null,null,null,null,null,null,"Kinnula",76.849999999999994]
[null,null,null,null,null,null,"Kirkkonummi",119.7]
[null,null,null,null,null,null,"Kitee",158.31]
[null,null,null,null,null,null,"Kittilä",10.17]
[null,null,null,null,null,null,"Kiuruvesi",99.03]
[null,null,null,null,null,null,"Kivijärvi",90.5]
[null,null,null,null,null,null,"Kokemäki",145.66]
[null,null,null,null,null,null,"Kokkola",65.23]
[null,null,null,null,null,null,"Kolari",19.52]
[null,null,null,null,null,null,"Konnevesi",161.61000000000001]
[null,null,null,null,null,null,"Kontiolahti",125.62]
[null,null,null,null,null,null,"Korsnäs",69.739999999999995]
[null,null,null,null,null,null,"KoskiTl",169.62]
[null,null,null,null,null,null,"Kotka",134.83000000000001]
[null,null,null,null,null,null,"Kouvola",175.01]
[null,null,null,null,null,null,"Kristiinankaupunki",75.41]
[null,null,null,null,null,null,"Kruunupyy",79.39]
[null,null,null,null,null,null,"Kuhmo",52.33]
[null,null,null,null,null,null,"Kuhmoinen",172.36]
[null,null,null,null,null,null,"Kumlinge",14.54]
[null,null,null,null,null,null,"Kuopio",142.18]
[null,null,null,null,null,null,"Kuortane",90.28]
[null,null,null,null,null,null,"Kurikka",89.09]
[null,null,null,null,null,null,"Kustavi",74.02]
[null,null,null,null,null,null,"Kuusamo",28.25]
[null,null,null,null,null,null,"Kyyjärvi",72.209999999999994]
[null,null,null,null,null,null,"Kärkölä",218.45]
[null,null,null,null,null,null,"Kärsämäki",59.23]
[null,null,null,null,null,null,"Kökar",2.21]
[null,null,null,null,null,null,"Lahti",185.48]
[null,null,null,null,null,null,"Laihia",90.27]
[null,null,null,null,null,null,"Laitila",117.38]
[null,null,null,null,null,null,"Lapinjärvi",132.06]
[null,null,null,null,null,null,"Lapinlahti",135.66]
[null,null,null,null,null,null,"Lappajärvi",85.25]
[null,null,null,null,null,null,"Lappeenranta",157.44999999999999]
[null,null,null,null,null,null,"Lapua",83.9]
[null,null,null,null,null,null,"Laukaa",181.15]
[null,null,null,null,null,null,"Lemi",173.8]
[null,null,null,null,null,null,"Lemland",43.68]
[null,null,null,null,null,null,"Lempäälä",172.09]
[null,null,null,null,null,null,"Leppävirta",161.13]
[null,null,null,null,null,null,"Lestijärvi",60.64]
[null,null,null,null,null,null,"Lieksa",78]
[null,null,null,null,null,null,"Lieto",124.76]
[null,null,null,null,null,null,"Liminka",33.090000000000003]
[null,null,null,null,null,null,"Liperi",133.5]
[null,null,null,null,null,null,"Lohja",179.69]
[null,null,null,null,null,null,"Loimaa",162.05000000000001]
[null,null,null,null,null,null,"Loppi",184.76]
[null,null,null,null,null,null,"Loviisa",102.67]
[null,null,null,null,null,null,"Luhanka",175.86]
[null,null,null,null,null,null,"Lumijoki",39.75]
[null,null,null,null,null,null,"Lumparland",36.630000000000003]
[null,null,null,null,null,null,"Luoto",70.290000000000006]
[null,null,null,null,null,null,"Luumäki",148.79]
[null,null,null,null,null,null,"Maalahti",71.87]
[null,null,null,null,null,null,"Maarianhamina",29.81]
[null,null,null,null,null,null,"Marttila",150]
[null,null,null,null,null,null,"Masku",112.28]
[null,null,null,null,null,null,"Merijärvi",57.52]
[null,null,null,null,null,null,"Merikarvia",104.58]
[null,null,null,null,null,null,"Miehikkälä",159.76]
[null,null,null,null,null,null,"Mikkeli",177.75]
[null,null,null,null,null,null,"Muhos",50.22]
[null,null,null,null,null,null,"Multia",112.22]
[null,null,null,null,null,null,"Muonio",15.21]
[null,null,null,null,null,null,"Mustasaari",74.98]
[null,null,null,null,null,null,"Muurame",183.31]
[null,null,null,null,null,null,"Mynämäki",122.27]
[null,null,null,null,null,null,"Myrskylä",181.81]
[null,null,null,null,null,null,"Mäntsälä",195.77]
[null,null,null,null,null,null,"Mänttä-Vilppula",143.91999999999999]
[null,null,null,null,null,null,"Mäntyharju",168.41]
[null,null,null,null,null,null,"Naantali",77.95]
[null,null,null,null,null,null,"Nakkila",144.28]
[null,null,null,null,null,null,"Nivala",68.63]
[null,null,null,null,null,null,"Nokia",159.31]
[null,null,null,null,null,null,"Nousiainen",125.62]
[null,null,null,null,null,null,"Nurmes",65.19]
[null,null,null,null,null,null,"Nurmijärvi",202.25]
[null,null,null,null,null,null,"Närpiö",73.66]
[null,null,null,null,null,null,"Orimattila",197.34]
[null,null,null,null,null,null,"Oripää",139.87]
[null,null,null,null,null,null,"Orivesi",161.52000000000001]
[null,null,null,null,null,null,"Oulainen",55.86]
[null,null,null,null,null,null,"Oulu",38.369999999999997]
[null,null,null,null,null,null,"Outokumpu",116.79]
[null,null,null,null,null,null,"Padasjoki",181.85]
[null,null,null,null,null,null,"Paimio",107.08]
[null,null,null,null,null,null,"Paltamo",56.15]
[null,null,null,null,null,null,"Parainen",70.09]
[null,null,null,null,null,null,"Parikkala",176.45]
[null,null,null,null,null,null,"Parkano",92.97]
[null,null,null,null,null,null,"Pedersören kunta",62.78]
[null,null,null,null,null,null,"Pelkosenniemi",18.62]
[null,null,null,null,null,null,"Pello",34.270000000000003]
[null,null,null,null,null,null,"Perho",47.65]
[null,null,null,null,null,null,"Pertunmaa",187.69]
[null,null,null,null,null,null,"Petäjävesi",159.72]
[null,null,null,null,null,null,"Pieksämäki",156]
[null,null,null,null,null,null,"Pielavesi",117.63]
[null,null,null,null,null,null,"Pietarsaari",70.430000000000007]
[null,null,null,null,null,null,"Pihtipudas",93.9]
[null,null,null,null,null,null,"Pirkkala",153.5]
[null,null,null,null,null,null,"Polvijärvi",113.66]
[null,null,null,null,null,null,"Pomarkku",133.36000000000001]
[null,null,null,null,null,null,"Pori",124.57]
[null,null,null,null,null,null,"Pornainen",166.65]
[null,null,null,null,null,null,"Porvoo",115.8]
[null,null,null,null,null,null,"Posio",28.62]
[null,null,null,null,null,null,"Pudasjärvi",23.7]
[null,null,null,null,null,null,"Pukkila",205.71]
[null,null,null,null,null,null,"Punkalaidun",164.61]
[null,null,null,null,null,null,"Puolanka",39.78]
[null,null,null,null,null,null,"Puumala",161.9]
[null,null,null,null,null,null,"Pyhtää",116.78]
[null,null,null,null,null,null,"Pyhäjoki",48.69]
[null,null,null,null,null,null,"Pyhäjärvi",67.02]
[null,null,null,null,null,null,"Pyhäntä",42.28]
[null,null,null,null,null,null,"Pyhäranta",104.23]
[null,null,null,null,null,null,"Pälkäne",169.43]
[null,null,null,null,null,null,"Pöytyä",147.05000000000001]
[null,null,null,null,null,null,"Raahe",45.83]
[null,null,null,null,null,null,"Raasepori",109.43]
[null,null,null,null,null,null,"Raisio",94.54]
[null,null,null,null,null,null,"Rantasalmi",190.97]
[null,null,null,null,null,null,"Ranua",23.71]
[null,null,null,null,null,null,"Rauma",122.28]
[null,null,null,null,null,null,"Rautalampi",151.58000000000001]
[null,null,null,null,null,null,"Rautavaara",71.31]
[null,null,null,null,null,null,"Rautjärvi",154.74]
[null,null,null,null,null,null,"Reisjärvi",65.13]
[null,null,null,null,null,null,"Riihimäki",191.07]
[null,null,null,null,null,null,"Ristijärvi",48.7]
[null,null,null,null,null,null,"Rovaniemi",25]
[null,null,null,null,null,null,"Ruokolahti",148.56]
[null,null,null,null,null,null,"Ruovesi",160.54]
[null,null,null,null,null,null,"Rusko",113.13]
[null,null,null,null,null,null,"Rääkkylä",142.72]
[null,null,null,null,null,null,"Saarijärvi",117.48]
[null,null,null,null,null,null,"Salla",18.809999999999999]
[null,null,null,null,null,null,"Salo",140.66999999999999]
[null,null,null,null,null,null,"Saltvik",40.26]
[null,null,null,null,null,null,"Sastamala",155.5]
[null,null,null,null,null,null,"Sauvo",101.65]
[null,null,null,null,null,null,"Savitaipale",169.01]
[null,null,null,null,null,null,"Savonlinna",184.47]
[null,null,null,null,null,null,"Savukoski",14.89]
[null,null,null,null,null,null,"Seinäjoki",86.13]
[null,null,null,null,null,null,"Sievi",63.99]
[null,null,null,null,null,null,"Siikainen",110.46]
[null,null,null,null,null,null,"Siikajoki",44.05]
[null,null,null,null,null,null,"Siikalatva",37.729999999999997]
[null,null,null,null,null,null,"Siilinjärvi",163.24]
[null,null,null,null,null,null,"Simo",26.51]
[null,null,null,null,null,null,"Sipoo",136.12]
[null,null,null,null,null,null,"Siuntio",144.62]
[null,null,null,null,null,null,"Sodankylä",12.97]
[null,null,null,null,null,null,"Soini",75.150000000000006]
[null,null,null,null,null,null,"Somero",166.85]
[null,null,null,null,null,null,"Sonkajärvi",86.34]
[null,null,null,null,null,null,"Sotkamo",51.56]
[null,null,null,null,null,null,"Sottunga",17.93]
[null,null,null,null,null,null,"Sulkava",174.78]
[null,null,null,null,null,null,"Sund",36.32]
[null,null,null,null,null,null,"Suomussalmi",30.49]
[null,null,null,null,null,null,"Suonenjoki",151.62]
[null,null,null,null,null,null,"Sysmä",183.07]
[null,null,null,null,null,null,"Säkylä",130.06]
[null,null,null,null,null,null,"Taipalsaari",147.13]
[null,null,null,null,null,null,"Taivalkoski",25.89]
[null,null,null,null,null,null,"Taivassalo",86.88]
[null,null,null,null,null,null,"Tammela",173.13]
[null,null,null,null,null,null,"Tampere",153.43]
[null,null,null,null,null,null,"Tervo",158.33000000000001]
[null,null,null,null,null,null,"Tervola",30.17]
[null,null,null,null,null,null,"Teuva",79.5]
[null,null,null,null,null,null,"Tohmajärvi",134.55000000000001]
[null,null,null,null,null,null,"Toholampi",66.53]
[null,null,null,null,null,null,"Toivakka",161]
[null,null,null,null,null,null,"Tornio",32.04]
[null,null,null,null,null,null,"Turku",104.14]
[null,null,null,null,null,null,"Tuusniemi",141.71]
[null,null,null,null,null,null,"Tuusula",189.4]
[null,null,null,null,null,null,"Tyrnävä",32.270000000000003]
[null,null,null,null,null,null,"Ulvila",137.59]
[null,null,null,null,null,null,"Urjala",173.88]
[null,null,null,null,null,null,"Utajärvi",36.840000000000003]
[null,null,null,null,null,null,"Utsjoki",0]
[null,null,null,null,null,null,"Uurainen",148.44]
[null,null,null,null,null,null,"Uusikaarlepyy",74.599999999999994]
[null,null,null,null,null,null,"Uusikaupunki",97.61]
[null,null,null,null,null,null,"Vaala",39.159999999999997]
[null,null,null,null,null,null,"Vaasa",69.77]
[null,null,null,null,null,null,"Valkeakoski",173.98]
[null,null,null,null,null,null,"Vantaa",130.96]
[null,null,null,null,null,null,"Varkaus",172.52]
[null,null,null,null,null,null,"Vehmaa",105.96]
[null,null,null,null,null,null,"Vesanto",137.65]
[null,null,null,null,null,null,"Vesilahti",162.46]
[null,null,null,null,null,null,"Veteli",68.56]
[null,null,null,null,null,null,"Vieremä",82.12]
[null,null,null,null,null,null,"Vihti",163.02000000000001]
[null,null,null,null,null,null,"Viitasaari",126.23]
[null,null,null,null,null,null,"Vimpeli",87.47]
[null,null,null,null,null,null,"Virolahti",136.26]
[null,null,null,null,null,null,"Virrat",110.31]
[null,null,null,null,null,null,"Vårdö",22.66]
[null,null,null,null,null,null,"Vöyri",70.5]
[null,null,null,null,null,null,"Ylitornio",30.11]
[null,null,null,null,null,null,"Ylivieska",66.5]
[null,null,null,null,null,null,"Ylöjärvi",116.81]
[null,null,null,null,null,null,"Ypäjä",175.09]
[null,null,null,null,null,null,"Ähtäri",97]
[null,null,null,null,null,">","Äänekoski",138.86000000000001]

{"sheet":"Metsätalouden Tulos","index":15,"n_rows":51,"n_cols":14,"rows_kept":51,"cut":false,"hidden":false,"merged":[[5,8,5,9],[35,8,37,14]]}
[]
[null,{"$f":"Etusivu!C10","v":"Matti Metsänen"}]
[null,{"$f":"Etusivu!C16","v":"123456-7"}]
[]
[null,"METSÄTALOUDEN TULOS"]
[null,"Pääomatulot",null,null,null,null,null,null,"Pääomatulon jako",null,"Osuus tulosta","Veron 30%","Vero 34%","Vero yht."]
["+","Puunmyyntitulot",{"$f":"'2C'!S26","v":15400},null,null,null,null,null,"Verovelvollinen",{"$f":"Etusivu!C26","v":1},{"$f":"D$18*Etusivu!C26","v":3597.07},{"$f":"IF(K7<30000.01,K7*C$20,(30000*C$20))","v":1079.1199999999999},{"$f":"IF(K7<30000.01,0,((K7-30000)*C$21))","v":0},{"$f":"SUM(L7:M7)","v":1079.1199999999999}]
["+","Tuloutetut varaukset",{"$f":"Varaukset!E17+Varaukset!J17","v":0},null,null,null,null,null,"Puoliso",{"$f":"Etusivu!C27","v":0},{"$f":"D$18*Etusivu!C27","v":0},{"$f":"IF(K8<30000.01,K8*C$20,(30000*C$20))","v":0},{"$f":"IF(K8<30000.01,0,((K8-30000)*C$21))","v":0},{"$f":"SUM(L8:M8)","v":0}]
["+","Metsätalouden muut tulot, tuet ja korvaukset",{"$f":"'2C'!S32+'2C'!S35+'2C'!L41","v":400},null,null,null,null,null,null,null,"Yhteensä",{"$f":"SUM(L7:L8)","v":1079.1199999999999},{"$f":"SUM(M7:M8)","v":0},{"$f":"SUM(L9:M9)","v":1079.1199999999999}]
[null,"Menot",null,null,null,null,null,null,"Verotysyhtymä tulojen ja verojen jakautuminen"]
["-","Vuosimenot",{"$f":"'2C'!S44","v":818.11},null,null,null,null,null,"Osakkaat",null,"Osuus tulosta","Vero 30%","Vero 34%","Vero yht."]
[" -","Hankintatyön kustannukset",{"$f":"'2C'!S29","v":0},null,null,null,null,null,{"$f":"Etusivu!F24","v":0},{"$f":"Etusivu!G24/100","v":0},{"$f":"D$18*(Etusivu!G24/100)","v":0},{"$f":"IF(K12<30000.01,K12*C$20,(30000*C$20))","v":0},{"$f":"IF(K12<30000.01,0,((K12-30000)*C$21))","v":0},{"$f":"SUM(L12:M12)","v":0}]
["-","Menovaraukset ja metsävähennys",{"$f":"'2C'!S38","v":10428},null,null,null,null,null,{"$f":"Etusivu!F25","v":0},{"$f":"Etusivu!G25/100","v":0},{"$f":"D$18*(Etusivu!G25/100)","v":0},0,0,0]
["-","Poistot",{"$f":"'2C'!S50","v":767.5},null,null,null,null,null,{"$f":"Etusivu!F26","v":0},{"$f":"Etusivu!G26/100","v":0},{"$f":"D$18*(Etusivu!G26/100)","v":0},0,0,0]
["-","Yrittäjävähennys (5 % positiivisestä tuloksesta)",{"$f":"-IF(D15>0,D15*0.05,0)","v":-189.32},{"$f":"C7+C8+C9-C11-C13-C14","v":3786.39},null,null,null,null,{"$f":"Etusivu!F27","v":0},{"$f":"Etusivu!G27/100","v":0},{"$f":"D$18*(Etusivu!G27/100)","v":0},0,0,0]
["-","Metsälahjavähennys",{"$f":"Metsälahja!S12","v":0},{"$f":"C7+C8+C9-C11-C13-C14+C15","v":3597.07},null,null,null,null,{"$f":"Etusivu!F28","v":0},{"$f":"Etusivu!G28/100","v":0},{"$f":"D$18*(Etusivu!G28/100)","v":0},0,0,0]
[null,null,null,null,null,null,null,null,{"$f":"Etusivu!F29","v":0},{"$f":"Etusivu!G29/100","v":0},{"$f":"D$18*(Etusivu!G29/100)","v":0},0,0,0]
["=","Tulos ennen veroja",null,{"$f":"C7+C8+C9-C11-C12-C13-C14+C15-C16","v":3597.07},{"$f":"IF(D18<0,\"  -\",\"  +\")","v":"  +"},null,null,null,{"$f":"Etusivu!F30","v":0},{"$f":"Etusivu!G30/100","v":0},{"$f":"D$18*(Etusivu!G30/100)","v":0},0,0,{"$f":"SUM(L18:M18)","v":0}]
[]
[null,"Pääomavero-% (alle 30 000 euron tulosta)",0.3,{"$f":"IF(L21>0,L21,L9)","v":1079.1199999999999},null,null,null,null,{"$f":"Etusivu!F31","v":0},null,"Yhteensä",{"$f":"SUM(L12:L18)","v":0},{"$f":"SUM(M12:M18)","v":0},{"$f":"SUM(L20:M20)","v":0}]
[null,"Pääomavero-% (yli 30 000 euron tulosta)",0.34,{"$f":"IF(L21>0,M21,M9)","v":0},null,null,null,null,null,null,null,{"$f":"IF(Etusivu!$C25=\"Kyllä\",'Metsätalouden Tulos'!L20,0)","v":0},{"$f":"IF(Etusivu!$C25=\"Kyllä\",'Metsätalouden Tulos'!M20,0)","v":0},{"$f":"IF(Etusivu!$C25=\"Kyllä\",'Metsätalouden Tulos'!N20,0)","v":0}]
["-","Lopullinen vero",{"$f":"SUM(D20:D21)","v":1079.1199999999999}]
["=","Pääomatulot verojen jälkeen",null,{"$f":"D18-C22","v":2517.9499999999998},{"$f":"IF(D23<0,\"  -\",\"  +\")","v":"  +"}]
[]
[]
[" +","Metsätalouden verovapaa ansiotulo",{"$f":"SUM('Hank.työ 1'!J18:N18)-SUM('Hank.työ 1'!J19:N19)+SUM('Hank.työ 2'!J18:N18)-SUM('Hank.työ 2'!J19:N19)","v":0}]
[" +","Metsätalouden verollinen ansiotulo",{"$f":"SUM('Hank.työ 1'!J19:N19)+SUM('Hank.työ 2'!J19:N19)","v":0}]
[null,"Ansiotulojen vero %"]
[" -","Verot metsätalouden ansiotöistä",{"$f":"C27*C28","v":0}]
[" =","Ansiotulot verojen jälkeen",null,{"$f":"C27+C26-C29","v":0}]
[]
[" =","Tulos ansiotöiden kanssa, verojen jälkeen",null,{"$f":"D23+D30","v":2517.9499999999998},{"$f":"IF(D32<0,\"  -\",\"  +\")","v":"  +"}]
[]
[null,"Maksetut ennakkoverot",{"$f":"Tulot!$N$9","v":2926}]
[null,"Ennakonpidätyksen palautus",{"$f":"IF(C34>C22,IF(C22<0,C34,C34-C22),0)","v":1846.88}]
[" +/-","Alijäämähyvitys (+) tai Lisävero (-)",null,{"$f":"C34-C22-C29-C35","v":0},{"$f":"IF(D36<0,\"  -\",\"  +\")","v":"  +"},null,null,null,{"$f":"IF(D36>1400,\"Maksimi alijäämähyvitys on 1400 euroa/osakas. (Kuolinpesä on yksi yksikkö.) Yli menevä osuus on tulonlähteen tappiota, jota voidaan käyttää seuraavien 10 vuoden aikana. Tulonlähteen tappiota voi vaatia siirrettäväksi puolisolle.\",\"\")","v":""}]
[]
[" +","Verovapaat tulot yhteensä",{"$f":"C26","v":0},{"$f":"IF(C38>0,\"  +\",\"  \")","v":"  "}]
[" +","Verovapaiden tulojen verohyöty",{"$f":"+(C26*C28)","v":0},{"$f":"IF(C39>0,\"  +\",\"  \")","v":"  "}]
[]
[" -","Maksettava arvonlisävero",{"$f":"IF(ALV!F12>0,ALV!F12,0)","v":3623.4},{"$f":"IF(C41>0,\"   -\",\"  \")","v":"   -"}]
[" +","Palautuva arvonlisävero",{"$f":"-IF(ALV!F12<0.01,ALV!F12,0)","v":0},{"$f":"IF(C42>0,\"  +\",\"  \")","v":"  "}]
[]
[]
[]
[]
[null,{"$f":"IF(C51>0,\"Maatalouden tulona ilmoitettavaa tuloa yhteensä, alv 0%\",\"\")","v":""},{"$f":"Tulot!V9","v":0}," +"]
[null,{"$f":"IF(C51>0,\"Maatalouden menona ilmoitettavaa menoa ynteensä, alv 0%\",\"\")","v":""},{"$f":"Menot!AB8","v":0}," -"]
[null,{"$f":"IF(C51>0,\"Maatalouden tulojen ja menojen sisältämä alv on mukana Metten laskemassa alv:ssä\",\"\")","v":""}]
[]
[null,null,{"$f":"C48+C47","v":0}]

{"sheet":"Omavero","index":16,"n_rows":131,"n_cols":12,"rows_kept":131,"cut":false,"hidden":false,"merged":[[20,8,21,8],[20,7,21,7],[5,1,5,2],[14,1,14,2],[51,1,51,2],[5,5,5,6],[6,5,6,6],[7,5,7,6],[8,5,8,6],[9,5,9,6],[12,5,12,6],[13,5,13,6],[14,5,14,6],[15,5,15,6],[18,5,18,6],[20,5,21,6]]}
[]
[null,{"$f":"CONCATENATE(Etusivu!C10,\" \",Etusivu!C11)","v":"Matti Metsänen "}]
[null,{"$f":"Etusivu!C16","v":"123456-7"},{"$f":"IF(I7=\"EI\",\"Käytät Metteä lisenssiehtojen vastaisesti. Osta lisenssi verovuodelle\",\"\")","v":""}]
[]
[null,"OMAVERO 2C",{"$f":"IF(C10=\"Verotusyhtymä\",\"Lomake ei täysin vastaa verotusyhtymän lomaketta\",\"\")","v":""},null,null,"OMAVERO ALV",null,{"$f":"IF(Etusivu!C22=\"EI\",\"Olet ilmoittanut etusivulla, että et ole alv-velvollinen. \nALV-ilmoitusta ei täytetä\",\"\")","v":""}]
[null,"1. TAUSTATIEDOT",null,null,null,"ILMOITUKSEN TIEDOT"]
[null,"Nimi",{"$f":"Etusivu!C10","v":"Matti Metsänen"},null,null,"Asiakas",null,{"$f":"CONCATENATE(Etusivu!C10,\", \",C9)","v":"Matti Metsänen, 123456-7"},{"$f":"IF(verovuosi>vuosi,\"EI\",\"\")","v":""}]
[null,"Puhelinnumero",{"$f":"Etusivu!C32","v":0},null,null,"Verovuosi",null,{"$f":"Etusivu!C8","v":2025}]
[null,"Y-tunnus",{"$f":"Etusivu!C16","v":"123456-7"},null,null,"Ei toimintaa",null,{"$f":"IF(ALV!D12+ALV!E12>0,\"Ei rastiteta\",\"Rastita kohta 'Ei toimintaa verokaudella'\")","v":"Ei rastiteta"}]
[null,"PUOLISOIDEN OSUUDET METSÄTALOUDESTA",{"$f":"IF(Etusivu!C25=\"Kyllä\",\"Verotusyhtymä\",\"\")","v":""},null,null,"Maksuperusteinen arvonlisävero",null,{"$f":"IF(Omavero!C50<500000,\"Kyllä\",\"Ei\")","v":"Kyllä"}]
[null,"Verovelvollinen",{"$f":"Etusivu!C26","v":1}]
[null,"Puoliso ",{"$f":"Etusivu!C27","v":0},null,null,"VERO KOTIMAAN MYYNNISTÄ"]
[null,"Oma erillinen ilmoitus",{"$f":"Etusivu!C12","v":"Ei"},null,null,"24 % ja 25,5 %:n vero",null,{"$f":"ALV!D12","v":3927}]
[null,null,null,null,null,"14 %:n vero"]
[null,"2. TULOT",null,null,null,"10 %:n vero"]
[null,"ILMOITAN TIETOJA TULOT-VAIHEESSA",{"$f":"IF(C50>0,\"Kyllä\",\"Ei\")","v":"Kyllä"}]
[]
[null,"PUUNMYYNTITULOT",{"$f":"IF(C22>0,\"Kyllä\",\"Ei\")","v":"Kyllä"},null,null,"VÄHENNETTÄVÄ VERO"]
[null,"Pystykaupat",{"$f":"'2C'!B26","v":15400},null,null,"Verokauden vähennettävä vero",null,{"$f":"ALV!E12","v":303.60000000000002}]
[null,"Hankintakaupat",{"$f":"'2C'!F26","v":0}]
[null,"Polttopuu- ja joulupuukaupat",{"$f":"'2C'!L26","v":0},null,null,"Maksettava tai palautukseen oikeuttava vero",null,{"$f":"H13-H19","v":3623.4},{"$f":"IF(H21>0,\"Maksettavaa alv:ia\",\"Palautuvaa alv:ia\")","v":"Maksettavaa alv:ia"}]
[null,"YHTEENSÄ",{"$f":"SUM(C19:C21)","v":15400}]
[]
[null,"KORVAUKSET JA TUET",{"$f":"IF(C28>0,\"Kyllä\",\"Ei\")","v":"Kyllä"},null,null,"METSÄTALOUTTA JA MAATALOUTTA HARJOITTAVALLA EI OLE OIKEUTTA ALARAJAHUOJENNUKSEEN"]
[null,"Vakuutuskorvaukset",{"$f":"'2C'!B32","v":0}]
[null,"Hirvivahinkokorvaukset",{"$f":"'2C'!F32","v":0},null,null,"OHJEITA"]
[null,"Metsätalouden tuet",{"$f":"'2C'!L32","v":400},null,null,"o Tämä lomake on tehty helpottamaan tietojen tallentamista omaveroon."]
[null,"YHTEENSÄ",{"$f":"SUM(C25:C27)","v":400}]
[]
[null,"OMASTA METSÄSTÄ OTETTU PUUTAVARA",{"$f":"IF(C34>0,\"Kyllä\",\"Ei\")","v":"Ei"}]
[null,"Maataloustoiminnan käyttö",{"$f":"'2C'!C35","v":0}]
[null,"Elinkeinotoiminnan käyttö",{"$f":"'2C'!F35","v":0}]
[null,"Yksityiskäyttö",{"$f":"'2C'!L35","v":0}]
[null,"YHTEENSÄ",{"$f":"SUM(C31:C33)","v":0}]
[]
[null,"VARAUSTEN TULOUTUS",{"$f":"IF(C38>0,\"Kyllä\",\"Ei\")","v":"Ei"}]
[null,"Varausten tuloutus",{"$f":"'2C'!C41+'2C'!F41","v":0}]
[null,"YHTEENSÄ",{"$f":"SUM(C37:C37)","v":0}]
[]
[null,"MUUT PÄÄOMATULOIKSI LUETTAVAT ERÄT",{"$f":"IF(C42>0,\"Kyllä\",\"Ei\")","v":"Ei"}]
[null,"Muu pääomatuloksi luettava erä metsätaloudesta",{"$f":"'2C'!L41","v":0}]
[null,"YHTEENSÄ",{"$f":"SUM(C41:C41)","v":0}]
[]
[null,"Tuloina ilmoitettavat muun toiminnan menot, jotka sisältyvät metsätalouden mustiinpanoihin",{"$f":"IF(C48>0,\"Kyllä\",\"Ei\")","v":"Ei"}]
[null,"Maatalouden menot",{"$f":"'2C'!B56","v":0}]
[null,"Elinkeinotoiminnan menot",{"$f":"'2C'!F56","v":0}]
[null,"Yksityistalouden menot",{"$f":"'2C'!L56","v":0}]
[null,"YHTEENSÄ",{"$f":"SUM(C45:C47)","v":0}]
[]
[null,"TULOT YHTEENSÄ",{"$f":"C48+C42+C38+C34+C28+C22","v":15800}]
[]
[null,"3. MENOT"]
[null,"ILMOITAN TIETOJA MENOT JA VARAUKSET VAIHEESSA",{"$f":"IF('2C'!S38+'2C'!S44>0,\"Kyllä\",\"En\")","v":"Kyllä"}]
[]
[null,"VUOSIMENOT",{"$f":"IF(C59>0,\"Kyllä\",\"Ei\")","v":"Kyllä"}]
[null,"Palkkausmenot",{"$f":"'2C'!B44","v":0}]
[null,"Matkakulut",{"$f":"'2C'!F44","v":44.64}]
[null,"Muut vuosimenot",{"$f":"'2C'!L44","v":773.47}]
[null,"YHTEENSÄ",{"$f":"SUM(C56:C58)","v":818.11}]
[]
[null,"HANKINTATYÖ",{"$f":"IF(C64+C65>0,\"Kyllä\",\"Ei\")","v":"Ei"}]
[null,"Hankintatyön tekijä",{"$f":"Etusivu!C36","v":0},{"$f":"COUNTBLANK(Etusivu!C36:C43)","v":8},"Hankintatyön tekijä",{"$f":"Etusivu!C38","v":0},null,"Hankintatyön tekijä",{"$f":"Etusivu!C40","v":0},null,"Hankintatyön tekijä",{"$f":"Etusivu!C42","v":0}]
[null,"Henkilötunnus",{"$f":"Etusivu!C37","v":0},null,"Henkilötunnus",{"$f":"Etusivu!C39","v":0},null,"Henkilötunnus",{"$f":"Etusivu!C41","v":0},null,"Henkilötunnus",{"$f":"Etusivu!C43","v":0}]
[null,"Valmistettu määrä",{"$f":"'2C'!J72","v":0},null,"Valmistettu määrä",{"$f":"'2C'!M74","v":0},null,"Valmistettu määrä",{"$f":"'2C'!M76","v":0},null,"Valmistettu määrä",{"$f":"'2C'!M78","v":0}]
[null,"Kuljetettu määrä",{"$f":"'2C'!M72","v":0},null,"Kuljetettu määrä",{"$f":"'2C'!M74","v":0},null,"Kuljetettu määrä",{"$f":"'2C'!M76","v":0},null,"Kuljetettu määrä",{"$f":"'2C'!M78","v":0}]
[null,"Hankintatyön arvo",{"$f":"'2C'!O72","v":0},null,"Hankintatyön arvo",{"$f":"'2C'!O74","v":0},null,"Hankintatyön arvo",{"$f":"'2C'!O76","v":0},null,"Hankintatyön arvo",{"$f":"'2C'!O78","v":0}]
[null,"Veronalainen arvo",{"$f":"'2C'!S72","v":0},null,"Veronalainen arvo",{"$f":"'2C'!S74","v":0},null,"Veronalainen arvo",{"$f":"'2C'!S76","v":0},null,"Veronalainen arvo",{"$f":"'2C'!S78","v":0}]
[null,"YHTEENSÄ",{"$f":"'2C'!O80","v":0}]
[]
[null,"METSÄVÄHENNYS",{"$f":"IF(C72>0,\"Kyllä\",\"Ei\")","v":"Kyllä"}]
[null,"Metsävähennyksen seuranta"]
[null,"Metsävähennyspohja",{"$f":"'2C'!R86","v":27000}]
[null,"Aiemmin käytetty metsävähennys",{"$f":"'2C'!R87","v":6700}]
[null,"Luovutusvoittoihin lisätty metsävähennyksen määrä",{"$f":"'2C'!R88","v":0}]
[]
[null,"Käytettävissä olevan metsävähennyksen määrä",{"$f":"'2C'!R89","v":20300}]
[null,"Metsävähennyksen käyttö verovuonna"]
[null,"Metsätalouden veronalainen pääomatulo metsävä- hennykseen oikeuttavista metsistä verovuonna",{"$f":"'2C'!R90","v":15800}]
[null,"Verovuoden metsävähennys",{"$f":"'2C'!R91","v":9480}]
[null,"Käytetty metsävähennys yhteensä",{"$f":"'2C'!R92","v":16180}]
[null,"Verovuoden metsävähennys",{"$f":"C79","v":9480}]
[]
[null,"MENOVARAUKSET",{"$f":"IF(C90>0,\"Kyllä\",\"Ei\")","v":"Kyllä"}]
[null,{"$f":"CONCATENATE(\"Verovuosi \",Etusivu!C8-5,\" (entiset Oulun ja Lapin läänit)\")","v":"Verovuosi 2020 (entiset Oulun ja Lapin läänit)"},{"$f":"'2C'!F99","v":0}]
[null,{"$f":"CONCATENATE(\"Verovuosi \",Etusivu!C8-4,\" (entiset Oulun ja Lapin läänit)\")","v":"Verovuosi 2021 (entiset Oulun ja Lapin läänit)"},{"$f":"'2C'!F100","v":0}]
[null,{"$f":"CONCATENATE(\"Verovuosi \",Etusivu!C8-3)","v":"Verovuosi 2022"},{"$f":"'2C'!F101","v":0}]
[null,{"$f":"CONCATENATE(\"Verovuosi \",Etusivu!C8-2)","v":"Verovuosi 2023"},{"$f":"'2C'!F102","v":0}]
[null,{"$f":"CONCATENATE(\"Verovuosi \",Etusivu!C8-1)","v":"Verovuosi 2024"},{"$f":"'2C'!F103","v":0}]
[null,{"$f":"CONCATENATE(\"Verovuosi \",Etusivu!C8)","v":"Verovuosi 2025"},{"$f":"'2C'!F104","v":948}]
[null,"YHTEENSÄ",{"$f":"SUM(C84:C89)","v":948}]
[]
[null,"TUHOVARAUKSET",{"$f":"IF(C99>0,\"Kyllä\",\"Ei\")","v":"Ei"}]
[null,{"$f":"CONCATENATE(\"Verovuosi \",Etusivu!C8-5,\" (entiset Oulun ja Lapin läänit)\")","v":"Verovuosi 2020 (entiset Oulun ja Lapin läänit)"},{"$f":"'2C'!J99","v":0}]
[null,{"$f":"CONCATENATE(\"Verovuosi \",Etusivu!C8-4,\" (entiset Oulun ja Lapin läänit)\")","v":"Verovuosi 2021 (entiset Oulun ja Lapin läänit)"},{"$f":"'2C'!J100","v":0}]
[null,{"$f":"CONCATENATE(\"Verovuosi \",Etusivu!C8-3)","v":"Verovuosi 2022"},{"$f":"'2C'!J101","v":0}]
[null,{"$f":"CONCATENATE(\"Verovuosi \",Etusivu!C8-2)","v":"Verovuosi 2023"},{"$f":"'2C'!J102","v":0}]
[null,{"$f":"CONCATENATE(\"Verovuosi \",Etusivu!C8-1)","v":"Verovuosi 2024"},{"$f":"'2C'!J103","v":0}]
[null,{"$f":"CONCATENATE(\"Verovuosi \",Etusivu!C8)","v":"Verovuosi 2025"},{"$f":"'2C'!J104","v":0}]
[null,"YHTEENSÄ",{"$f":"SUM(C93:C98)","v":0}]
[]
[null,"POISTOT",{"$f":"IF(C108+C116+C124>0,\"Kyllä\",\"Ei\")","v":"Kyllä"}]
[null,"POISTOT KONEISTA JA LAITTEISTA",{"$f":"IF(C107>0,\"Avaa erittely\",\"\")","v":"Avaa erittely"}]
[null,{"$f":"CONCATENATE(\"Menojäännös 1.1.\",Etusivu!C8)","v":"Menojäännös 1.1.2025"},{"$f":"'2C'!E47","v":750}]
[null,"Lisäykset verovuonna",{"$f":"'2C'!E48","v":717.13}]
[null,"Luovutukset verovuonna",{"$f":"'2C'!E49","v":0}]
[null,"Suurin mahdollinen poisto 25 %",{"$f":"IF((C103+C104-C105)<600.01,C103+C104-C105,(C103+C104-C105)*0.25)","v":366.78},null,{"$f":"IF(C107>C106,\"Huom! Poisto voi olla tätä suurempi, jos yksittäisistä poistoeristä joku poistetaan kerralla. Hyväksy silloin omaverossa suurempi luku.\",\"\")","v":""}]
[null,"Poistot",{"$f":"'2C'!E50","v":287.5}]
[null,{"$f":"CONCATENATE(\"MENOJÄÄNNÖS 31.12.\",Etusivu!C8)","v":"MENOJÄÄNNÖS 31.12.2025"},{"$f":"'2C'!E51","v":1179.6300000000001}]
[]
[null,"POISTOT RANENNUKSISTA",{"$f":"IF(C115>0,\"Avaa erittely\",\"\")","v":""}]
[null,{"$f":"CONCATENATE(\"Menojäännös 1.1.\",Etusivu!C8)","v":"Menojäännös 1.1.2025"},{"$f":"'2C'!H47","v":0}]
[null,"Lisäykset verovuonna",{"$f":"'2C'!H48","v":0}]
[null,"Luovutukset verovuonna",{"$f":"'2C'!H49","v":0}]
[null,"Suurin mahdollinen poisto 10 %",{"$f":"IF((C111+C112-C113)<600.01,C111+C112-C113,(C111+C112-C113)*0.1)","v":0},null,{"$f":"IF(C115>C114,\"Huom! Poisto voi olla tätä suurempi, jos yksittäisistä poistoeristä joku poistetaan kerralla. Hyväksy silloin omaverossa suurempi luku.\",\"\")","v":""}]
[null,"Poistot",{"$f":"'2C'!H50","v":0}]
[null,{"$f":"CONCATENATE(\"MENOJÄÄNNÖS 31.12.\",Etusivu!C8)","v":"MENOJÄÄNNÖS 31.12.2025"},{"$f":"'2C'!H51","v":0}]
[]
[null,"POISTOT METSÄOJISTA JA -TEISTÄ",{"$f":"IF(C123>0,\"Avaa erittely\",\"\")","v":"Avaa erittely"}]
[null,{"$f":"CONCATENATE(\"Menojäännös 1.1.\",Etusivu!C8)","v":"Menojäännös 1.1.2025"},{"$f":"'2C'!M47","v":3200}]
[null,"Lisäykset verovuonna",{"$f":"'2C'!M48","v":0}]
[null,"Luovutukset verovuonna",{"$f":"'2C'!M49","v":0}]
[null,"Suurin mahdollinen poisto 15 %",{"$f":"IF((C119+C120-C121)<600.01,C119+C120-C121,(C119+C120-C121)*0.15)","v":480},null,{"$f":"IF(C123>C122,\"Huom! Poisto voi olla tätä suurempi, jos yksittäisistä poistoeristä joku poistetaan kerralla. Hyväksy silloin omaverossa suurempi luku.\",\"\")","v":""}]
[null,"Poistot",{"$f":"'2C'!M50","v":480}]
[null,{"$f":"CONCATENATE(\"MENOJÄÄNNÖS 31.12.\",Etusivu!C8)","v":"MENOJÄÄNNÖS 31.12.2025"},{"$f":"'2C'!M51","v":2720}]
[]
[null,"TOISESTA TULOLÄHTEESTÄ SIIRRETTÄVÄT MENOT"]
[null,"Nämä tiedot eivät tule suoraan Mettestä. \nLisää tarvittaessa"]
[]
[null,"MENOT YHTEENSÄ",{"$f":"C127+C123+C115+C107+C98+C89+C81+C66+C59","v":12013.61}]
[]
[null,"METSÄTALOUDEN PUHDAS PÄÄOMATULO",{"$f":"C50-C129","v":3786.39}]

{"sheet":"2C","index":17,"n_rows":114,"n_cols":47,"rows_kept":114,"cut":false,"hidden":false,"merged":[[98,31,98,32],[98,35,98,40],[98,41,98,46],[99,31,99,32],[99,35,99,40],[99,41,99,46],[110,27,110,30],[111,27,111,30],[100,31,100,32],[100,35,100,40],[101,31,101,32],[101,35,101,40],[102,31,102,32],[102,35,102,40],[103,31,103,32],[103,35,103,40],[104,27,104,46],[83,42,83,46],[85,43,85,46],[86,43,86,46],[87,43,87,46],[88,43,88,46],[89,43,89,46],[90,43,90,46],[93,27,93,46],[96,30,96,33],[96,34,96,40],[91,43,91,46],[73,44,74,46],[77,27,78,31],[77,32,78,34],[77,35,78,37],[77,38,78,39],[77,40,78,43],[79,40,79,43],[79,44,79,45],[75,27,76,31],[75,32,76,34],[75,35,76,37],[75,38,76,39],[75,40,76,43],[75,44,76,46],[77,44,78,46],[73,27,74,31],[73,32,74,34],[73,35,74,37],[73,38,74,39],[73,40,74,43],[71,35,72,37],[71,38,72,39],[56,43,56,44],[57,44,57,46],[58,43,58,44],[59,27,59,42],[59,44,59,46],[66,27,66,31],[69,27,70,31],[69,32,70,34],[69,35,70,37],[69,38,70,39],[69,40,69,43],[69,44,69,46],[70,40,70,41],[70,44,70,45],[70,42,70,43],[71,44,72,46],[71,40,72,43],[71,27,72,31],[71,32,72,34],[51,43,51,44],[52,44,52,46],[53,43,53,44],[54,27,54,30],[54,31,54,36],[54,37,54,42],[54,44,55,46],[55,27,55,30],[55,31,55,36],[55,37,55,42],[48,30,48,32],[48,33,48,37],[48,38,48,42],[49,30,49,32],[49,33,49,37],[49,38,49,42],[49,44,49,46],[50,27,50,29],[50,30,50,32],[50,33,50,37],[50,38,50,42],[43,37,43,42],[43,44,43,46],[45,30,45,31],[45,33,45,37],[45,38,45,42],[46,30,46,32],[46,33,46,37],[46,38,46,42],[47,30,47,32],[47,33,47,37],[47,38,47,42],[37,44,37,46],[39,27,39,30],[39,31,39,36],[39,37,39,42],[40,31,40,36],[40,37,40,42],[40,44,40,46],[42,27,42,30],[42,31,42,36],[42,37,42,42],[31,44,31,46],[32,43,32,44],[33,27,33,30],[33,31,33,36],[33,37,33,42],[34,28,34,30],[34,31,34,36],[34,37,34,42],[34,44,34,46],[25,44,25,46],[26,44,27,46],[27,31,27,36],[27,37,27,42],[28,31,28,36],[28,37,28,42],[28,44,28,46],[30,27,30,30],[30,31,30,36],[30,37,30,42],[14,40,14,46],[18,38,18,46],[19,46,20,46],[20,38,20,40],[20,41,20,44],[22,43,22,45],[23,43,23,44],[24,27,24,30],[24,31,24,36],[24,37,24,42],[102,9,102,14],[103,9,103,14],[100,5,100,6],[101,5,101,6],[102,5,102,6],[103,5,103,6],[98,9,98,14],[99,9,99,14],[0,27,0,37],[5,27,5,36],[25,27,25,30],[25,31,25,36],[25,37,25,42],[31,27,31,30],[31,31,31,36],[31,37,31,42],[36,27,36,30],[36,31,36,36],[36,37,36,42],[37,27,37,30],[37,31,37,36],[37,37,37,42],[43,27,43,30],[43,31,43,36],[93,1,93,20],[111,1,111,4],[75,6,76,8],[87,17,87,20],[75,1,76,5],[86,17,86,20],[77,9,78,11],[79,18,79,19],[69,6,70,8],[71,14,72,17],[71,1,72,5],[69,12,70,13],[110,1,110,4],[77,1,78,5],[77,6,78,8],[104,1,104,20],[96,4,96,7],[96,8,96,14],[98,15,98,20],[99,15,99,20],[98,5,98,6],[99,5,99,6],[100,9,100,14],[101,9,101,14],[88,17,88,20],[89,17,89,20],[90,17,90,20],[91,17,91,20],[77,12,78,13],[85,17,85,20],[75,12,76,13],[75,9,76,11],[75,18,76,20],[77,18,78,20],[77,14,78,17],[83,16,83,20],[66,1,66,5],[70,18,70,19],[57,18,57,20],[56,17,56,18],[55,5,55,10],[55,1,55,4],[73,9,74,11],[73,12,74,13],[79,14,79,17],[75,14,76,17],[73,14,74,17],[73,1,74,5],[69,14,69,17],[54,1,54,4],[50,12,50,16],[45,12,45,16],[52,18,52,20],[43,1,43,4],[50,1,50,3],[45,7,45,11],[49,7,49,11],[54,5,54,10],[51,17,51,18],[46,7,46,11],[46,4,46,6],[47,4,47,6],[49,4,49,6],[49,18,49,20],[43,18,43,20],[14,14,14,20],[0,1,0,11],[5,1,5,10],[24,1,24,4],[24,5,24,10],[24,11,24,16],[18,19,20,20],[43,5,43,10],[48,12,48,16],[30,11,30,16],[31,18,31,20],[23,17,23,18],[22,17,22,19],[25,1,25,4],[28,11,28,16],[34,11,34,16],[36,11,36,16],[28,5,28,10],[33,1,33,4],[30,1,30,4],[30,5,30,10],[36,1,36,4],[31,5,31,10],[25,18,25,20],[28,18,28,20],[27,5,27,10],[27,11,27,16],[25,5,25,10],[25,11,25,16],[26,18,27,20],[39,11,39,16],[31,11,31,16],[54,11,54,16],[48,7,48,11],[34,5,34,10],[37,18,37,20],[45,4,45,5],[50,7,50,11],[33,11,33,16],[34,2,34,4],[42,11,42,16],[32,17,32,18],[34,18,34,20],[47,12,47,16],[46,12,46,16],[40,11,40,16],[48,4,48,6],[50,4,50,6],[52,22,53,22],[73,6,74,8],[40,5,40,10],[33,5,33,10],[36,5,36,10],[37,5,37,10],[47,7,47,11],[69,9,70,11],[71,6,72,8],[71,18,72,20],[73,18,74,20],[59,18,59,20],[70,16,70,17],[70,14,70,15],[69,18,69,20],[40,18,40,20],[54,18,55,20],[49,12,49,16],[59,1,59,16],[69,1,70,5],[71,9,72,11],[71,12,72,13],[58,17,58,18],[55,11,55,16],[42,1,42,4],[42,5,42,10],[53,17,53,18],[31,1,31,4],[39,1,39,4],[39,5,39,10],[37,1,37,4],[37,11,37,16],[43,11,43,16]]}
[]
[]
[]
[]
[null,null,null,null,null,null,null,null,null,null,null,null,null,null,"2C METSÄTALOUDEN "]
[null,null,null,null,null,null,null,null,null,null,null,null,null,null,"VEROILMOITUS",null,null,null,null,{"$f":"Etusivu!C8","v":2025}]
[null,"Verohallinto",null,null,null,null,null,null,null,null,null,null,null,null,"Kaikki maatilat yhteensä"]
[null,"PL 700",null,null,null,null,null,null,null,null,null,null,null,null,"Metsätalouden veroilmoitusta ei tarvitse antaa,"]
[null,"00052 VERO",null,null,null,null,null,null,null,null,null,null,null,null,{"$f":"CONCATENATE(\"jos vuonna \",Etusivu!C8,\" ei ole ollut lainkaan metsä-\")","v":"jos vuonna 2025 ei ole ollut lainkaan metsä-"}]
[null,null,null,null,null,null,null,null,null,null,null,null,null,null,"talouden harjoittamiseen liittyviä tuloja, vähen-"]
[null,null,null,null,null,null,null,null,null,null,null,null,null,null,"nettäviä menoja eikä metsävähennyksestä ja "]
[null,null,null,null,null,null,null,null,null,null,null,null,null,null,"varauksista ilmoitettavia seurantatietoja."]
[null,"HUOM! Älä lähetä tätä lomaketta verottajalle. "]
[null,"Käytä sähköistä ilmoittamista tai kopioi tiedot alkuperäiselle lomakkeelle."]
[]
[]
[]
[]
[null," Nimi",null,null,null,null,null,null,null,null,null," Y-tunnus tai henkilötunnus",null,null,null,null,null,null,null,"Oma erillinen ilmotitus \n(puolisoiden yhteisestä \nmetsätaloudesta \nannetaan eri ilmoitus)"]
[]
[null,{"$f":"Etusivu!C10","v":"Matti Metsänen"},null,null,null,null,null,null,null,null,null,null,{"$f":"Etusivu!C16","v":"123456-7"},null,null,null,null,{"$f":"IF(Etusivu!C12=\"Kyllä\",\"X\",\"\")","v":""}]
[]
[null,"I  Laskelma metsätalouden pääomatulosta",null,null,null,null,null,null,null,null,null,null,null,null,null,null,null,"euro",null,null,"snt"]
[null,"1 Puun myyntitulot"]
[null,"1.1.Pystykaupat",null,null,null,"1.2 Hankintakaupat",null,null,null,null,null,"1.3 Poltto- ja joulukuusikaupat"]
[null,{"$f":"Tulot!G9","v":15400},null,null,null,{"$f":"Tulot!H9","v":0},null,null,null,null,null,{"$f":"Tulot!I9","v":0},null,null,null,null,null,"+",{"$f":"B26+F26+L26","v":15400}]
[null,"2 Hankintatyön arvo"]
[null,null,null,null,null,"2.1 Hankintakaupat",null,null,null,null,null,"2.2 Poltto- ja joulukuusikaupat",null,null,null,null,null,null,null,null,null,null,{"$f":"IF(F29>F26,\"Hankintatyön arvo ei saa olla hankintakauppatuloa suurempi. Tarkista hankintakaupan summat!\",0)","v":0}]
[null,null,null,null,null,{"$f":"SUM('Hank.työ 1'!J18:N18)+'Hank.työ 1'!X7","v":0},null,null,null,null,null,{"$f":"SUM('Hank.työ 2'!J18:N18)+'Hank.työ 2'!X7","v":0},null,null,null,null,null," - ",{"$f":"B29+F29+L29","v":0},null,null,null,{"$f":"IF(L29>L26,\"Hankintatyön arvo ei saa olla hankintakauppatuloa suurempi. Tarkista Poltto- ja joulupuiden summat!\",0)","v":0}]
[null,"3 Vakuutus- ja hirvivahinkokorvaukset, metsätalouden tuet"]
[null,"3.1 Vakuutuskorvaukset",null,null,null,"3.2 Hirvivahinkokorvaukset",null,null,null,null,null,"3.3 Metsätalouden tuet"]
[null,{"$f":"Tulot!O9","v":0},null,null,null,{"$f":"Tulot!P9","v":0},null,null,null,null,null,{"$f":"Tulot!Q9","v":400},null,null,null,null,null,"+",{"$f":"L32+F32+B32","v":400}]
[null,"4 Omasta metsästä otettu puutavara"]
[null,"4.1 Maataloustoiminnan käyttö",null,null,null,"4.2 Elinkeinotoiminnan käyttö",null,null,null,null,null,"4.3 Yksityiskäyttö"]
[null,null,{"$f":"'Oma käyttö'!F9+'Oma käyttö'!I9","v":0},null,null,{"$f":"'Oma käyttö'!G9+'Oma käyttö'!J9","v":0},null,null,null,null,null,{"$f":"'Oma käyttö'!H9+'Oma käyttö'!K9","v":0},null,null,null,null,null,"+",{"$f":"L35+F35+C35","v":0}]
[null,"5 Metsävähennys ja varaukset"]
[null,"5.1 Metsävähennys",null,null,null,"5.2 Menovaraus",null,null,null,null,null,"5.3 Tuhovaraus"]
[null,{"$f":"Vähennys!C37","v":9480},null,null,null,{"$f":"Varaukset!E26","v":948},null,null,null,null,null,{"$f":"Varaukset!H26","v":0},null,null,null,null,null," -",{"$f":"L38+F38+B38","v":10428}]
[null,"6 Muut pääomatuloksi luettavat erät"]
[null,null,null,null,null,"6.1 Varausten tuloutus",null,null,null,null,null,"6.2 Muut"]
[null,null,null,null,null,{"$f":"Varaukset!E17+Varaukset!J17","v":0},null,null,null,null,null,{"$f":"Tulot!R9","v":0},null,null,null,null,null,"+",{"$f":"B41+L41+F41","v":0}]
[null,"7 Vuosimenot"]
[null,"7.1 Palkkausmenot",null,null,null,"7.2 Matkakulut",null,null,null,null,null,"7.3 Muut vuosimenot"]
[null,{"$f":"Menot!L8","v":0},null,null,null,{"$f":"Menot!M8","v":44.64},null,null,null,null,null,{"$f":"Menot!N8 +Menot!O8","v":773.47},null,null,null,null,null," -",{"$f":"L44+F44+B44","v":818.11}]
[null,"8 Metsätalouden poistot"]
[null,null,null,null,"Koneet ja kalusto",null,null,"Rakennukset",null,null,null,null,"Ojat ja tiet"]
[null,{"$f":"CONCATENATE(\"8.1 Menojäännös 1.1.\",Etusivu!C8)","v":"8.1 Menojäännös 1.1.2025"},null,null,{"$f":"Poistot!E8","v":750},null,null,{"$f":"Poistot!E70","v":0},null,null,null,null,{"$f":"Poistot!E77","v":3200}]
[null,"8.2 Lisäykset verovuonna",null,null,{"$f":"Poistot!F8","v":717.13},null,null,{"$f":"Poistot!F70","v":0},null,null,null,null,{"$f":"Poistot!F77","v":0}]
[null,"8.3 Luovutukset verovuonna",null,null,{"$f":"Poistot!G8","v":0},null,null,{"$f":"Poistot!G70","v":0},null,null,null,null,{"$f":"Poistot!G77","v":0}]
[null,"8.4 Poistot",null,null,{"$f":"Poistot!K8","v":287.5},null,null,{"$f":"Poistot!K70","v":0},null,null,null,null,{"$f":"Poistot!K77","v":480},null,null,null,null," -",{"$f":"SUM(E50:Q50)","v":767.5}]
[null,{"$f":"CONCATENATE(\"8.5 Menojäännös 31.12.\",Etusivu!C8)","v":"8.5 Menojäännös 31.12.2025"},null,null,{"$f":"Poistot!L8","v":1179.6300000000001},null,null,{"$f":"Poistot!L70","v":0},null,null,null,null,{"$f":"Poistot!L77","v":2720}]
[null,"9 Toisesta tulonlähteestä siirrettävät menot"]
[null,null,null,null,null,null,null,null,null,null,null,null,null,null,null,null,null,"-",0,null,null,null,"OHJE:"]
[null,"10 Metsätalouden muistiinpanoihin sisältyneet muun toiminnan menot"]
[null,"10.1 Maatalouden menot",null,null,null,"10.2 Elinkeinotoiminnan menot",null,null,null,null,null,"10.3 Yksityismenot",null,null,null,null,null,null,{"$f":"SUM(B56:Q56)","v":0}]
[null,{"$f":"Menot!AD8+Poistot!N8+Poistot!N70+Poistot!N77","v":0},null,null,null,{"$f":"Menot!AE8+Poistot!O8+Poistot!O70+Poistot!O77","v":0},null,null,null,null,null,{"$f":"Menot!AF8+Poistot!P8+Poistot!P70+Poistot!P77","v":0},null,null,null,null,null," +"]
[]
[null,"11. Metsätalouden puhdas pääomatulo",null,null,null,null,null,null,null,null,null,null,null,null,null,null,null," =",{"$f":"IF(S26-S29+S32+S35-S38+S41-S44-S50-S53+S55>=0,S26-S29+S32+S35-S38+S41-S44-S50-S53+S55,0)","v":3786.39}]
[]
[null,"12. Metsätalouden tappiollinen pääomatulo",null,null,null,null,null,null,null,null,null,null,null,null,null,null,null," =",{"$f":"IF(S26-S29+S32+S35-S38+S41-S44-S50-S53+S55<0,S26-S29+S32+S35-S38+S41-S44-S50-S53+S55,0)","v":0},null,null,null,null,null,null,null,null,"Tätä lisälomaketta käytetään vain jos hankintatyöntekijöitä on enemmän kuin 4"]
[]
[]
[]
[null,null,null,null,null,null,null,null,null,null,null,null,null,null,"2C METSÄTALOUDEN ",null,null,null,null,null,null,null,null,null,null,null,null,null,null,null,null,null,null,null,null,null,null,null,null,null,"2C METSÄTALOUDEN "]
[null,null,null,null,null,null,null,null,null,null,null,null,null,null,"VEROILMOITUS",null,null,null,null,null,null,null,null,null,null,null,null,null,null,null,null,null,null,null,null,null,null,null,null,null,"VEROILMOITUS"]
[null,null,null,null,null,null,null,null,null,null,null,null,null,null,"Kaikki maatilat yhteensä",null,null,null,null,null,null,null,null,null,null,null,null,null,null,null,null,null,null,null,null,null,null,null,null,null,"Kaikki maatilat yhteensä"]
[null,"Y-tunnus tai henkilötunnus",null,null,null,null,null,null,null,null,null,null,null,null,null,null,null,null,null,null,null,null,null,null,null,null,null,"Y-tunnus tai henkilötunnus"]
[null,{"$f":"Etusivu!C16","v":"123456-7"},null,null,null,null,null,null,null,null,null,null,null,null,null,null,null,null,null,null,null,null,null,null,null,null,null,{"$f":"B68","v":"123456-7"}]
[null,"II  Tehty hankintatyö",null,null,null,null,null,null,null,null,null,null,null,null,null,null,null,null,null,null,null,null,null,null,null,null,null,"II  Tehty hankintatyö"]
[null,"Hankintatyön tekijä",null,null,null,null,"Henkilötunnus",null,null,"Valmistettu\nmäärä\nm3",null,null,"Kuljetettu\nmäärä\nm3",null,"Hankintatyön arvo",null,null,null,"Hankintatyön\nveronalainen arvo 1)",null,null,null,null,null,null,null,null,"Hankintatyön tekijä",null,null,null,null,"Henkilötunnus",null,null,"Valmistettu\nmäärä\nm3",null,null,"Kuljetettu\nmäärä\nm3",null,"Hankintatyön arvo",null,null,null,"Hankintatyön\nveronalainen arvo 1)"]
[null,null,null,null,null,null,null,null,null,null,null,null,null,null,"euro",null,"snt",null,"euro",null,"snt",null,null,null,null,null,null,null,null,null,null,null,null,null,null,null,null,null,null,null,"euro",null,"snt",null,"euro",null,"snt"]
[null,{"$f":"Etusivu!C36","v":0},null,null,null,null,{"$f":"Etusivu!C37","v":0},null,null,{"$f":"SUM('Hank.työ 1'!J12:N12)+SUM('Hank.työ 2'!J12:N12)","v":0},null,null,{"$f":"SUM('Hank.työ 1'!J15:N15)+SUM('Hank.työ 2'!J15:N15)","v":0},null,{"$f":"SUM('Hank.työ 1'!J18:N18)+SUM('Hank.työ 2'!J18:N18)","v":0},null,null,null,{"$f":"SUM('Hank.työ 1'!J19:N19)+SUM('Hank.työ 2'!J19:N19)","v":0},null,null,null,null,null,null,null,null,null,null,null,null,null,null,null,null,null,null,null,null,null,{"$f":"SUM('Hank.työ 1'!AD18:AF18)+SUM('Hank.työ 2'!AD18:AF18)","v":0},null,null,null,{"$f":"SUM('Hank.työ 1'!AD19:AF19)+SUM('Hank.työ 2'!AD19:AF19)","v":0}]
[]
[null,{"$f":"Etusivu!C38","v":0},null,null,null,null,{"$f":"Etusivu!C39","v":0},null,null,null,null,null,null,null,0,null,null,null,null,null,null,null,null,null,null,null,null,null,null,null,null,null,null,null,null,null,null,null,null,null,0]
[]
[null,{"$f":"Etusivu!C40","v":0},null,null,null,null,{"$f":"Etusivu!C41","v":0}]
[]
[null,{"$f":"Etusivu!C42","v":0},null,null,null,null,{"$f":"Etusivu!C43","v":0}]
[]
[null,"13 Hankintatyön arvot yhteensä",null,null,null,null,null,null,null,null,null,null,null,null,{"$f":"SUM(O72:R79)","v":0},null,null,null," -----",null," ---",null,null,null,null,null,null,"13 Hankintatyön arvot yhteensä",null,null,null,null,null,null,null,null,null,null,null,null,{"$f":"SUM(AO72:AR79)","v":0},null,null,null," -----",null," ---"]
[null,"1) Katso laskentakaava täyttöohjeessa",null,null,null,null,null,null,null,null,null,null,null,null,null,null,null,null,null,null,null,null,null,null,null,null,null,"1) Katso laskentakaava täyttöohjeessa"]
[]
[null,"III  Metsävähennyksen seuranta   (vuonna 1993 ja sen jälkeen vastikkeellisesti hankitut metsät)",null,null,null,null,null,null,null,null,null,null,null,null,null,null,null,null,null,null,null,null,null,null,null,null,null,"III  Metsävähennyksen seuranta   (vuonna 1993 ja sen jälkeen vastikkeellisesti hankitut metsät)"]
[null,"Kaikki metsävähennyskiinteistöt yhteensä",null,null,null,null,null,null,null,null,null,null,null,null,null,null,null,null,null,null,null,null,null,null,null,null,null,"Kaikki metsävähennyskiinteistöt yhteensä"]
[null,null,null,null,null,null,null,null,null,null,null,null,null,null,null,null,null,null,null,"euro","snt",null,null,null,null,null,null,null,null,null,null,null,null,null,null,null,null,null,null,null,null,null,null,null,null,"euro","snt"]
[null,"14 Metsävähennyspohja. 2)",null,null,null,null,null,null,null,null,null,null,null,null,null,null,null,{"$f":"Vähennys!C32","v":27000},null,null,null,null,null,null,null,null,null,"14 Metsävähennyspohja. 2)"]
[null,"15 Aikaisemmin käytetty metsävähennys ",null,null,null,null,null,null,null,null,null,null,null,null,null,null,null,{"$f":"Vähennys!C33","v":6700},null,null,null,null,null,null,null,null,null,"15 Aikaisemmin käytetty metsävähennys "]
[null,"16 Luovutusvoittoihin lisättyjen metsävähennysten määrä",null,null,null,null,null,null,null,null,null,null,null,null,null,null,null,{"$f":"Vähennys!C34","v":0},null,null,null,null,null,null,null,null,null,"16 Luovutusvoittoihin lisättyjen metsävähennysten määrä"]
[null,"17 Käytettävissä olevan metsävähennyksen määrä = kohta 14 - (kohta 15 - kohta 16)",null,null,null,null,null,null,null,null,null,null,null,null,null,null,null,{"$f":"IF(R86-R87+R88>0,R86-R87+R88,0)","v":20300},null,null,null,null,null,null,null,null,null,"17 Käytettävissä olevan metsävähennyksen määrä = kohta 14 - (kohta 15 - kohta 16)"]
[null,"18 Metsätalouden veronalainen pääomatulo metsävähennykseen oikeuttavista metsistä verovuonna",null,null,null,null,null,null,null,null,null,null,null,null,null,null,null,{"$f":"Vähennys!C36","v":15800},null,null,null,null,null,null,null,null,null,"18 Metsätalouden veronalainen pääomatulo metsävähennykseen oikeuttavista metsistä verovuonna"]
[null,"19 Verovuoden metsävähennys 3)",null,null,null,null,null,null,null,null,null,null,null,null,null,null,null,{"$f":"Vähennys!C37","v":9480},null,null,null,null,null,null,null,null,null,"19 Verovuoden metsävähennys 3)"]
[null,"20 Käytetty metsävähennys yhteensä = kohta 15 + kohta 19",null,null,null,null,null,null,null,null,null,null,null,null,null,null,null,{"$f":"Vähennys!C38","v":16180},null,null,null,null,null,null,null,null,null,"20 Käytetty metsävähennys yhteensä = kohta 15 + kohta 19"]
[null,"2) Verovuoden lopussa omistettujen metsien metsävähennyspohja yhteensä, ks. Lisätiedot täyttöohjeessa",null,null,null,null,null,null,null,null,null,null,null,null,null,null,null,null,null,null,null,null,null,null,null,null,null,"2) Verovuoden lopussa omistettujen metsien metsävähennyspohja yhteensä, ks. Lisätiedot täyttöohjeessa"]
[null,"3) Metsävähennyksen määrä on enintään 60 % pääomatulosta, joka on saatu metsävähennykseen oikeuttavasta metsästä. Metsävähennyksen määrän on kuitenkin oltava vähintään 1 500 euroa ja korkeintaan kohdan 17 mukainen määrä. Siirretään lomakkeen kohtaan 5.1",null,null,null,null,null,null,null,null,null,null,null,null,null,null,null,null,null,null,null,null,null,null,null,null,null,"3) Metsävähennyksen määrä on enintään 60 % pääomatulosta, joka on saatu metsävähennykseen oikeuttavasta metsästä. Metsävähennyksen määrän on kuitenkin oltava vähintään 1 500 euroa ja korkeintaan kohdan 17 mukainen määrä. Siirretään lomakkeen kohtaan 5.1"]
[null,"IV Tulouttamattomat varaukset",null,null,null,null,null,null,null,null,null,null,null,null,null,null,null,null,null,null,null,null,null,null,null,null,null,"IV Tulouttamattomat varaukset"]
[null,"Kuutena edellisenä vuotena tehtyjen varausten jäljellä oleva määrä verovuoden lopussa",null,null,null,null,null,null,null,null,null,null,null,null,null,null,null,null,null,null,null,null,null,null,null,null,null,"Kuutena edellisenä vuotena tehtyjen varausten jäljellä oleva määrä verovuoden lopussa"]
[null,null,null,null,"21 Menovaraus",null,null,null,"22 Tuhovaraus",null,null,null,null,null,null,null,null,null,null,null,null,null,null,null,null,null,null,null,null,null,"21 Menovaraus",null,null,null,"22 Tuhovaraus"]
[null,null,null,null,null,"Euroa","snt",null,null,null,"Euroa",null,null,null,"snt",null,null,null,null,null,null,null,null,null,null,null,null,null,null,null,null,"Euroa","snt",null,null,null,"Euroa",null,null,null,"snt"]
[null,{"$f":"CONCATENATE(\"Verovuosi \",Etusivu!C8-5)","v":"Verovuosi 2020"},null,null,null,{"$f":"Varaukset!E21","v":0},null,null,null,{"$f":"Varaukset!J21","v":0},null,null,null,null,null,"(Entiset Oulun ja Lapin läänit)",null,null,null,null,null,null,null,null,null,null,null,{"$f":"CONCATENATE(\"Verovuosi \",Etusivu!C8-5)","v":"Verovuosi 2020"},null,null,null,null,null,null,null,null,null,null,null,null,null,"(Entiset Oulun ja Lapin läänit)"]
[null,{"$f":"CONCATENATE(\"Verovuosi \",Etusivu!C8-4)","v":"Verovuosi 2021"},null,null,null,{"$f":"Varaukset!E22","v":0},null,null,null,{"$f":"Varaukset!J22","v":0},null,null,null,null,null,"(Entiset Oulun ja Lapin läänit)",null,null,null,null,null,null,null,null,null,null,null,{"$f":"CONCATENATE(\"Verovuosi \",Etusivu!C8-4)","v":"Verovuosi 2021"},null,null,null,null,null,null,null,null,null,null,null,null,null,"(Entiset Oulun ja Lapin läänit)"]
[null,{"$f":"CONCATENATE(\"Verovuosi \",Etusivu!C8-3)","v":"Verovuosi 2022"},null,null,null,{"$f":"Varaukset!E23","v":0},null,null,null,{"$f":"Varaukset!J23","v":0},null,null,null,null,null,null,null,null,null,null,null,null,null,null,null,null,null,{"$f":"CONCATENATE(\"Verovuosi \",Etusivu!C8-3)","v":"Verovuosi 2022"}]
[null,{"$f":"CONCATENATE(\"Verovuosi \",Etusivu!C8-2)","v":"Verovuosi 2023"},null,null,null,{"$f":"Varaukset!E24","v":0},null,null,null,{"$f":"Varaukset!J24","v":0},null,null,null,null,null,null,null,null,null,null,null,null,null,null,null,null,null,{"$f":"CONCATENATE(\"Verovuosi \",Etusivu!C8-2)","v":"Verovuosi 2023"}]
[null,{"$f":"CONCATENATE(\"Verovuosi \",Etusivu!C8-1)","v":"Verovuosi 2024"},null,null,null,{"$f":"Varaukset!E25","v":0},null,null,null,{"$f":"Varaukset!J25","v":0},null,null,null,null,null,null,null,null,null,null,null,null,null,null,null,null,null,{"$f":"CONCATENATE(\"Verovuosi \",Etusivu!C8-1)","v":"Verovuosi 2024"}]
[null,{"$f":"CONCATENATE(\"Verovuosi \",Etusivu!C8)","v":"Verovuosi 2025"},null,null,null,{"$f":"Varaukset!E26","v":948},null,null,null,{"$f":"Varaukset!J26","v":0},null,null,null,null,null,null,null,null,null,null,null,null,null,null,null,null,null,{"$f":"CONCATENATE(\"Verovuosi \",Etusivu!C8)","v":"Verovuosi 2025"}]
[]
[null," Veroilmoitusta täydentäviä tietoja antaa",null,null,null,null,null,null,null,null,null,null,null,null,null,"Puhelinnumero",null,null,null,null,null,null,null,null,null,null,null," Veroilmoitusta täydentäviä tietoja antaa",null,null,null,null,null,null,null,null,null,null,null,null,null,"Puhelinnumero"]
[null,{"$f":"IF(Etusivu!C31=\"\",\"\",Etusivu!C31)","v":""},null,null,null,null,null,null,null,null,null,null,null,null,null,{"$f":"IF(Etusivu!C32=0,\"\",Etusivu!C32)","v":""},null,null,null,null,null,null,null,null,null,null,null,{"$f":"IF(Etusivu!C31=\"\",\"\",Etusivu!C31)","v":""},null,null,null,null,null,null,null,null,null,null,null,null,null,{"$f":"IF(Etusivu!C32=0,\"\",Etusivu!C32)","v":""}]
[]
[null,"Päiväys",null,null,null,"Allekirjoitus",null,null,null,null,null,null,null,null,null,null,null,null,null,null,null,null,null,null,null,null,null,"Päiväys",null,null,null,"Allekirjoitus"]
[]
[null,{"$f":"Etusivu!$C29","v":28022026},null,null,null,null,null,null,null,null,null,null,null,null,null,null,null,null,null,null,null,null,null,null,null,null,null,{"$f":"Etusivu!$C29","v":28022026}]
[]
[null,"Tiedot luetaann optisesti lomakkeen täyttökentistä.",null,null,null,null,null,null,null,null,null,null,null,null,null,null,null,null,null,null,null,null,null,null,null,null,null,"Tiedot luetaann optisesti lomakkeen täyttökentistä."]
[null,"HUOM! Älä lähetä tätä lomaketta verottajalle. Käytä sähköistä ilmoittamista tai kopioi tiedot alkuperäiselle lomakkeelle.",null,null,null,null,null,null,null,null,null,null,null,null,null,null,null,null,null,null,null,null,null,null,null,null,null,"HUOM! Älä lähetä tätä lomaketta verottajalle. Käytä sähköistä ilmoittamista tai kopioi tiedot alkuperäiselle lomakkeelle."]

{"sheet":"ALV","index":18,"n_rows":54,"n_cols":17,"rows_kept":54,"cut":false,"hidden":false,"merged":[[6,1,6,9],[11,2,12,2],[11,3,12,3],[11,4,12,4],[11,5,12,5],[11,6,12,6],[11,7,12,7],[11,8,12,8]]}
[]
[null,{"$f":"IF(Etusivu!C22=\"kyllä\",CONCATENATE(Etusivu!C10,\" \",Etusivu!C11),\"EI ALV-VELVOLLINEN\")","v":"Matti Metsänen "}]
[null,{"$f":"Etusivu!C16","v":"123456-7"}]
[]
[null,"ALV-ILMOITUKSEN KOOSTETIEDOT",null,null,null,null,null,null,null,null,null,null,"ALV-TIETOJEN SÄHKÖINEN ILMOITTAMINEN"]
[null,"ALV-ilmoituksen tiedot OmaVero -palvelua varten",null,null,null,null,null,null,null,null,null,null,"ALV-ilmoituksen siirtotiedosto www.ilmoitin.fi -palvelua varten"]
[null,"Käytä yhtä alla olevista koostetietoalueista"]
[null,null,"Alv-ilmoitus kerran vuodessa",null,null,null,null,null,null,null,null,null,"Tunnus","Tieto","tunnus-tietopari","Kommentit","Kuvaus"]
[null,null,"Kerran vuodessa alv-ilmoitusvelvolliset voivat käyttää arvionvaraiset välilehteä.",null,null,null,null,null,null,null,null,null,"000","VSRALVKV",{"$f":"IF(N9=0,\"\",CONCATENATE(M9,\":\",N9))","v":"000:VSRALVKV"},"Yksilöi verolomakkeen","VSRALVKV = kausiveroilmoituslomake"]
[null,null,null,null,null,null,null,null,null,null,null,null,198,null,"","lisää itse","Siirtotiedoston luontiaika muodossa PPKKVVVVHHMMSS"]
[null,null,null,"Vero kotimaan myynnistä \nalv 25,5 %","Kohdekauden vähennettävä vero","Maksettava vero / palautukseen oikeuttava vero (-)","viimeinen maksu- päivä","ilmoitettu","maksettu",null,null,null,"010",{"$f":"Etusivu!C16","v":"123456-7"},"010:123456-7",null,"Verovelvollisen henkilö- tai Y-tunnus"]
[null,null,{"$f":"CONCATENATE(\"Vuosi \",verovuosi)","v":"Vuosi 2025"},{"$f":"SUM(D20:D23)","v":3927},{"$f":"Menot!J8","v":303.60000000000002},{"$f":"D12-E12","v":3623.4},"2026-02-28",null,null,null,null,null,"014","1356307-2_FM","014:1356307-2_FM"," ","Ohjelmatoimittajan y-tynnus ja ohjelman koodi"]
[null,null,null,null,null,null,null,null,null,null,null,null,"048",{"$f":"versio","v":"Mette 25.10 Mette Järjestelmät Oy"},"048:Mette 25.10 Mette Järjestelmät Oy","Ohjelmaversio","Tieto lähettävästä ohjelmistosta"]
[null,null,null,null,null,null,null,null,null,null,null,null,"050",{"$f":"Etusivu!I20","v":"V"},"050:V","K Q tai V","Verokauden pituus (K=kuukausi, Q=4x/vuosi, V=vuosittain)"]
[null,null,null,null,null,null,null,null,null,null,null,null,"052",{"$f":"IF(Etusivu!I20=\"V\",0,IF(LARGE(ALV!H20:H23,1)>=1,LARGE(ALV!H20:H23,1),IF(LARGE(ALV!H29:H40,1)>=1,LARGE(ALV!H29:H40,1),0)))","v":0},"",null,"Verokausi"]
[null,null,"Kausiveroilmoitus 4 kertaa vuodessa",null,null,null,null,null,null,null,null,null,"053",{"$f":"verovuosi","v":2025},"053:2025",null,"Verokauden vuosi. Varmista, että ilmoitusvuosi on oikea."]
[null,null,"Älä käytä arvionvaraiset välilehteä, jos olet alv-kausiveroilmoitusvelvollinen 4 krt/v.",null,null,null,null,{"$f":"IF(Etusivu!C23=\"4 kertaa vuodessa\", \"KÄYTÄ NÄITÄ TIETOJA\", \" \")","v":" "},null,null,null,null,301,{"$f":"IF(Etusivu!I20=\"V\",D12,IF(Etusivu!I20=\"Q\",SUMIF(H20:H23,N15,D20:D23),IF(Etusivu!I20=\"K\",SUMIF(H29:H40,N15,D29:D40),5)))","v":3927},{"$f":"IF(N17=0,\"\",CONCATENATE(M17,\":\",TEXT(N17,\"0,00\")))","v":"301:3927,00"},null,"Suoritettava 25,5 %:n vero kotimaan myynnistä"]
[null,null,null,null,null,null,null,null,null,null,null,null,307,{"$f":"IF(Etusivu!I20=\"V\",E12,IF(Etusivu!I20=\"Q\",SUMIF(H20:H23,N15,E20:E23),IF(Etusivu!I20=\"K\",SUMIF(H29:H40,N15,E29:E40),5)))","v":303.60000000000002},"307:303,60",null,"Kohdekauden vähennettävä vero"]
[null,null,null,"Vero kotimaan myynnistä \nalv 24  tai 25,5 %","Kohdekauden vähennettävä vero","Maksettava vero / palautukseen oikeuttava vero (-)","viimeinen maksu- päivä","Viimeksi ilmoitettu kausi","maksettu",null,null,null,308,{"$f":"+N17-N18","v":3623.4},"308:3623,40",null,"Maksettava vero  / Palautukseen oikeuttava vero (-)"]
[null,1,"tammi-maaliskuu",{"$f":"SUM(D29:D31)","v":3927},{"$f":"SUM(E29:E31)","v":8.98},{"$f":"SUM(F29:F31)","v":3918.02},"2025-05-12",1,null,null,null,null,315,null,"","lisää itse","Alarajahuojennukseen oikeuttava liikevaihto"]
[null,2,"Huhti-kesäkuu",{"$f":"SUM(D32:D34)","v":0},{"$f":"SUM(E32:E34)","v":0},{"$f":"SUM(F32:F34)","v":0},"2025-08-12",0,null,null,null,null,316,null,"","lisää itse","Alarajahuojennukseen oikeuttava vero"]
[null,3,"Heinä-syyskuu",{"$f":"SUM(D35:D37)","v":0},{"$f":"SUM(E35:E37)","v":0},{"$f":"SUM(F35:F37)","v":0},"2025-11-12",0,null,null,null,null,317,null,"","lisää itse","Alarajahuojennuksen määrä"]
[null,4,"Loka-Joulukuu",{"$f":"SUM(D38:D40)","v":0},{"$f":"SUM(E38:E40)","v":294.62},{"$f":"SUM(F38:F40)","v":-294.62},"2026-02-12",0,null,null,null,null,336,null,{"$f":"IF(N23=0,\"\",CONCATENATE(M23,\":\",TEXT(N23,\"0\")))","v":""},"lisää itse","Alarajahuojennuksen hakuperuste/kausi. Sallitut arvo 1, 2, 3"]
[null,null,null,null,null,null,null,null,null,null,null,null,337,null,{"$f":"IF(N24=0,\"\",CONCATENATE(M24,\":\",TEXT(N24,\"0\")))","v":""},"lisää itse","Maksuperusteinen arvonlisävero =vuosiilmoitus. Sallittu arvo 1"]
[null,null,"Kausiveroilmoitus kuukausittain",null,null,null,null,null,null,null,null,null,"056",null,{"$f":"IF(N25=0,\"\",CONCATENATE(M25,\":\",N25))","v":""},"lisää itse 1 jos ei toimintaa","Ei toimintaa"]
[null,null,"Älä käytä arvionvaraiset välilehteä, jos olet alv-kausiveroilmoitusvelvollinen 12 krt/v",null,null,null,null,{"$f":"IF(Etusivu!C23=\"kuukausittain\", \"KÄYTÄ NÄITÄ TIETOJA\", \" \")","v":" "},null,null,null,null,"042",{"$f":"Etusivu!C32","v":0},{"$f":"IF(N26=0,\"\",CONCATENATE(M26,\":\",N26))","v":""},null,"Yhteyshenkilön puhelinnumero"]
[null,null,null,null,null,null,null,null,null,null,null,null,"999",1,{"$f":"IF(N27=0,\"\",CONCATENATE(M27,\":\",N27))","v":"999:1"},null,"Lomakkeen loppumerkki"]
[null,null,null,"Vero kotimaan myynnistä \nalv 24  tai 25,5 %","Kohdekauden vähennettävä vero","Maksettava vero / palautukseen oikeuttava vero (-)","viimeinen maksu- päivä","Viimeksi ilmoitettu kk","maksettu"]
[null,1,"Tammikuu",{"$f":"SUMIF(Tulot!D$11:D$165,B29,Tulot!M$11:M$165)+SUMIF(Luovutusv.!D$8:D$15,B29,Luovutusv.!I$8:I$15)","v":0},{"$f":"SUMIF(Menot!D$13:D$634,B29,Menot!J$13:J$634)","v":0},{"$f":"D29-E29","v":0},"2025-03-12",1]
[null,2,"Helmikuu",{"$f":"SUMIF(Tulot!D$11:D$165,B30,Tulot!M$11:M$165)+SUMIF(Luovutusv.!D$8:D$15,B30,Luovutusv.!I$8:I$15)","v":0},{"$f":"SUMIF(Menot!D$13:D$634,B30,Menot!J$13:J$634)","v":0},{"$f":"D30-E30","v":0},"2025-04-12",0]
[null,3,"Maaliskuu",{"$f":"SUMIF(Tulot!D$11:D$165,B31,Tulot!M$11:M$165)+SUMIF(Luovutusv.!D$8:D$15,B31,Luovutusv.!I$8:I$15)","v":3927},{"$f":"SUMIF(Menot!D$13:D$634,B31,Menot!J$13:J$634)","v":8.98},3918.02,"2025-05-12",0]
[null,4,"Huhtikuu",{"$f":"SUMIF(Tulot!D$11:D$165,B32,Tulot!M$11:M$165)+SUMIF(Luovutusv.!D$8:D$15,B32,Luovutusv.!I$8:I$15)","v":0},{"$f":"SUMIF(Menot!D$13:D$634,B32,Menot!J$13:J$634)","v":0},0,"2025-06-12",0]
[null,5,"Toukokuu",{"$f":"SUMIF(Tulot!D$11:D$165,B33,Tulot!M$11:M$165)+SUMIF(Luovutusv.!D$8:D$15,B33,Luovutusv.!I$8:I$15)","v":0},{"$f":"SUMIF(Menot!D$13:D$634,B33,Menot!J$13:J$634)","v":0},0,"2025-07-12",0]
[null,6,"Kesäkuu",{"$f":"SUMIF(Tulot!D$11:D$165,B34,Tulot!M$11:M$165)+SUMIF(Luovutusv.!D$8:D$15,B34,Luovutusv.!I$8:I$15)","v":0},{"$f":"SUMIF(Menot!D$13:D$634,B34,Menot!J$13:J$634)","v":0},0,"2025-08-12",0]
[null,7,"Heinäkuu",{"$f":"SUMIF(Tulot!D$11:D$165,B35,Tulot!M$11:M$165)+SUMIF(Luovutusv.!D$8:D$15,B35,Luovutusv.!I$8:I$15)","v":0},{"$f":"SUMIF(Menot!D$13:D$634,B35,Menot!J$13:J$634)","v":0},0,"2025-09-12",0]
[null,8,"Elokuu",{"$f":"SUMIF(Tulot!D$11:D$165,B36,Tulot!M$11:M$165)+SUMIF(Luovutusv.!D$8:D$15,B36,Luovutusv.!I$8:I$15)","v":0},{"$f":"SUMIF(Menot!D$13:D$634,B36,Menot!J$13:J$634)","v":0},0,"2025-10-12",0]
[null,9,"Syyskuu",{"$f":"SUMIF(Tulot!D$11:D$165,B37,Tulot!M$11:M$165)+SUMIF(Luovutusv.!D$8:D$15,B37,Luovutusv.!I$8:I$15)","v":0},{"$f":"SUMIF(Menot!D$13:D$634,B37,Menot!J$13:J$634)","v":0},0,"2025-11-12",0]
[null,10,"Lokakuu",{"$f":"SUMIF(Tulot!D$11:D$165,B38,Tulot!M$11:M$165)+SUMIF(Luovutusv.!D$8:D$15,B38,Luovutusv.!I$8:I$15)","v":0},{"$f":"SUMIF(Menot!D$13:D$634,B38,Menot!J$13:J$634)","v":111.75},-111.75,"2025-12-12",0]
[null,11,"Marraskuu",{"$f":"SUMIF(Tulot!D$11:D$165,B39,Tulot!M$11:M$165)+SUMIF(Luovutusv.!D$8:D$15,B39,Luovutusv.!I$8:I$15)","v":0},{"$f":"SUMIF(Menot!D$13:D$634,B39,Menot!J$13:J$634)","v":182.87},-182.87,"2026-01-12",0]
[null,12,"Joulukuu",{"$f":"SUMIF(Tulot!D$11:D$165,B40,Tulot!M$11:M$165)+SUMIF(Luovutusv.!D$8:D$15,B40,Luovutusv.!I$8:I$15)","v":0},{"$f":"SUMIF(Menot!D$13:D$634,B40,Menot!J$13:J$634)","v":0},0,"2026-02-12",0]
[]
[]
[null,"Lomake hakee alv-tulot lomakkeista \"Tulot\" ja \"Luovutusvoitot\""]
[null,"Lomake hakee alv-menot lomakkeista \"Menot\" ja \"Arvionvaraiset\" (Arvionvaraisista haetaan vain vuosi-ilmoitusosaan)"]
[]
[null,null,"Ilmoita tiedot verottajalle sähköisesti osoitteessa www.vero.fi/omavero"]
[null,null,"Jos tässä taulukossa ei näy alv-arvoja tarkista, että olet kirjannut tulo-, meno- ja arvionvaraisiin kirjauksiin kuukauden numeron."]
[null,null,"Tarkista lomakkeelle kerätyt tiedot sarakkeelta N. Lisää tarvittaessa puuttuva tieto tai korjaa virheellinen tieto. "]
[null,null,"Lopuksi luo siirtotiedosto painamalla  \"Luo siirtotiedosto\" nappia."]
[null,null,"Makro EI toimi Mac versioissa eikä OpenOffice Calcissa. (Solussa O4 ohje siirtotiedoston manuaaliseen tekemiseen.)"]
[]
[null,null,"Huom! Siirtotiedoston luova makro toimii vain Windows Excelissä"]
[]
[null,null,"Ohje"]

{"sheet":"Sähköinen ilmoittaminen","index":19,"n_rows":144,"n_cols":13,"rows_kept":144,"cut":false,"hidden":false,"merged":[[5,7,5,10]]}
[]
[null,{"$f":"IF(Etusivu!C22=\"kyllä\",CONCATENATE(Etusivu!C10,\" \",Etusivu!C11),\"EI ALV-VELVOLLINEN\")","v":"Matti Metsänen "}]
[null,{"$f":"Etusivu!C16","v":"123456-7"}]
[]
[null,"LOMAKKEEN 2C TIETOJEN SÄHKÖINEN ILMOITTAMINEN",null,null,null,null,null,null,null,null,null,null,"OHJEITA"]
[null,"Tunnus","Tieto","Kommentit","Kuvaus","tunnus-tietopari",null,"Älä muuta näitä alla olevien solujen kaavoja",null,null,null,null,"o Tällä lomakkeella luodaan 2C -lomakkeen tietojen siirtotiedosto www.ilmoitin.fi -palvelua varten"]
[null,"000","VSY02C25","Yksilöi verolomakkeen","VSY02C25 = metsätalouden veroilmoituslomake 2025",{"$f":"IF(C7=0,\"\",CONCATENATE(B7,\":\",C7))","v":"000:VSY02C25"},null,null,null,null,null,null,"o Tarkista lomakkeelle kerätyt tiedot sarakkeelta C. Lisää tarvittaessa puuttuva tieto tai korjaa virheellinen tieto. "]
[null,"198",null,{"$f":"H8","v":"2025-10-16T19:25:29.490"},"Lähetyspäivä ja -aika,  ilmoittaja täyttää, PPKKVVVVHHMMSS","",null,{"$f":"NOW()","v":"2025-10-16T19:25:29.490"},{"$f":"H8","v":"2025-10-16T19:25:29.490"},null,null,null,"o Siirtotiedoston luontiaika tulee kirjoittaa itse soluun C8. Solun oikealla puolella olevassa solussa on malli, millaisena aika tulee kirjoittaa."]
[null,"048",{"$f":"Etusivu!B4","v":"Mette 25.10 Mette Järjestelmät Oy"},null,"Tieto lähettävästä ohjelmistosta","048:Mette 25.10 Mette Järjestelmät Oy",null,null,null,null,null,null,"o Miksi käyttäjän on kirjoitettava aika itse? Verohallinnon järjestelmä vaatii ajan ilmoittamisen tietyssä muodossa, jota Excel ei osaa tehdä teksimuotoisena. Malli on tehty erikoismuotoiluna, jota ei voi käyttää tiedoston lähetyksessä."]
[null,"014","1356307-2_FM",null,"Ilmoituksen tuottaneen ohjelmiston yksilöivä tieto","014:1356307-2_FM",null,null,null,null,null,null,"o  Voit antaa siirtotiedostolle haluamasi nimen. Rajoitteita nimeämiselle ei ole"]
[null,"010",{"$f":"Etusivu!C16","v":"123456-7"},null,"Verovelvollisen henkilö- tai Y-tunnus","010:123456-7",null,null,null,null,null,null,"o Siirtotiedoston luova makro toimii vain Windows Excelissä"]
[null,"600",{"$f":"IF(COUNTBLANK('2C'!T21)=0,1,0)","v":0},null,"Oma erillinen ilmoitus (1=kyllä)","",null,null,null,null,null,null,"o Makro EI toimi Mac versioissa eikä OpenOffice Calcissa. "]
[null,603,{"$f":"'2C'!B26","v":15400},null,"Puun myyntitulot, pystykaupat",{"$f":"IF(C13=0,\"\",CONCATENATE(B13,\":\",K13))","v":"603:15400,00"},null,{"$f":"ROUNDDOWN(C13,0)","v":15400},{"$f":"(C13-H13)*100","v":0},null,{"$f":"CONCATENATE(H13,\",\",IF(I13=0,\"00\",IF(I13<10,CONCATENATE(\"0\",I13),I13)))","v":"15400,00"},null,"o  Solussa F6 ohje siirtotiedoston manuaaliseen tekemiseen"]
[null,604,{"$f":"'2C'!F26","v":0},null,"Puun myyntitulot, hankintakaupat","",null,0,0,null,"0,00"]
[null,613,{"$f":"'2C'!L26","v":0},null,"Puun myyntitulot, poltto- ja joulupuukaupat","",null,0,0,null,"0,00"]
[null,690,{"$f":"'2C'!S26","v":15400},null,"Puun myyntitulot yhteensä (603+604+613)","690:15400,00",null,15400,0,null,"15400,00"]
[null,"605",{"$f":"'2C'!F29","v":0},null,"Hankintatyön arvo, hankintakaupat","",null,0,0,null,"0,00"]
[null,625,{"$f":"'2C'!L29","v":0},null,"Hankintatyön arvo, poltto- ja joulupuukaupat","",null,0,0,null,"0,00",null,"Ohje sähköisen ilmoittamisen käyttöön"]
[null,691,{"$f":"'2C'!S29","v":0},null,"Hankintatyön arvo yhteensä (606+625)","",null,0,0,null,"0,00"]
[null,"607",{"$f":"'2C'!B32","v":0},null,"Vakuutuskorvaukset","",null,0,0,null,"0,00"]
[null,"608",{"$f":"'2C'!F32","v":0},null,"Hirvivahinkokorvaukset","",null,0,0,null,"0,00"]
[null,"609",{"$f":"'2C'!L32","v":400},null,"Metsätalouden tuet","609:400,00",null,400,0,null,"400,00"]
[null,"610",{"$f":"'2C'!S32","v":400},null,"Vakuutus- ja hirvivahinkokorvaukset, metsätalouden tuet yhteensä (607+608+609)","610:400,00",null,400,0,null,"400,00"]
[null,"OT2",null,null,"Otsikko","",null,0,0,null,"0,00"]
[null,"611",{"$f":"'2C'!C35","v":0},null,"Maataloustoiminnan käyttö","",null,0,0,null,"0,00"]
[null,"612",{"$f":"'2C'!F35","v":0},null,"Elinkeinotoiminnan käyttö","",null,0,0,null,"0,00"]
[null,"692",{"$f":"'2C'!L35","v":0},null,"Yksityiskäyttö","",null,0,0,null,"0,00"]
[null,"614",{"$f":"'2C'!S35","v":0},null,"Omasta metsästä otettu puutavara yhteensä (611+612+692)","",null,0,0,null,"0,00"]
[null,"615",{"$f":"'2C'!B38","v":9480},null,"Metsävähennys","615:9480,00",null,9480,0,null,"9480,00"]
[null,"616",{"$f":"'2C'!F38","v":948},null,"Menovaraus","616:948,00",null,{"$f":"ROUNDDOWN(C30,0)","v":948},{"$f":"(C30-H30)*100","v":0},null,"948,00"]
[null,"617",{"$f":"'2C'!L38","v":0},null,"Tuhovaraus","",null,{"$f":"ROUNDDOWN(C31,0)","v":0},{"$f":"(C31-H31)*100","v":0},null,"0,00"]
[null,"618",{"$f":"'2C'!S38","v":10428},null,"Metsävähennys ja varaukset yhteensä (615+616+617)","618:10428,00",null,10428,0,null,"10428,00"]
[null,"619",{"$f":"'2C'!F41","v":0},null,"Varausten tuloutus","",null,0,0,null,"0,00"]
[null,"620",{"$f":"'2C'!L41","v":0},null,"Muut pääomatuloksi luettavat erät","",null,0,0,null,"0,00"]
[null,651,{"$f":"'2C'!S41","v":0},null,"Muut pääomatuloksi luettavat erät yhteensä (619+620)","",null,0,0,null,"0,00"]
[null,"622",{"$f":"'2C'!B44","v":0},null,"Palkkausmenot","",null,0,0,null,"0,00"]
[null,"623",{"$f":"'2C'!F44","v":44.64},null,"Matkakulut","623:44,64",null,44,64,null,"44,64"]
[null,"624",{"$f":"'2C'!L44","v":773.47},null,"Muut vuosimenot","624:773,47",null,773,47,null,"773,47"]
[null,693,{"$f":"'2C'!S44","v":818.11},null,"Vuosimenot yhteensä (622+623+624)","693:818,11",null,818,11,null,"818,11"]
[null,660,{"$f":"'2C'!E47","v":750},null,"Menojäännös verovuoden alussa. Koneet ja kalusto","660:750,00",null,750,0,null,"750,00"]
[null,670,{"$f":"'2C'!H47","v":0},null,"Menojäännös  verovuoden alussa. Rakennukset","",null,0,0,null,"0,00"]
[null,680,{"$f":"'2C'!M47","v":3200},null,"Menojäännös  verovuoden alussa. Ojat ja tiet","680:3200,00",null,3200,0,null,"3200,00"]
[null,661,{"$f":"'2C'!E48","v":717.13},null,"Lisäykset verovuonna: Koneet ja kalusto","661:717,13",null,717,13,null,"717,13"]
[null,671,{"$f":"'2C'!H48","v":0},null,"Lisäykset verovuonna: Rakennukset","",null,0,0,null,"0,00"]
[null,681,{"$f":"'2C'!M48","v":0},null,"Lisäykset verovuonna: Ojat ja tiet",{"$f":"IF(C45=0,\"\",CONCATENATE(B45,\":\",K45))","v":""},null,0,0,null,"0,00"]
[null,645,{"$f":"'2C'!E49","v":0},null,"Luovutukset verovuonna: Koneet ja kalusto","",null,0,0,null,"0,00"]
[null,646,{"$f":"'2C'!H49","v":0},null,"Luovutukset verovuonna: Rakennukset","",null,0,0,null,"0,00"]
[null,682,{"$f":"'2C'!M49","v":0},null,"Luovutukset verovuonna: Ojat ja tiet","",null,0,0,null,"0,00"]
[null,642,{"$f":"'2C'!E50","v":287.5},null,"Poistot: Koneet ja kalusto","642:287,50",null,287,50,null,"287,50"]
[null,643,{"$f":"'2C'!H50","v":0},null,"Poistot: Rakennukset","",null,0,0,null,"0,00"]
[null,644,{"$f":"'2C'!M50","v":480},null,"Poistot: Ojat ja tiet","644:480,00",null,480,0,null,"480,00"]
[null,694,{"$f":"'2C'!S50","v":767.5},null,"Poistot yhteensä (642+643+644)","694:767,50",null,767,50,null,"767,50"]
[null,"626",{"$f":"'2C'!E51","v":1179.6300000000001},null,"Menojäännös  verovuoden lopussa. Koneet ja kalusto","626:1179,63",null,1179,63,null,"1179,63"]
[null,"627",{"$f":"'2C'!H51","v":0},null,"Menojäännös  verovuoden lopussa. Rakennukset","",null,0,0,null,{"$f":"CONCATENATE(H54,\",\",IF(I54=0,\"00\",IF(I54<10,CONCATENATE(\"0\",I54),I54)))","v":"0,00"}]
[null,"628",{"$f":"'2C'!M51","v":2720},null,"Menojäännös  verovuoden lopussa. Ojat ja tiet","628:2720,00",null,2720,0,null,{"$f":"CONCATENATE(H55,\",\",IF(I55=0,\"00\",IF(I55<10,CONCATENATE(\"0\",I55),I55)))","v":"2720,00"}]
[null,"630",{"$f":"'2C'!S53","v":0},null,"Toisesta tulolähteestä siirrettävät menot","",null,0,0,null,"0,00"]
[null,"631",{"$f":"'2C'!B56","v":0},null,"Maatalouden menot","",null,0,0,null,"0,00"]
[null,"632",{"$f":"'2C'!F56","v":0},null,"Elinkeinotoiminnan menot","",null,0,0,null,"0,00"]
[null,"633",{"$f":"'2C'!L56","v":0},null,"Yksityismenot","",null,0,0,null,"0,00"]
[null,"634",{"$f":"'2C'!S55","v":0},null,"Metsätalouden muistiinpanoihin sisältyneet muun toiminnan menot yhteensä (631+632+633)","",null,0,0,null,"0,00"]
[null,"635",{"$f":"'2C'!S58","v":3786.39},null,"15. Metsätalouden puhdas pääomatulo (690+691+610+614-618+651-693-694-630+634)","635:3786,39",null,3786,39,null,"3786,39"]
[null,"636",{"$f":"IF('2C'!S60<0,ABS('2C'!S60),0)","v":0},null,"16. Metsätalouden tappiollinen pääomatulo -(690+691+610+614-618+651-693-694-630+634)","",null,0,0,null,"0,00"]
[null,"001",{"$f":"4-(COUNTBLANK(Etusivu!C36)+COUNTBLANK(Etusivu!C38)+COUNTBLANK(Etusivu!C40)+COUNTBLANK(Etusivu!C42))","v":0},null,"Osatietoryhmä 700-705 alkaa",{"$f":"IF(C63=0,\"\",CONCATENATE(B63,\":\",C63))","v":""}]
[null,"700",{"$f":"'2C'!B72","v":0},null,"Hankintatyön tekijän nimi",{"$f":"IF(C64=0,\"\",CONCATENATE(B64,\":\",C64))","v":""}]
[null,"701",{"$f":"'2C'!G72","v":0},null,"Hankintatyön tekijän henkilötunnus",{"$f":"IF(C65=0,\"\",CONCATENATE(B65,\":\",C65))","v":""}]
[null,"702",{"$f":"'2C'!J72","v":0},null,"Valmistettu määrä m3",{"$f":"IF(C66=0,\"\",CONCATENATE(B66,\":\",C66))","v":""}]
[null,"703",{"$f":"'2C'!M72","v":0},null,"Kuljetettu määrä m3",{"$f":"IF(C67=0,\"\",CONCATENATE(B67,\":\",C67))","v":""}]
[null,"704",{"$f":"'2C'!O72","v":0},null,"Hankintatyön arvo",{"$f":"IF(C68=0,\"\",CONCATENATE(B68,\":\",K68))","v":""},null,{"$f":"ROUNDDOWN(C68,0)","v":0},{"$f":"(C68-H68)*100","v":0},null,{"$f":"CONCATENATE(H68,\",\",IF(I68=0,\"00\",IF(I68<10,CONCATENATE(\"0\",I68),I68)))","v":"0,00"}]
[null,"705",{"$f":"'2C'!S73","v":0},null,"Hankintatyön veronalainen arvo",{"$f":"IF(C69=0,\"\",CONCATENATE(B69,\":\",K69))","v":""},null,{"$f":"ROUNDDOWN(C69,0)","v":0},{"$f":"(C69-H69)*100","v":0},null,{"$f":"CONCATENATE(H69,\",\",IF(I69=0,\"00\",IF(I69<10,CONCATENATE(\"0\",I69),I69)))","v":"0,00"}]
[null,"009",{"$f":"IF(C$63>0,1,\"\")","v":""},"Juokseva numero osatietoryhmien määrän mukaan","Osatietoryhmä 700-705 loppuu",{"$f":"IF(C70=\"\",\"\",CONCATENATE(B70,\":\",C70))","v":""}]
[null,"700",{"$f":"'2C'!B74","v":0},null,"Hankintatyön tekijän nimi",{"$f":"IF(C71=0,\"\",CONCATENATE(B71,\":\",C71))","v":""}]
[null,"701",{"$f":"'2C'!G74","v":0},null,"Hankintatyön tekijän henkilötunnus",{"$f":"IF(C72=0,\"\",CONCATENATE(B72,\":\",C72))","v":""}]
[null,"702",{"$f":"'2C'!J74","v":0},null,"Valmistettu määrä m3",{"$f":"IF(C73=0,\"\",CONCATENATE(B73,\":\",C73))","v":""}]
[null,"703",{"$f":"'2C'!M74","v":0},null,"Kuljetettu määrä m3",{"$f":"IF(C74=0,\"\",CONCATENATE(B74,\":\",C74))","v":""}]
[null,"704",{"$f":"'2C'!O74","v":0},null,"Hankintatyön arvo",{"$f":"IF(C75=0,\"\",CONCATENATE(B75,\":\",K75))","v":""},null,{"$f":"ROUNDDOWN(C75,0)","v":0},{"$f":"(C75-H75)*100","v":0},null,{"$f":"CONCATENATE(H75,\",\",IF(I75=0,\"00\",IF(I75<10,CONCATENATE(\"0\",I75),I75)))","v":"0,00"}]
[null,"705",{"$f":"'2C'!S75","v":0},null,"Hankintatyön veronalainen arvo",{"$f":"IF(C76=0,\"\",CONCATENATE(B76,\":\",K76))","v":""},null,{"$f":"ROUNDDOWN(C76,0)","v":0},{"$f":"(C76-H76)*100","v":0},null,{"$f":"CONCATENATE(H76,\",\",IF(I76=0,\"00\",IF(I76<10,CONCATENATE(\"0\",I76),I76)))","v":"0,00"}]
[null,"009",{"$f":"IF(C$63>1,2,\"\")","v":""},"Juokseva numero osatietoryhmien määrän mukaan","Osatietoryhmä 700-705 loppuu",{"$f":"IF(C77=\"\",\"\",CONCATENATE(B77,\":\",C77))","v":""}]
[null,"700",{"$f":"'2C'!B76","v":0},null,"Hankintatyön tekijän nimi",{"$f":"IF(C78=0,\"\",CONCATENATE(B78,\":\",C78))","v":""}]
[null,"701",{"$f":"'2C'!G76","v":0},null,"Hankintatyön tekijän henkilötunnus",{"$f":"IF(C79=0,\"\",CONCATENATE(B79,\":\",C79))","v":""}]
[null,"702",{"$f":"'2C'!J76","v":0},null,"Valmistettu määrä m3",{"$f":"IF(C80=0,\"\",CONCATENATE(B80,\":\",C80))","v":""}]
[null,"703",{"$f":"'2C'!M76","v":0},null,"Kuljetettu määrä m3",{"$f":"IF(C81=0,\"\",CONCATENATE(B81,\":\",C81))","v":""}]
[null,"704",{"$f":"'2C'!O76","v":0},null,"Hankintatyön arvo",{"$f":"IF(C82=0,\"\",CONCATENATE(B82,\":\",K82))","v":""},null,{"$f":"ROUNDDOWN(C82,0)","v":0},{"$f":"(C82-H82)*100","v":0},null,{"$f":"CONCATENATE(H82,\",\",IF(I82=0,\"00\",IF(I82<10,CONCATENATE(\"0\",I82),I82)))","v":"0,00"}]
[null,"705",{"$f":"'2C'!S77","v":0},null,"Hankintatyön veronalainen arvo",{"$f":"IF(C83=0,\"\",CONCATENATE(B83,\":\",K83))","v":""},null,{"$f":"ROUNDDOWN(C83,0)","v":0},{"$f":"(C83-H83)*100","v":0},null,{"$f":"CONCATENATE(H83,\",\",IF(I83=0,\"00\",IF(I83<10,CONCATENATE(\"0\",I83),I83)))","v":"0,00"}]
[null,"009",{"$f":"IF(C$63>2,3,\"\")","v":""},"Juokseva numero osatietoryhmien määrän mukaan","Osatietoryhmä 700-705 loppuu",{"$f":"IF(C84=\"\",\"\",CONCATENATE(B84,\":\",C84))","v":""}]
[null,"700",{"$f":"'2C'!B78","v":0},null,"Hankintatyön tekijän nimi",{"$f":"IF(C85=0,\"\",CONCATENATE(B85,\":\",C85))","v":""}]
[null,"701",{"$f":"'2C'!G78","v":0},null,"Hankintatyön tekijän henkilötunnus",{"$f":"IF(C86=0,\"\",CONCATENATE(B86,\":\",C86))","v":""}]
[null,"702",{"$f":"'2C'!J78","v":0},null,"Valmistettu määrä m3",{"$f":"IF(C87=0,\"\",CONCATENATE(B87,\":\",C87))","v":""}]
[null,"703",{"$f":"'2C'!M78","v":0},null,"Kuljetettu määrä m3",{"$f":"IF(C88=0,\"\",CONCATENATE(B88,\":\",C88))","v":""}]
[null,"704",{"$f":"'2C'!O78","v":0},null,"Hankintatyön arvo",{"$f":"IF(C89=0,\"\",CONCATENATE(B89,\":\",K89))","v":""},null,{"$f":"ROUNDDOWN(C89,0)","v":0},{"$f":"(C89-H89)*100","v":0},null,{"$f":"CONCATENATE(H89,\",\",IF(I89=0,\"00\",IF(I89<10,CONCATENATE(\"0\",I89),I89)))","v":"0,00"}]
[null,"705",{"$f":"'2C'!S79","v":0},null,"Hankintatyön veronalainen arvo",{"$f":"IF(C90=0,\"\",CONCATENATE(B90,\":\",K90))","v":""},null,{"$f":"ROUNDDOWN(C90,0)","v":0},{"$f":"(C90-H90)*100","v":0},null,{"$f":"CONCATENATE(H90,\",\",IF(I90=0,\"00\",IF(I90<10,CONCATENATE(\"0\",I90),I90)))","v":"0,00"}]
[null,"009",{"$f":"IF(C$63>3,4,\"\")","v":""},"Juokseva numero osatietoryhmien määrän mukaan","Osatietoryhmä 700-705 loppuu",{"$f":"IF(C91=\"\",\"\",CONCATENATE(B91,\":\",C91))","v":""}]
[null,"700",{"$f":"'2C'!AB72","v":0},null,"Hankintatyön tekijän nimi",{"$f":"IF(C92=0,\"\",CONCATENATE(B92,\":\",C92))","v":""}]
[null,"701",{"$f":"'2C'!AG72","v":0},null,"Hankintatyön tekijän henkilötunnus",{"$f":"IF(C93=0,\"\",CONCATENATE(B93,\":\",C93))","v":""}]
[null,"702",{"$f":"'2C'!AJ72","v":0},null,"Valmistettu määrä m3",{"$f":"IF(C94=0,\"\",CONCATENATE(B94,\":\",C94))","v":""}]
[null,"703",{"$f":"'2C'!AM72","v":0},null,"Kuljetettu määrä m3",{"$f":"IF(C95=0,\"\",CONCATENATE(B95,\":\",C95))","v":""}]
[null,"704",{"$f":"'2C'!AO72","v":0},null,"Hankintatyön arvo",{"$f":"IF(C96=0,\"\",CONCATENATE(B96,\":\",K96))","v":""},null,{"$f":"ROUNDDOWN(C96,0)","v":0},{"$f":"(C96-H96)*100","v":0},null,{"$f":"CONCATENATE(H96,\",\",IF(I96=0,\"00\",IF(I96<10,CONCATENATE(\"0\",I96),I96)))","v":"0,00"}]
[null,"705",{"$f":"'2C'!AS72","v":0},null,"Hankintatyön veronalainen arvo",{"$f":"IF(C97=0,\"\",CONCATENATE(B97,\":\",K97))","v":""},null,{"$f":"ROUNDDOWN(C97,0)","v":0},{"$f":"(C97-H97)*100","v":0},null,{"$f":"CONCATENATE(H97,\",\",IF(I97=0,\"00\",IF(I97<10,CONCATENATE(\"0\",I97),I97)))","v":"0,00"}]
[null,"009",{"$f":"IF(C$63>4,5,\"\")","v":""},"Juokseva numero osatietoryhmien määrän mukaan","Osatietoryhmä 700-705 loppuu",{"$f":"IF(C98=\"\",\"\",CONCATENATE(B98,\":\",C98))","v":""}]
[null,"700",{"$f":"'2C'!AB74","v":0},null,"Hankintatyön tekijän nimi",{"$f":"IF(C99=0,\"\",CONCATENATE(B99,\":\",C99))","v":""}]
[null,"701",{"$f":"'2C'!AC74","v":0},null,"Hankintatyön tekijän henkilötunnus",{"$f":"IF(C100=0,\"\",CONCATENATE(B100,\":\",C100))","v":""}]
[null,"702",{"$f":"'2C'!AJ74","v":0},null,"Valmistettu määrä m3",{"$f":"IF(C101=0,\"\",CONCATENATE(B101,\":\",C101))","v":""}]
[null,"703",{"$f":"'2C'!AM74","v":0},null,"Kuljetettu määrä m3",{"$f":"IF(C102=0,\"\",CONCATENATE(B102,\":\",C102))","v":""}]
[null,"704",{"$f":"'2C'!AO74","v":0},null,"Hankintatyön arvo",{"$f":"IF(C103=0,\"\",CONCATENATE(B103,\":\",K103))","v":""},null,{"$f":"ROUNDDOWN(C103,0)","v":0},{"$f":"(C103-H103)*100","v":0},null,{"$f":"CONCATENATE(H103,\",\",IF(I103=0,\"00\",IF(I103<10,CONCATENATE(\"0\",I103),I103)))","v":"0,00"}]
[null,"705",{"$f":"'2C'!AS74","v":0},null,"Hankintatyön veronalainen arvo",{"$f":"IF(C104=0,\"\",CONCATENATE(B104,\":\",K104))","v":""},null,{"$f":"ROUNDDOWN(C104,0)","v":0},{"$f":"(C104-H104)*100","v":0},null,{"$f":"CONCATENATE(H104,\",\",IF(I104=0,\"00\",IF(I104<10,CONCATENATE(\"0\",I104),I104)))","v":"0,00"}]
[null,"009",{"$f":"IF(C$63>5,6,\"\")","v":""},"Juokseva numero osatietoryhmien määrän mukaan","Osatietoryhmä 700-705 loppuu",{"$f":"IF(C105=\"\",\"\",CONCATENATE(B105,\":\",C105))","v":""}]
[null,"700",{"$f":"'2C'!AB76","v":0},null,"Hankintatyön tekijän nimi",{"$f":"IF(C106=0,\"\",CONCATENATE(B106,\":\",C106))","v":""}]
[null,"701",{"$f":"'2C'!AC76","v":0},null,"Hankintatyön tekijän henkilötunnus",{"$f":"IF(C107=0,\"\",CONCATENATE(B107,\":\",C107))","v":""}]
[null,"702",{"$f":"'2C'!AJ76","v":0},null,"Valmistettu määrä m3",{"$f":"IF(C108=0,\"\",CONCATENATE(B108,\":\",C108))","v":""}]
[null,"703",{"$f":"'2C'!AM76","v":0},null,"Kuljetettu määrä m3",{"$f":"IF(C109=0,\"\",CONCATENATE(B109,\":\",C109))","v":""}]
[null,"704",{"$f":"'2C'!AO76","v":0},null,"Hankintatyön arvo",{"$f":"IF(C110=0,\"\",CONCATENATE(B110,\":\",K110))","v":""},null,{"$f":"ROUNDDOWN(C110,0)","v":0},{"$f":"(C110-H110)*100","v":0},null,{"$f":"CONCATENATE(H110,\",\",IF(I110=0,\"00\",IF(I110<10,CONCATENATE(\"0\",I110),I110)))","v":"0,00"}]
[null,"705",{"$f":"'2C'!AS76","v":0},null,"Hankintatyön veronalainen arvo",{"$f":"IF(C111=0,\"\",CONCATENATE(B111,\":\",K111))","v":""},null,{"$f":"ROUNDDOWN(C111,0)","v":0},{"$f":"(C111-H111)*100","v":0},null,{"$f":"CONCATENATE(H111,\",\",IF(I111=0,\"00\",IF(I111<10,CONCATENATE(\"0\",I111),I111)))","v":"0,00"}]
[null,"009",{"$f":"IF(C$63>6,7,\"\")","v":""},"Juokseva numero osatietoryhmien määrän mukaan","Osatietoryhmä 700-705 loppuu",{"$f":"IF(C112=\"\",\"\",CONCATENATE(B112,\":\",C112))","v":""}]
[null,"700",{"$f":"'2C'!AB78","v":0},null,"Hankintatyön tekijän nimi",{"$f":"IF(C113=0,\"\",CONCATENATE(B113,\":\",C113))","v":""}]
[null,"701",{"$f":"'2C'!AC78","v":0},null,"Hankintatyön tekijän henkilötunnus",{"$f":"IF(C114=0,\"\",CONCATENATE(B114,\":\",C114))","v":""}]
[null,"702",{"$f":"'2C'!AJ78","v":0},null,"Valmistettu määrä m3",{"$f":"IF(C115=0,\"\",CONCATENATE(B115,\":\",C115))","v":""}]
[null,"703",{"$f":"'2C'!AM78","v":0},null,"Kuljetettu määrä m3",{"$f":"IF(C116=0,\"\",CONCATENATE(B116,\":\",C116))","v":""}]
[null,"704",{"$f":"'2C'!AO78","v":0},null,"Hankintatyön arvo",{"$f":"IF(C117=0,\"\",CONCATENATE(B117,\":\",K117))","v":""},null,{"$f":"ROUNDDOWN(C117,0)","v":0},{"$f":"(C117-H117)*100","v":0},null,{"$f":"CONCATENATE(H117,\",\",IF(I117=0,\"00\",IF(I117<10,CONCATENATE(\"0\",I117),I117)))","v":"0,00"}]
[null,"705",{"$f":"'2C'!AS78","v":0},null,"Hankintatyön veronalainen arvo",{"$f":"IF(C118=0,\"\",CONCATENATE(B118,\":\",K118))","v":""},null,{"$f":"ROUNDDOWN(C118,0)","v":0},{"$f":"(C118-H118)*100","v":0},null,{"$f":"CONCATENATE(H118,\",\",IF(I118=0,\"00\",IF(I118<10,CONCATENATE(\"0\",I118),I118)))","v":"0,00"}]
[null,"009",{"$f":"IF(C$63>7,8,\"\")","v":""},"Juokseva numero osatietoryhmien määrän mukaan","Osatietoryhmä 700-705 loppuu",{"$f":"IF(C119=\"\",\"\",CONCATENATE(B119,\":\",C119))","v":""}]
[null,"706",{"$f":"'2C'!O80+'2C'!AO80","v":0},null,"Hankintatyön arvot yhteensä",{"$f":"IF(C120=0,\"\",CONCATENATE(B120,\":\",K120))","v":""},null,{"$f":"ROUNDDOWN(C120,0)","v":0},{"$f":"(C120-H120)*100","v":0},null,{"$f":"CONCATENATE(H120,\",\",IF(I120=0,\"00\",IF(I120<10,CONCATENATE(\"0\",I120),I120)))","v":"0,00"}]
[null,655,{"$f":"'2C'!R86","v":27000},null,"Metsävähennyspohja, ks. täyttöohje","655:27000,00",null,27000,0,null,"27000,00"]
[null,"656",{"$f":"'2C'!R87","v":6700},null,"Aikaisemmin käytetty metsävähennys","656:6700,00",null,6700,0,null,"6700,00"]
[null,"657",{"$f":"'2C'!R88","v":0},null,"Luovutusvoittoihin lisättyjen metsävähennysten määrä","",null,0,0,null,"0,00"]
[null,"715",{"$f":"'2C'!R89","v":20300},null,"Käytettävissä olevan metsävähennyksen määrä = 655 - (656 - 657)",{"$f":"IF(C122>0,IF(C124<0,\"\",CONCATENATE(B124,\":\",K124)),\"\")","v":"715:20300,00"},null,20300,0,null,"20300,00"]
[null,"716",{"$f":"'2C'!R90","v":15800},null,"Metsätalouden veronalainen pääomatulo metsävähennyskiinteistöiltä verovuonna","716:15800,00",null,15800,0,null,"15800,00"]
[null,"717",{"$f":"'2C'!R91","v":9480},null,"Verovuoden metsävähennys","717:9480,00",null,9480,0,null,"9480,00"]
[null,"720",{"$f":"'2C'!R92","v":16180},null,"Käytetty metsävähennys yhteensä = 656+717","720:16180,00",null,16180,0,null,"16180,00"]
[null,"637",{"$f":"'2C'!F99","v":0},null,{"$f":"CONCATENATE(\"Vuonna \",Etusivu!C$8-5,\" tehtyjen menovarausten jäljellä oleva määrä verovuoden lopussa\")","v":"Vuonna 2020 tehtyjen menovarausten jäljellä oleva määrä verovuoden lopussa"},"",null,0,0,null,"0,00"]
[null,"638",{"$f":"'2C'!F100","v":0},null,{"$f":"CONCATENATE(\"Vuonna \",Etusivu!C$8-4,\" tehtyjen menovarausten jäljellä oleva määrä verovuoden lopussa\")","v":"Vuonna 2021 tehtyjen menovarausten jäljellä oleva määrä verovuoden lopussa"},"",null,0,0,null,"0,00"]
[null,"639",{"$f":"'2C'!F101","v":0},null,{"$f":"CONCATENATE(\"Vuonna \",Etusivu!C$8-3,\" tehtyjen menovarausten jäljellä oleva määrä verovuoden lopussa\")","v":"Vuonna 2022 tehtyjen menovarausten jäljellä oleva määrä verovuoden lopussa"},"",null,0,0,null,"0,00"]
[null,"640",{"$f":"'2C'!F102","v":0},null,{"$f":"CONCATENATE(\"Vuonna \",Etusivu!C$8-2,\" tehtyjen menovarausten jäljellä oleva määrä verovuoden lopussa\")","v":"Vuonna 2023 tehtyjen menovarausten jäljellä oleva määrä verovuoden lopussa"},"",null,0,0,null,"0,00"]
[null,"641",{"$f":"'2C'!F103","v":0},null,{"$f":"CONCATENATE(\"Vuonna \",Etusivu!C$8-1,\" tehtyjen menovarausten jäljellä oleva määrä verovuoden lopussa\")","v":"Vuonna 2024 tehtyjen menovarausten jäljellä oleva määrä verovuoden lopussa"},"",null,0,0,null,"0,00"]
[null,"650",{"$f":"'2C'!F104","v":948},null,"Verovuonna tehtyjen menovarausten määrä","650:948,00",null,948,0,null,"948,00"]
[null,"842",{"$f":"'2C'!J99","v":0},null,{"$f":"CONCATENATE(\"Vuonna \",Etusivu!C$8-5,\" tehtyjen tuhovarausten jäljellä oleva määrä verovuoden lopussa\")","v":"Vuonna 2020 tehtyjen tuhovarausten jäljellä oleva määrä verovuoden lopussa"},"",null,0,0,null,"0,00"]
[null,"843",{"$f":"'2C'!J100","v":0},null,{"$f":"CONCATENATE(\"Vuonna \",Etusivu!C$8-4,\" tehtyjen tuhovarausten jäljellä oleva määrä verovuoden lopussa\")","v":"Vuonna 2021 tehtyjen tuhovarausten jäljellä oleva määrä verovuoden lopussa"},"",null,0,0,null,"0,00"]
[null,"844",{"$f":"'2C'!J101","v":0},null,{"$f":"CONCATENATE(\"Vuonna \",Etusivu!C$8-3,\" tehtyjen tuhovarausten jäljellä oleva määrä verovuoden lopussa\")","v":"Vuonna 2022 tehtyjen tuhovarausten jäljellä oleva määrä verovuoden lopussa"},"",null,0,0,null,"0,00"]
[null,"845",{"$f":"'2C'!J102","v":0},null,{"$f":"CONCATENATE(\"Vuonna \",Etusivu!C$8-2,\" tehtyjen tuhovarausten jäljellä oleva määrä verovuoden lopussa\")","v":"Vuonna 2023 tehtyjen tuhovarausten jäljellä oleva määrä verovuoden lopussa"},"",null,0,0,null,"0,00"]
[null,"846",{"$f":"'2C'!J103","v":0},null,{"$f":"CONCATENATE(\"Vuonna \",Etusivu!C$8-1,\" tehtyjen tuhovarausten jäljellä oleva määrä verovuoden lopussa\")","v":"Vuonna 2024 tehtyjen tuhovarausten jäljellä oleva määrä verovuoden lopussa"},"",null,0,0,null,"0,00"]
[null,"851",{"$f":"'2C'!J104","v":0},null,"Verovuonna tehtyjen tuhovarausten määrä","",null,0,0,null,"0,00"]
[null,"041",{"$f":"IF('2C'!B107=\"\",0,'2C'!B107)","v":0},null,"Veroilmoitusta täydentäviä tietoja antaa, nimi",{"$f":"IF(C140=0,\"\",CONCATENATE(B140,\":\",C140))","v":""}]
[null,"044",{"$f":"Etusivu!C33","v":0},null,"Veroilmoitusta täydentävien tietojen antajan sähköpostiosoite",{"$f":"IF(C141=0,\"\",CONCATENATE(B141,\":\",C141))","v":""}]
[null,"042",{"$f":"Etusivu!C32","v":0},null,"Veroilmoitusta täydentäviä tietoja antavan puhelinnumero",{"$f":"IF(C142=0,\"\",CONCATENATE(B142,\":\",C142))","v":""}]
[null,"999",1,null,"Lomakkeen 2C loppumerkki",{"$f":"IF(C143=0,\"\",CONCATENATE(B143,\":\",C143))","v":"999:1"}]
[null,null,""]

{"sheet":"Tiliöinti","index":20,"n_rows":47,"n_cols":10,"rows_kept":47,"cut":false,"hidden":false,"merged":[]}
[]
[null,{"$f":"Etusivu!C10","v":"Matti Metsänen"}]
[null,{"$f":"Etusivu!C16","v":"123456-7"}]
[]
[null,"TULOJEN JA MENOJEN ERITTELY"]
[]
[]
[null,"TULOT",null,null,null,"MENOT"]
[null,"Tili","Kuvaus","Euroa",null,"Tili","Kuvaus","Euroa",null,"OHJEITA"]
[null,100,"Pystykaupat tila 1",{"$f":"SUMIF(Tulot!T$11:T$167,Tiliöinti!B10,Tulot!U$11:U$167)","v":0},null,200,"Palkat",{"$f":"SUMIF(Menot!Z$9:Z$700,F10,Menot!K$9:K$700)","v":0},null,"o Voit itse muuttaa eriteltävät tapahtumat ja käytettävät tilinumerot tarpeesi mukaan"]
[null,101,"Pystykaupat tila 2",{"$f":"SUMIF(Tulot!T$11:T$167,Tiliöinti!B11,Tulot!U$11:U$167)","v":0},null,201,"Matkat",{"$f":"SUMIF(Menot!Z$9:Z$700,F11,Menot!K$9:K$700)","v":44.64},null,"o Poistoihin kirjattavien menojen osalta kirjautuu koko summa, joka menee poistomenettelyyn"]
[null,102,"Hankintakaupat tila 1",{"$f":"SUMIF(Tulot!T$11:T$167,Tiliöinti!B12,Tulot!U$11:U$167)","v":0},null,202,"Sahan polttoaineet",{"$f":"SUMIF(Menot!Z$9:Z$700,F12,Menot!K$9:K$700)","v":0},null,"o Erittelykuvaukset ovat esimerkinomaisia, muuta itse haluamiskesi."]
[null,103,"Hankintakaupat tila 2",{"$f":"SUMIF(Tulot!T$11:T$167,Tiliöinti!B13,Tulot!U$11:U$167)","v":0},null,203,"Sahan varaosat",{"$f":"SUMIF(Menot!Z$9:Z$700,F13,Menot!K$9:K$700)","v":0}]
[null,104,"Polttopuumyynti nouto",{"$f":"SUMIF(Tulot!T$11:T$167,Tiliöinti!B14,Tulot!U$11:U$167)","v":0},null,204,"Sahan huolto",{"$f":"SUMIF(Menot!Z$9:Z$700,F14,Menot!K$9:K$700)","v":0}]
[null,105,"Polttopuumyynti toimitettuna",{"$f":"SUMIF(Tulot!T$11:T$167,Tiliöinti!B15,Tulot!U$11:U$167)","v":0},null,205,"Pientyökalut",{"$f":"SUMIF(Menot!Z$9:Z$700,F15,Menot!K$9:K$700)","v":0}]
[null,106,"Joulukuusien torimyynti",{"$f":"SUMIF(Tulot!T$11:T$167,Tiliöinti!B16,Tulot!U$11:U$167)","v":0},null,206,"Turvavarusteet",{"$f":"SUMIF(Menot!Z$9:Z$700,F16,Menot!K$9:K$700)","v":0}]
[null,107,"Joulukuusien noutomyynti",{"$f":"SUMIF(Tulot!T$11:T$167,Tiliöinti!B17,Tulot!U$11:U$167)","v":0},null,207,"Vakuutukset",{"$f":"SUMIF(Menot!Z$9:Z$700,F17,Menot!K$9:K$700)","v":0}]
[null,108,"Kemeratuet",{"$f":"SUMIF(Tulot!T$11:T$167,Tiliöinti!B18,Tulot!U$11:U$167)","v":0},null,208,"Jäsenmaksut",{"$f":"SUMIF(Menot!Z$9:Z$700,F18,Menot!K$9:K$700)","v":0}]
[null,109,null,{"$f":"SUMIF(Tulot!T$11:T$167,Tiliöinti!B19,Tulot!U$11:U$167)","v":0},null,209,"Lehdet",{"$f":"SUMIF(Menot!Z$9:Z$700,F19,Menot!K$9:K$700)","v":0}]
[null,110,null,{"$f":"SUMIF(Tulot!T$11:T$167,Tiliöinti!B20,Tulot!U$11:U$167)","v":0},null,210,"Kirjanpito",{"$f":"SUMIF(Menot!Z$9:Z$700,F20,Menot!K$9:K$700)","v":35.22}]
[null,111,null,{"$f":"SUMIF(Tulot!T$11:T$167,Tiliöinti!B21,Tulot!U$11:U$167)","v":0},null,211,"Puhelin, netti ja sähkö",{"$f":"SUMIF(Menot!Z$9:Z$700,F21,Menot!K$9:K$700)","v":0}]
[null,112,null,{"$f":"SUMIF(Tulot!T$11:T$167,Tiliöinti!B22,Tulot!U$11:U$167)","v":0},null,212,"Muokkaus",{"$f":"SUMIF(Menot!Z$9:Z$700,F22,Menot!K$9:K$700)","v":0}]
[null,113,null,{"$f":"SUMIF(Tulot!T$11:T$167,Tiliöinti!B23,Tulot!U$11:U$167)","v":0},null,213,"Taimet",{"$f":"SUMIF(Menot!Z$9:Z$700,F23,Menot!K$9:K$700)","v":0}]
[null,114,null,{"$f":"SUMIF(Tulot!T$11:T$167,Tiliöinti!B24,Tulot!U$11:U$167)","v":0},null,214,"Istutus",{"$f":"SUMIF(Menot!Z$9:Z$700,F24,Menot!K$9:K$700)","v":0}]
[null,115,null,{"$f":"SUMIF(Tulot!T$11:T$167,Tiliöinti!B25,Tulot!U$11:U$167)","v":0},null,215,null,{"$f":"SUMIF(Menot!Z$9:Z$700,F25,Menot!K$9:K$700)","v":0}]
[null,116,null,{"$f":"SUMIF(Tulot!T$11:T$167,Tiliöinti!B26,Tulot!U$11:U$167)","v":0},null,216,null,{"$f":"SUMIF(Menot!Z$9:Z$700,F26,Menot!K$9:K$700)","v":0}]
[null,117,null,{"$f":"SUMIF(Tulot!T$11:T$167,Tiliöinti!B27,Tulot!U$11:U$167)","v":0},null,217,null,{"$f":"SUMIF(Menot!Z$9:Z$700,F27,Menot!K$9:K$700)","v":0}]
[null,null,null,{"$f":"SUMIF(Tulot!T$11:T$167,Tiliöinti!B28,Tulot!U$11:U$167)","v":0},null,218,null,{"$f":"SUMIF(Menot!Z$9:Z$700,F28,Menot!K$9:K$700)","v":0}]
[null,null,null,{"$f":"SUMIF(Tulot!T$11:T$167,Tiliöinti!B29,Tulot!U$11:U$167)","v":0},null,219,null,{"$f":"SUMIF(Menot!Z$9:Z$700,F29,Menot!K$9:K$700)","v":0}]
[null,null,null,{"$f":"SUMIF(Tulot!T$11:T$167,Tiliöinti!B30,Tulot!U$11:U$167)","v":0},null,220,null,{"$f":"SUMIF(Menot!Z$9:Z$700,F30,Menot!K$9:K$700)","v":0}]
[null,null,null,{"$f":"SUMIF(Tulot!T$11:T$167,Tiliöinti!B31,Tulot!U$11:U$167)","v":0},null,221,null,{"$f":"SUMIF(Menot!Z$9:Z$700,F31,Menot!K$9:K$700)","v":0}]
[null,null,null,{"$f":"SUMIF(Tulot!T$11:T$167,Tiliöinti!B32,Tulot!U$11:U$167)","v":0},null,222,null,{"$f":"SUMIF(Menot!Z$9:Z$700,F32,Menot!K$9:K$700)","v":0}]
[null,null,null,{"$f":"SUMIF(Tulot!T$11:T$167,Tiliöinti!B33,Tulot!U$11:U$167)","v":0},null,223,"Kone tai laite (Poistomenettely)",{"$f":"SUMIF(Menot!Z$9:Z$700,F33,Menot!K$9:K$700)","v":0}]
[null,null,null,{"$f":"SUMIF(Tulot!T$11:T$167,Tiliöinti!B34,Tulot!U$11:U$167)","v":0},null,224,"Rakennukset (Poistomenettely)",{"$f":"SUMIF(Menot!Z$9:Z$700,F34,Menot!K$9:K$700)","v":0}]
[null,null,null,{"$f":"SUMIF(Tulot!T$11:T$167,Tiliöinti!B35,Tulot!U$11:U$167)","v":0},null,225,"Ojat ja tiet (poistomenettely)",{"$f":"SUMIF(Menot!Z$9:Z$700,F35,Menot!K$9:K$700)","v":0}]
[null,null,null,{"$f":"SUMIF(Tulot!T$11:T$167,Tiliöinti!B36,Tulot!U$11:U$167)","v":0},null,null,null,{"$f":"SUMIF(Menot!Z$9:Z$700,F36,Menot!K$9:K$700)","v":0}]
[null,null,null,{"$f":"SUMIF(Tulot!T$11:T$167,Tiliöinti!B37,Tulot!U$11:U$167)","v":0},null,null,null,{"$f":"SUMIF(Menot!Z$9:Z$700,F37,Menot!K$9:K$700)","v":0}]
[null,null,null,{"$f":"SUMIF(Tulot!T$11:T$167,Tiliöinti!B38,Tulot!U$11:U$167)","v":0},null,null,null,{"$f":"SUMIF(Menot!Z$9:Z$700,F38,Menot!K$9:K$700)","v":0}]
[null,null,null,{"$f":"SUMIF(Tulot!T$11:T$167,Tiliöinti!B39,Tulot!U$11:U$167)","v":0},null,null,null,{"$f":"SUMIF(Menot!Z$9:Z$700,F39,Menot!K$9:K$700)","v":0}]
[null,null,null,{"$f":"SUMIF(Tulot!T$11:T$167,Tiliöinti!B40,Tulot!U$11:U$167)","v":0},null,null,null,{"$f":"SUMIF(Menot!Z$9:Z$700,F40,Menot!K$9:K$700)","v":0}]
[null,null,null,{"$f":"SUMIF(Tulot!T$11:T$167,Tiliöinti!B41,Tulot!U$11:U$167)","v":0},null,null,null,{"$f":"SUMIF(Menot!Z$9:Z$700,F41,Menot!K$9:K$700)","v":0}]
[null,null,null,{"$f":"SUMIF(Tulot!T$11:T$167,Tiliöinti!B42,Tulot!U$11:U$167)","v":0},null,null,null,{"$f":"SUMIF(Menot!Z$9:Z$700,F42,Menot!K$9:K$700)","v":0}]
[null,null,null,{"$f":"SUMIF(Tulot!T$11:T$167,Tiliöinti!B43,Tulot!U$11:U$167)","v":0},null,null,null,{"$f":"SUMIF(Menot!Z$9:Z$700,F43,Menot!K$9:K$700)","v":0}]
[null,null,null,{"$f":"SUMIF(Tulot!T$11:T$167,Tiliöinti!B44,Tulot!U$11:U$167)","v":0},null,null,null,{"$f":"SUMIF(Menot!Z$9:Z$700,F44,Menot!K$9:K$700)","v":0}]
[null,null,null,null,null,null,null,{"$f":"SUMIF(Menot!Z$9:Z$700,F45,Menot!K$9:K$700)","v":0}]
[]
[null,"Yhteensä",null,{"$f":"SUM(D10:D45)","v":0},null,"Yhteensä",null,{"$f":"SUM(H10:H45)","v":79.86}]