{"text_format":"1","workbook":"xlsx","n_sheets":6,"sheets":["rapot","leger","deskripsi","Ekskul","DUDI","Prestasi"],"not_rendered":{"charts":0,"images":2,"macros":1,"external_links":1,"defined_names":2,"comments":0,"pivot_tables":0},"unopened":[],"bounds":{"document_bytes":16777216,"sheet_cells":100000,"rows_first":2000,"rows_last":500,"rows_between":2000,"halvings":0,"cell_chars":16384,"cell_head_chars":4096},"cells_cut":0,"cells_raw":0,"read":"whole","date_system":"1900"}

{"sheet":"rapot","index":0,"n_rows":82,"n_cols":15,"rows_kept":82,"cut":false,"hidden":false,"merged":[[33,11,33,12],[38,11,38,12],[45,7,45,8],[58,0,58,1],[59,0,59,1],[57,7,57,8],[57,9,57,13],[51,0,51,1],[52,0,52,1],[53,0,53,1],[54,0,54,1],[51,7,51,12],[52,7,52,12],[53,7,53,12],[54,7,54,12],[28,11,28,12],[29,11,29,12],[30,11,30,12],[32,11,32,12],[36,11,36,12],[69,0,69,2],[74,0,74,2],[68,0,68,2],[0,0,0,13],[1,0,1,13],[3,0,3,2],[4,0,4,2],[5,0,5,2],[6,0,6,2],[14,2,15,4],[17,2,17,4],[18,2,18,4],[19,2,19,4],[20,2,20,4],[24,2,24,4],[11,1,11,13],[17,11,17,12],[45,0,45,1],[15,11,15,12],[28,0,28,1],[29,0,29,1],[46,0,46,1],[47,0,47,1],[48,0,48,1],[45,2,45,6],[25,2,25,4],[60,0,60,1],[57,0,57,1],[57,2,57,6],[28,2,28,4],[29,2,29,4],[30,2,30,4],[32,2,32,4],[36,2,36,4],[38,2,38,4],[24,11,24,12],[25,11,25,12],[34,0,34,1],[14,9,14,13],[58,7,58,8],[59,7,59,8],[60,7,60,8],[30,0,30,1],[31,0,31,1],[32,0,32,1],[33,0,33,1],[36,0,36,1],[37,0,37,1],[38,0,38,1],[14,5,14,8],[14,0,15,1],[16,0,16,1],[17,0,17,1],[18,0,18,1],[23,0,23,1],[24,0,24,1],[25,0,25,1],[26,0,26,1],[27,0,27,1],[18,11,18,12],[19,11,19,12],[20,11,20,12],[21,11,21,12],[22,11,22,12],[19,0,19,1],[20,0,20,1],[21,0,21,1],[22,0,22,1],[21,2,21,4],[22,2,22,4],[76,5,76,9],[81,5,81,9],[34,11,34,12],[35,0,35,1],[35,11,35,12],[39,0,39,1],[39,2,39,4],[39,11,39,12],[63,0,63,5],[45,9,45,10],[45,11,45,13]]}
[null,null,null,null,null,null,null,null,null,null,null,null,null,null,1]
[]
[]
["Nama Siswa",null,null,": ",{"$f":"VLOOKUP($O$1,leger!$A$6:$AW$49,3)","v":"Adi Ismail"},null,null,null,null,"Kompetensi Keahlian",null,null,": Teknik Komputer dan Jaringan"]
["No. Induk Siswa",null,null,": ",{"$f":"VLOOKUP($O$1,leger!$A$6:$AW$49,2)","v":1023},null,null,null,null,"Tingkat",null,null,": XI (Sebelas)"]
["Bidang Studi Keahlian",null,null,": ","Teknologi Informasi dan Komunikasi",null,null,null,null,"Semester",null,null,": Semester 3 (Ganjil) "]
["Program Studi Keahlian",null,null,": ","Teknik Komputer dan Informatika",null,null,null,null,"Tahun Pelajaran",null,null,": 2017 / 2018"]
[]
["CAPAIAN HASIL BELAJAR"]
["A. SIKAP"]
[null,"Deskripsi     :"]
[null,{"$f":"VLOOKUP($O$1,leger!$A$6:$AW$49,46)","v":"Selalu bersyukur, selalu berdoa sebelum melakukan kegiatan, toleran pada agama yang berbeda dan perlu meningkatkan ketaatan beribadah serta selalu bersikap santun, peduli,  percaya diri, dan perlu meningkatkan sikap jujur, disiplin, dan tanggungjawab"}]
[]
["B. PENGETAHUAN DAN KETERAMPILAN"]
["No",null,"Mata Pelajaran",null,null,"Pengetahuan",null,null,null,"Keterampilan"]
[null,null,null,null,null,"KKM","Angka","Predikat","Deskripsi","KKM","Angka","Predikat",null,"Deskripsi"]
["I",null,"Kelompok A (Wajib)"]
[1,null,"Pendidikan Agama dan Budi Pekerti",null,null,75,{"$f":"ROUNDUP(VLOOKUP($O$1,leger!$A$6:$AW$49,4),0)","v":0},{"$f":"IF(G18>91,\"A\",IF(G18>82,\"B\",IF(G18>74,\"C\",\"D\")))","v":"D"},{"$f":"VLOOKUP($O$1,deskripsi!$A$5:$AK$48,4)","v":"contoh"},75,{"$f":"ROUNDUP(VLOOKUP($O$1,leger!$A$6:$AW$49,5),0)","v":0},{"$f":"IF(K18>91,\"A\",IF(K18>82,\"B\",IF(K18>74,\"C\",\"D\")))","v":"D"},"A",{"$f":"VLOOKUP($O$1,deskripsi!$A$5:$AK$48,5)","v":"contoh"}]
[2,null,"Pendidikan Pancasila dan Kewarganegaraan",null,null,75,{"$f":"ROUNDUP(VLOOKUP($O$1,leger!$A$6:$AW$49,6),0)","v":0},{"$f":"IF(G19>91,\"A\",IF(G19>82,\"B\",IF(G19>74,\"C\",\"D\")))","v":"D"},{"$f":"VLOOKUP($O$1,deskripsi!$A$5:$AK$48,6)","v":0},75,{"$f":"ROUNDUP(VLOOKUP($O$1,leger!$A$6:$AW$49,7),0)","v":0},{"$f":"IF(K19>91,\"A\",IF(K19>82,\"B\",IF(K19>74,\"C\",\"D\")))","v":"D"},"A",{"$f":"VLOOKUP($O$1,deskripsi!$A$5:$AK$48,7)","v":0}]
[3,null,"Bahasa Indonesia",null,null,75,{"$f":"ROUNDUP(VLOOKUP($O$1,leger!$A$6:$AW$49,8),0)","v":0},"D",{"$f":"VLOOKUP($O$1,deskripsi!$A$5:$AK$48,8)","v":0},75,{"$f":"ROUNDUP(VLOOKUP($O$1,leger!$A$6:$AW$49,9),0)","v":0},{"$f":"IF(K20>91,\"A\",IF(K20>82,\"B\",IF(K20>74,\"C\",\"D\")))","v":"D"},"A",{"$f":"VLOOKUP($O$1,deskripsi!$A$5:$AK$48,9)","v":0}]
{"$rows_left_out":63}
{"sheet":"leger","index":1,"n_rows":56,"n_cols":49,"rows_kept":56,"cut":false,"hidden":false,"merged":[[3,13,3,14],[3,15,3,16],[3,17,3,18],[3,37,3,38],[3,21,3,22],[3,23,3,24],[3,25,3,26],[3,29,3,30],[3,31,3,32],[3,35,3,36],[3,19,3,20],[3,27,3,28],[3,33,3,34],[3,3,3,4],[3,5,3,6],[3,7,3,8],[3,9,3,10],[3,11,3,12]]}
[]
[1,2,3,4,5,6,7,8,9,10,11,12,13,14,15,16,17,18,19,20,21,22,23,24,25,26,27,28,29,30,31,32,33,34,35,36,37,38,39,40,41,42,43,44,45,46,47,48,49]
[]
["No.","NIS","Nama Siswa","PAI",null,"PKN",null,"B.Ind",null,"MTK",null,"Sejarah",null,"B.Ing",null,"KWU",null,"Penjasor",null,"Simdig",null,"P.komBisnis",null,"Adm Umum",null,"Tek.Inf. Jar",null,"RBJ",null,"Adm Server",null,"DMI",null,"PPK",null,"Buss. English",null,"Siklus Akun",null,"jml nilai","Rata2","rank","eks1","eks2","eks3","deskripsi siswa","S","I","A"]
[null,null,null,"KI 3","KI 4","KI 3","KI 4","KI 3","KI 4","KI 3","KI 4","KI 3","KI 4","KI 3","KI 4","KI 3","KI 4","KI 3","KI 4","KI 3","KI 4","KI 3","KI 4","KI 3","KI 4","KI 3","KI 4","KI 3","KI 4","KI 3","KI 4","KI 3","KI 4","KI 3","KI 4","KI 3","KI 4","KI 3","KI 4"]
[1,1023,"Adi Ismail",null,null,null,null,null,null,null,null,null,null,null,null,null,null,null,null,null,null,null,null,null,null,null,null,null,null,null,null,null,null,null,null,null,null,null,null,{"$f":"SUM(E6:AM6)","v":0},{"$f":"AVERAGE(D6:AM6)","v":{"$error":"#DIV/0!"}},{"$f":"RANK(AN6,$AN$6:$AN$49)","v":1},null,null,null,"Selalu bersyukur, selalu berdoa sebelum melakukan kegiatan, toleran pada agama yang berbeda dan perlu meningkatkan ketaatan beribadah serta selalu bersikap santun, peduli,  percaya diri, dan perlu meningkatkan sikap jujur, disiplin, dan tanggungjawab",2,1]
[2,1025,"Adilla Reysan ",null,null,null,null,null,null,null,null,null,null,null,null,null,null,null,null,null,null,null,null,null,null,null,null,null,null,null,null,null,null,null,null,null,null,null,null,{"$f":"SUM(F7:AM7)","v":0},{"$error":"#DIV/0!"},{"$f":"RANK(AN7,$AN$6:$AN$49)","v":1},null,null,null,"Selalu bersyukur, selalu berdoa sebelum melakukan kegiatan, toleran pada agama yang berbeda dan perlu meningkatkan ketaatan beribadah serta selalu bersikap santun, peduli,  percaya diri, dan perlu meningkatkan sikap jujur, disiplin, dan tanggungjawab"]
[3,1026,"Aedo Nugroho Wicaksono",null,null,null,null,null,null,null,null,null,null,null,null,null,null,null,null,null,null,null,null,null,null,null,null,null,null,null,null,null,null,null,null,null,null,null,null,0,{"$error":"#DIV/0!"},1,null,null,null,"Selalu bersyukur, selalu berdoa sebelum melakukan kegiatan, toleran pada agama yang berbeda dan perlu meningkatkan ketaatan beribadah serta selalu bersikap santun, peduli,  percaya diri, dan perlu meningkatkan sikap jujur, disiplin, dan tanggungjawab"]
[4,1030,"Ahmad Syaeffullah",null,null,null,null,null,null,null,null,null,null,null,null,null,null,null,null,null,null,null,null,null,null,null,null,null,null,null,null,null,null,null,null,null,null,null,null,0,{"$error":"#DIV/0!"},1,null,null,null,"Selalu bersyukur, selalu berdoa sebelum melakukan kegiatan, toleran pada agama yang berbeda dan perlu meningkatkan ketaatan beribadah serta selalu bersikap santun, peduli,  percaya diri, dan perlu meningkatkan sikap jujur, disiplin, dan tanggungjawab"]
[5,1043,"Andre Putra Pratama",null,null,null,null,null,null,null,null,null,null,null,null,null,null,null,null,null,null,null,null,null,null,null,null,null,null,null,null,null,null,null,null,null,null,null,null,0,{"$error":"#DIV/0!"},1,null,null,null,"Selalu bersyukur, selalu berdoa sebelum melakukan kegiatan, toleran pada agama yang berbeda dan perlu meningkatkan ketaatan beribadah serta selalu bersikap santun, peduli,  percaya diri, dan perlu meningkatkan sikap jujur, disiplin, dan tanggungjawab"]
[6,1046,"Andy Setiawan",null,null,null,null,null,null,null,null,null,null,null,null,null,null,null,null,null,null,null,null,null,null,null,null,null,null,null,null,null,null,null,null,null,null,null,null,0,{"$error":"#DIV/0!"},1,null,null,null,"Selalu bersyukur, selalu berdoa sebelum melakukan kegiatan, toleran pada agama yang berbeda dan perlu meningkatkan ketaatan beribadah serta selalu bersikap santun, peduli,  percaya diri, dan perlu meningkatkan sikap jujur, disiplin, dan tanggungjawab"]
[7,1051,"Anwar Fathoni",null,null,null,null,null,null,null,null,null,null,null,null,null,null,null,null,null,null,null,null,null,null,null,null,null,null,null,null,null,null,null,null,null,null,null,null,0,{"$error":"#DIV/0!"},1,null,null,null,"Selalu bersyukur, selalu berdoa sebelum melakukan kegiatan, toleran pada agama yang berbeda dan perlu meningkatkan ketaatan beribadah serta selalu bersikap santun, peduli,  percaya diri, dan perlu meningkatkan sikap jujur, disiplin, dan tanggungjawab"]
[8,1052,"Anwar Hafid",null,null,null,null,null,null,null,null,null,null,null,null,null,null,null,null,null,null,null,null,null,null,null,null,null,null,null,null,null,null,null,null,null,null,null,null,0,{"$error":"#DIV/0!"},1,null,null,null,"Selalu bersyukur, selalu berdoa sebelum melakukan kegiatan, toleran pada agama yang berbeda dan perlu meningkatkan ketaatan beribadah serta selalu bersikap santun, peduli,  percaya diri, dan perlu meningkatkan sikap jujur, disiplin, dan tanggungjawab"]
[9,1065,"Bayu Rindhita Muharram",null,null,null,null,null,null,null,null,null,null,null,null,null,null,null,null,null,null,null,null,null,null,null,null,null,null,null,null,null,null,null,null,null,null,null,null,0,{"$error":"#DIV/0!"},1,null,null,null,"Selalu bersyukur, selalu berdoa sebelum melakukan kegiatan, toleran pada agama yang berbeda dan perlu meningkatkan ketaatan beribadah serta selalu bersikap santun, peduli,  percaya diri, dan perlu meningkatkan sikap jujur, disiplin, dan tanggungjawab"]
[10,1066,"Berliana Syela Fajrin",null,null,null,null,null,null,null,null,null,null,null,null,null,null,null,null,null,null,null,null,null,null,null,null,null,null,null,null,null,null,null,null,null,null,null,null,0,{"$error":"#DIV/0!"},1,null,null,null,"Selalu bersyukur, selalu berdoa sebelum melakukan kegiatan, toleran pada agama yang berbeda dan perlu meningkatkan ketaatan beribadah serta selalu bersikap santun, peduli,  percaya diri, dan perlu meningkatkan sikap jujur, disiplin, dan tanggungjawab"]
[11,1069,"Danang Busro Cahyo Bekti",null,null,null,null,null,null,null,null,null,null,null,null,null,null,null,null,null,null,null,null,null,null,null,null,null,null,null,null,null,null,null,null,null,null,null,null,0,{"$error":"#DIV/0!"},1,null,null,null,"Selalu bersyukur, selalu berdoa sebelum melakukan kegiatan, toleran pada agama yang berbeda dan perlu meningkatkan ketaatan beribadah serta selalu bersikap santun, peduli,  percaya diri, dan perlu meningkatkan sikap jujur, disiplin, dan tanggungjawab"]
[12,1091,"Faisal Rakhmadhani",null,null,null,null,null,null,null,null,null,null,null,null,null,null,null,null,null,null,null,null,null,null,null,null,null,null,null,null,null,null,null,null,null,null,null,null,0,{"$error":"#DIV/0!"},1,null,null,null,"Selalu bersyukur, selalu berdoa sebelum melakukan kegiatan, toleran pada agama yang berbeda dan perlu meningkatkan ketaatan beribadah serta selalu bersikap santun, peduli,  percaya diri, dan perlu meningkatkan sikap jujur, disiplin, dan tanggungjawab"]
[13,1093,"Fajar Tri Admaja",null,null,null,null,null,null,null,null,null,null,null,null,null,null,null,null,null,null,null,null,null,null,null,null,null,null,null,null,null,null,null,null,null,null,null,null,0,{"$error":"#DIV/0!"},1,null,null,null,"Selalu bersyukur, selalu berdoa sebelum melakukan kegiatan, toleran pada agama yang berbeda dan perlu meningkatkan ketaatan beribadah serta selalu bersikap santun, peduli,  percaya diri, dan perlu meningkatkan sikap jujur, disiplin, dan tanggungjawab"]
[14,1097,"Farhan Maulana",null,null,null,null,null,null,null,null,null,null,null,null,null,null,null,null,null,null,null,null,null,null,null,null,null,null,null,null,null,null,null,null,null,null,null,null,0,{"$error":"#DIV/0!"},1,null,null,null,"Selalu bersyukur, selalu berdoa sebelum melakukan kegiatan, toleran pada agama yang berbeda dan perlu meningkatkan ketaatan beribadah serta selalu bersikap santun, peduli,  percaya diri, dan perlu meningkatkan sikap jujur, disiplin, dan tanggungjawab"]
[15,1108,"Gusniawan",null,null,null,null,null,null,null,null,null,null,null,null,null,null,null,null,null,null,null,null,null,null,null,null,null,null,null,null,null,null,null,null,null,null,null,null,0,{"$error":"#DIV/0!"},1,null,null,null,"Selalu bersyukur, selalu berdoa sebelum melakukan kegiatan, toleran pada agama yang berbeda dan perlu meningkatkan ketaatan beribadah serta selalu bersikap santun, peduli,  percaya diri, dan perlu meningkatkan sikap jujur, disiplin, dan tanggungjawab"]
{"$rows_left_out":37}
{"sheet":"deskripsi","index":2,"n_rows":48,"n_cols":37,"rows_kept":48,"cut":false,"hidden":false,"merged":[[2,35,2,36],[2,15,2,16],[2,17,2,18],[2,19,2,20],[2,21,2,22],[2,23,2,24],[2,25,2,26],[2,27,2,28],[2,29,2,30],[2,33,2,34],[2,31,2,32],[2,13,2,14],[2,3,2,4],[2,5,2,6],[2,7,2,8],[2,9,2,10],[2,11,2,12]]}
[]
[]
["No.","NIS","Nama Siswa",{"$f":"leger!D4","v":"PAI"},null,{"$f":"leger!F4","v":"PKN"},null,{"$f":"leger!H4","v":"B.Ind"},null,{"$f":"leger!J4","v":"MTK"},null,{"$f":"leger!L4","v":"Sejarah"},null,{"$f":"leger!N4","v":"B.Ing"},null,{"$f":"leger!P4","v":"KWU"},null,{"$f":"leger!R4","v":"Penjasor"},null,{"$f":"leger!T4","v":"Simdig"},null,{"$f":"leger!V4","v":"P.komBisnis"},null,{"$f":"leger!X4","v":"Adm Umum"},null,{"$f":"leger!Z4","v":"Tek.Inf. Jar"},null,{"$f":"leger!AB4","v":"RBJ"},null,{"$f":"leger!AD4","v":"Adm Server"},null,{"$f":"leger!AH4","v":"PPK"},null,{"$f":"leger!AJ4","v":"Buss. English"},null,{"$f":"leger!AL4","v":"Siklus Akun"}]
[null,null,null,"Pengetahuan","Keterampilan","Pengetahuan","Keterampilan","Pengetahuan","Keterampilan","Pengetahuan","Keterampilan","Pengetahuan","Keterampilan","Pengetahuan","Keterampilan","Pengetahuan","Keterampilan","Pengetahuan","Keterampilan","Pengetahuan","Keterampilan","Pengetahuan","Keterampilan","Pengetahuan","Keterampilan","Pengetahuan","Keterampilan","Pengetahuan","Keterampilan","Pengetahuan","Keterampilan",null,null,"Pengetahuan","Keterampilan","Pengetahuan","Keterampilan"]
[1,{"$f":"leger!B6","v":1023},{"$f":"leger!C6","v":"Adi Ismail"},"contoh","contoh"]
[2,{"$f":"leger!B7","v":1025},{"$f":"leger!C7","v":"Adilla Reysan "}]
[3,{"$f":"leger!B8","v":1026},{"$f":"leger!C8","v":"Aedo Nugroho Wicaksono"}]
[4,{"$f":"leger!B9","v":1030},{"$f":"leger!C9","v":"Ahmad Syaeffullah"}]
[5,{"$f":"leger!B10","v":1043},{"$f":"leger!C10","v":"Andre Putra Pratama"}]
[6,{"$f":"leger!B11","v":1046},{"$f":"leger!C11","v":"Andy Setiawan"}]
[7,{"$f":"leger!B12","v":1051},{"$f":"leger!C12","v":"Anwar Fathoni"}]
[8,{"$f":"leger!B13","v":1052},{"$f":"leger!C13","v":"Anwar Hafid"}]
[9,{"$f":"leger!B14","v":1065},{"$f":"leger!C14","v":"Bayu Rindhita Muharram"}]
[10,{"$f":"leger!B15","v":1066},{"$f":"leger!C15","v":"Berliana Syela Fajrin"}]
[11,{"$f":"leger!B16","v":1069},{"$f":"leger!C16","v":"Danang Busro Cahyo Bekti"}]
[12,{"$f":"leger!B17","v":1091},{"$f":"leger!C17","v":"Faisal Rakhmadhani"}]
[13,{"$f":"leger!B18","v":1093},{"$f":"leger!C18","v":"Fajar Tri Admaja"}]
[14,{"$f":"leger!B19","v":1097},{"$f":"leger!C19","v":"Farhan Maulana"}]
[15,{"$f":"leger!B20","v":1108},{"$f":"leger!C20","v":"Gusniawan"}]
[16,{"$f":"leger!B21","v":1113},{"$f":"leger!C21","v":"Ikbal Maulana Razaaq"}]
{"$rows_left_out":29}
{"sheet":"Ekskul","index":3,"n_rows":47,"n_cols":12,"rows_kept":47,"cut":false,"hidden":false,"merged":[[1,0,2,0],[1,1,2,1],[1,2,2,2],[1,6,1,8],[1,9,1,11],[1,3,1,5]]}
[]
["No.","NIS","Nama Siswa","Kegiatan Ekskul",null,null,"Nilai Ekskul",null,null,"Keterangan"]
[null,null,null,"Ekskul Wajib","Ekskul Tambahan 1","Ekskul Tambahan 2","Ekskul Wajib","Ekskul Tambahan 1","Ekskul Tambahan 2","Ekskul Wajib","Ekskul Tambahan 1","Ekskul Tambahan 2"]
[1,{"$f":"leger!B6","v":1023},{"$f":"leger!C6","v":"Adi Ismail"},"Praja Muda Karana (Pramuka)","Silat",null,"A","B",null,{"$f":"IF(G4=\"A\",\"Melaksanakan kegiatan pramuka dengan Sangat Baik\",IF(G4=\"B\",\"Melaksanakan kegiatan pramuka dengan Baik\",IF(G4=\"C\",\"Melaksanakan kegiatan pramuka dengan Cukup Baik\",\"\")))","v":"Melaksanakan kegiatan pramuka dengan Sangat Baik"},{"$f":"IF(H4=\"A\",\"Melaksanakan kegiatan \" &E4& \" dengan Sangat Baik\",IF(H4=\"B\",\"Melaksanakan kegiatan \" &E4& \" dengan Baik\",IF(H4=\"C\",\"Melaksanakan kegiatan \" &E4& \" dengan Cukup Baik\",\"\")))","v":"Melaksanakan kegiatan Silat dengan Baik"},{"$f":"IF(I4=\"A\",\"Melaksanakan kegiatan \" &F4& \" dengan Sangat Baik\",IF(I4=\"B\",\"Melaksanakan kegiatan \" &F4& \" dengan Baik\",IF(I4=\"C\",\"Melaksanakan kegiatan \" &F4& \" dengan Cukup Baik\",\"\")))","v":""}]
[2,{"$f":"leger!B7","v":1025},{"$f":"leger!C7","v":"Adilla Reysan "},null,null,null,null,null,null,{"$f":"IF(G5=\"A\",\"Melaksanakan kegiatan pramuka dengan Sangat Baik\",IF(G5=\"B\",\"Melaksanakan kegiatan pramuka dengan Baik\",IF(G5=\"C\",\"Melaksanakan kegiatan pramuka dengan Cukup Baik\",\"\")))","v":""},{"$f":"IF(H5=\"A\",\"Melaksanakan kegiatan \" &E5& \" dengan Sangat Baik\",IF(H5=\"B\",\"Melaksanakan kegiatan \" &E5& \" dengan Baik\",IF(H5=\"C\",\"Melaksanakan kegiatan \" &E5& \" dengan Cukup Baik\",\"\")))","v":""},{"$f":"IF(I5=\"A\",\"Melaksanakan kegiatan \" &F5& \" dengan Sangat Baik\",IF(I5=\"B\",\"Melaksanakan kegiatan \" &F5& \" dengan Baik\",IF(I5=\"C\",\"Melaksanakan kegiatan \" &F5& \" dengan Cukup Baik\",\"\")))","v":""}]
[3,{"$f":"leger!B8","v":1026},{"$f":"leger!C8","v":"Aedo Nugroho Wicaksono"},null,null,null,null,null,null,{"$f":"IF(G6=\"A\",\"Melaksanakan kegiatan pramuka dengan Sangat Baik\",IF(G6=\"B\",\"Melaksanakan kegiatan pramuka dengan Baik\",IF(G6=\"C\",\"Melaksanakan kegiatan pramuka dengan Cukup Baik\",\"\")))","v":""},"",""]
[4,{"$f":"leger!B9","v":1030},{"$f":"leger!C9","v":"Ahmad Syaeffullah"},null,null,null,null,null,null,"","",""]
[5,{"$f":"leger!B10","v":1043},{"$f":"leger!C10","v":"Andre Putra Pratama"},null,null,null,null,null,null,"","",""]
[6,{"$f":"leger!B11","v":1046},{"$f":"leger!C11","v":"Andy Setiawan"},null,null,null,null,null,null,"","",""]
[7,{"$f":"leger!B12","v":1051},{"$f":"leger!C12","v":"Anwar Fathoni"},null,null,null,null,null,null,"","",""]
[8,{"$f":"leger!B13","v":1052},{"$f":"leger!C13","v":"Anwar Hafid"},null,null,null,null,null,null,"","",""]
[9,{"$f":"leger!B14","v":1065},{"$f":"leger!C14","v":"Bayu Rindhita Muharram"},null,null,null,null,null,null,"","",""]
[10,{"$f":"leger!B15","v":1066},{"$f":"leger!C15","v":"Berliana Syela Fajrin"},null,null,null,null,null,null,"","",""]
[11,{"$f":"leger!B16","v":1069},{"$f":"leger!C16","v":"Danang Busro Cahyo Bekti"},null,null,null,null,null,null,"","",""]
[12,{"$f":"leger!B17","v":1091},{"$f":"leger!C17","v":"Faisal Rakhmadhani"},null,null,null,null,null,null,"","",""]
[13,{"$f":"leger!B18","v":1093},{"$f":"leger!C18","v":"Fajar Tri Admaja"},null,null,null,null,null,null,"","",""]
[14,{"$f":"leger!B19","v":1097},{"$f":"leger!C19","v":"Farhan Maulana"},null,null,null,null,null,null,"","",""]
[15,{"$f":"leger!B20","v":1108},{"$f":"leger!C20","v":"Gusniawan"},null,null,null,null,null,null,"","",""]
[16,{"$f":"leger!B21","v":1113},{"$f":"leger!C21","v":"Ikbal Maulana Razaaq"},null,null,null,null,null,null,"","",""]
[17,{"$f":"leger!B22","v":1115},{"$f":"leger!C22","v":"Imaratif Sapria Nugroho"},null,null,null,null,null,null,"","",""]
{"$rows_left_out":28}
{"sheet":"DUDI","index":4,"n_rows":0,"n_cols":0,"rows_kept":0,"cut":false,"hidden":false,"merged":[]}

{"sheet":"Prestasi","index":5,"n_rows":47,"n_cols":12,"rows_kept":47,"cut":false,"hidden":false,"merged":[[1,9,1,11],[1,0,2,0],[1,1,2,1],[1,2,2,2],[1,3,1,5],[1,6,1,8]]}
[]
["No.","NIS","Nama Siswa","Jenis Prestasi",null,null,"Peringkat",null,null,"Keterangan"]
[null,null,null,"Prestasi 1","Prestasi 2","Prestasi 3","Prestasi 1","Prestasi 2","Prestasi 3","Prestasi 1","Prestasi 2","Prestasi 3"]
[1,{"$f":"leger!B6","v":1023},{"$f":"leger!C6","v":"Adi Ismail"},"Juara lomba lari tingkat Kecamatan",null,null,3,null,null,"lomba lari tingkat kecamatan jagakarsa"]
[2,{"$f":"leger!B7","v":1025},{"$f":"leger!C7","v":"Adilla Reysan "}]
[3,{"$f":"leger!B8","v":1026},{"$f":"leger!C8","v":"Aedo Nugroho Wicaksono"}]
[4,{"$f":"leger!B9","v":1030},{"$f":"leger!C9","v":"Ahmad Syaeffullah"}]
[5,{"$f":"leger!B10","v":1043},{"$f":"leger!C10","v":"Andre Putra Pratama"}]
[6,{"$f":"leger!B11","v":1046},{"$f":"leger!C11","v":"Andy Setiawan"}]
[7,{"$f":"leger!B12","v":1051},{"$f":"leger!C12","v":"Anwar Fathoni"}]
[8,{"$f":"leger!B13","v":1052},{"$f":"leger!C13","v":"Anwar Hafid"}]
[9,{"$f":"leger!B14","v":1065},{"$f":"leger!C14","v":"Bayu Rindhita Muharram"}]
[10,{"$f":"leger!B15","v":1066},{"$f":"leger!C15","v":"Berliana Syela Fajrin"}]
[11,{"$f":"leger!B16","v":1069},{"$f":"leger!C16","v":"Danang Busro Cahyo Bekti"}]
[12,{"$f":"leger!B17","v":1091},{"$f":"leger!C17","v":"Faisal Rakhmadhani"}]
[13,{"$f":"leger!B18","v":1093},{"$f":"leger!C18","v":"Fajar Tri Admaja"}]
[14,{"$f":"leger!B19","v":1097},{"$f":"leger!C19","v":"Farhan Maulana"}]
[15,{"$f":"leger!B20","v":1108},{"$f":"leger!C20","v":"Gusniawan"}]
[16,{"$f":"leger!B21","v":1113},{"$f":"leger!C21","v":"Ikbal Maulana Razaaq"}]
[17,{"$f":"leger!B22","v":1115},{"$f":"leger!C22","v":"Imaratif Sapria Nugroho"}]
{"$rows_left_out":27}