{"text_format":"1","workbook":"xlsx","n_sheets":9,"sheets":["Työkalun tiedot","Yhteenveto","Materiaalit","Valmistus","Kuljetus ja käyttö","Elinkaaren loppu","Päästökertoimet","Muut kertoimet","Misc."],"not_rendered":{"charts":8,"images":12,"macros":1,"external_links":0,"defined_names":100,"comments":5,"pivot_tables":0},"unopened":[],"bounds":{"document_bytes":16777216,"sheet_cells":100000,"rows_first":2000,"rows_last":500,"rows_between":2000,"halvings":0,"cell_chars":16384,"cell_head_chars":4096},"cells_cut":0,"cells_raw":0,"read":"whole","date_system":"1900"}

{"sheet":"Työkalun tiedot","index":0,"n_rows":48,"n_cols":6,"rows_kept":48,"cut":false,"hidden":false,"merged":[[2,1,2,12],[46,1,46,12],[3,12,16,12],[47,1,50,12],[19,1,19,12],[20,1,28,12],[31,1,31,12],[33,2,33,3],[32,2,32,3],[33,4,33,12],[36,1,40,12],[34,2,34,4],[34,5,34,12],[3,1,17,11],[42,1,42,12]]}
[null,"Tuotteen hiilijalanjäljen laskentatyökalu"]
[]
[null," Työkalun esittely"]
[null,"Tämän laskentatyökalun avulla, teollisuuden pk-yritykset voivat mallintaa tuotteiden hiilijalanjälkiä koko tuotteen elinkaaren ajalta. Elinkaaren vaiheisiin kuuluu luonnonvarojen talteenotto, kuljetus ja jalostus raaka-aineiksi, raaka-aineiden kuljetus ja tuotteiden valmistus, valmiiden tuotteiden kuljetus ja jakelu, tuotteiden käyttö ja tuotteiden hävittäminen.\n\nTyökalu on Seinäjoen Ammattikorkeakoulun (SeAMK) tuottama, osana SeAMKin koordinoimaa ESR rahoitteista  Ympäristöosaamisen kehittämisellä kohti kestävää teollisuutta hanketta. Työkalun on luonut Ilmastoapu Oy.\n\nYmpäristöosaamisen kehittämisellä kohti kestävää teollisuutta -hankkeessa päätavoite on kasvattaa teollisten pk-yritysten osaamista liittyen ympäristövaikutusten hallintaan ja vihreän liiketoiminnan mahdollisuuksiin. Hankkeen toteutuksesta vastaa SeAMK ja se on suunnattu Etelä-Pohjanmaan teollisuusalueella seuraaville kohderyhmille: teolliset mikro- ja pk-yritykset yrittäjistä muuhun henkilöstöön, SeAMKin henkilöstö, opiskelijat sekä työelämän ulkopuolella olevat. Välillisenä kohderyhmänä on kunnat."]
[]
[]
[]
[]
[]
[]
[]
[]
[]
[]
[]
{"$rows_left_out":34}
{"sheet":"Yhteenveto","index":1,"n_rows":127,"n_cols":28,"rows_kept":127,"cut":false,"hidden":false,"merged":[[110,2,110,6],[107,2,107,6],[108,2,108,6],[109,2,109,6],[3,2,3,22],[16,2,16,22],[5,13,5,15],[6,2,6,5],[7,2,7,5],[5,2,5,5],[9,2,9,5],[10,2,10,5],[5,6,5,11],[6,6,6,11],[9,6,9,11],[10,6,10,11],[63,4,63,6],[63,12,63,15],[63,18,63,22],[69,2,70,6],[69,11,70,15],[41,4,41,6],[47,2,48,6],[49,2,50,6],[17,2,17,22],[19,18,19,22],[19,4,19,6],[25,2,26,6],[27,2,28,6],[19,12,19,15],[27,11,28,15],[25,11,26,15],[85,4,85,6],[91,2,92,6],[93,2,94,6],[71,2,72,6],[71,11,72,15],[78,15,78,16]]}
[]
[null,null,"Tuotteen hiilijalanjäljen laskentatyökalu",null,null,null,null,null,null,null,null,null,null,null,null,null,null,null,null,null,null,null,null,null,2,null,0]
[]
[null,null," Laskennan perustiedot"]
[]
[null,null,"  Yritys",null,null,"  Yritys",null,null,null,null,null,null,null,"  Valitse laskennan rajaus"]
[null,null,"  Tuote",null,null,null,null,null,null,null,null,null,null,"       Cradle-to-gate"]
[null,null,"  Tuotteen kokonaismassa",null,null,"  Tuotteen kokonaismassa",{"$f":"Materiaalit!H6","v":0},"kg",null,null,null,null,null,"       Cradle-to-grave"]
[]
[null,null,"  Laskennan päiväys",null,null,"  Laskennan päiväys"]
[null,null,"  Laskennan suoritti"]
[]
[]
[]
[]
{"$rows_left_out":113}
{"sheet":"Materiaalit","index":2,"n_rows":25,"n_cols":60,"rows_kept":25,"cut":false,"hidden":false,"merged":[[4,7,4,9],[2,1,2,11],[14,1,14,11]]}
[null,"Tuotteen hiilijalanjäljen laskentatyökalu",null,null,null,null,null,null,null,null,null,null,null,null,null,1]
[]
[null," Tuotteen materiaalit"]
[]
[null," Osa, komponentti tai materiaali",null,"  Valitse materiaaliluokka",null," Valitse materiaali",null,"   Syötä määrä",null,null,null,"kg CO2e",null,null,null,null,null,"Laske materiaalit ehdon mukaan"]
[null,null,null,null,null,null,null,{"$f":"SUM(H7:H12)","v":0},null,null,null,null,null,null,null,null,null,null,null,null,null,null,null,null,null,null,null,null,null,null,null,null,null,"Osan nimi",{"$f":"SUM(AI7:AI12)","v":0},null,null,null,null,null,null,null,{"$f":"SUM(AQ7:AQ12)","v":0},0,0,0,0,0,0,0,0,0,0,0,0,0,0,0,0]
[null,null,null,null,null,null,null,null,{"$f":"IFERROR(VLOOKUP(F7,Päästökertoimet!$B$6:'Päästökertoimet'!$D$737,3,FALSE),\"\")","v":""},{"$f":"IF(H7>0,AI7/$AI$6*100,\"\")","v":""},{"$f":"IF(H7>0,\"%\",\"\")","v":""},{"$f":"IFERROR(VLOOKUP(F7,Päästökertoimet!$B$6:'Päästökertoimet'!$C$737,2,FALSE)*H7,\"\")","v":""},null,null,null,null,null,{"$f":"SUMIF($D$7:D99,\"TERÄKSET\",AI7:AI99)","v":0},null,null,null,null,null,null,null,null,null,null,null,null,null,null,null,{"$f":"IF(B7=0,\"\",B7)","v":""},{"$f":"IFERROR(VLOOKUP(F7,Päästökertoimet!$B$6:'Päästökertoimet'!$E$737,4,FALSE)*H7,0)","v":0},{"$f":"IF(D7=0,\"\",D7)","v":""},null,null,{"$f":"IF(B7=0,\"\",B7)","v":""},{"$f":"IFERROR(VLOOKUP(F7,Päästökertoimet!$B$6:'Päästökertoimet'!$C$737,2,FALSE),\"\")","v":""},null,null,{"$f":"IF(D7=\"AUTOMAATIOKOMPONENTIT\",AI7,0)","v":0},{"$f":"IF(D7=\"MEKANIIKKAKOMPONENTIT\",AI7,0)","v":0},{"$f":"IF(D7=\"VALAISTUS_JA_ELEKTRONIIKKA\",AI7,0)","v":0},{"$f":"IF(D7=\"KIINNITYSTARVIKKEET\",AI7,0)","v":0},{"$f":"IF(D7=\"TERÄKSET\",AI7,0)","v":0},{"$f":"IF(D7=\"RUOSTUMATTOMAT_TERÄKSET\",AI7,0)","v":0},{"$f":"IF(D7=\"MUUT_METALLIT\",AI7,0)","v":0},{"$f":"IF(D7=\"KUMI\",AI7,0)","v":0},{"$f":"IF(D7=\"MUOVIT\",AI7,0)","v":0},{"$f":"IF(D7=\"LASI\",AI7,0)","v":0},{"$f":"IF(D7=\"PUUTUOTTEET\",AI7,0)","v":0},{"$f":"IF(D7=\"TEKSTIILIT_JA_TEKSTIILIKUIDUT\",AI7,0)","v":0},{"$f":"IF(D7=\"LIIMAT\",AI7,0)","v":0},{"$f":"IF(D7=\"MAALIT_JA_LIUOTTIMET\",AI7,0)","v":0},{"$f":"IF(D7=\"ERIKOISPINNOITTEET\",AI7,0)","v":0},{"$f":"IF(D7=\"PAKKAUSMATERIAALIT\",AI7,0)","v":0},{"$f":"IF(D7=\"LUOKITTELEMATTOMAT_MATERIAALIT\",AI7,0)","v":0}]
[null,null,null,null,null,null,null,null,{"$f":"IFERROR(VLOOKUP(F8,Päästökertoimet!$B$6:'Päästökertoimet'!$D$737,3,FALSE),\"\")","v":""},{"$f":"IF(H8>0,AI8/$AI$6*100,\"\")","v":""},{"$f":"IF(H8>0,\"%\",\"\")","v":""},{"$f":"IFERROR(VLOOKUP(F8,Päästökertoimet!$B$6:'Päästökertoimet'!$C$737,2,FALSE)*H8,\"\")","v":""},null,null,null,null,null,null,null,null,null,null,null,null,null,null,null,null,null,null,null,null,null,"",{"$f":"IFERROR(VLOOKUP(F8,Päästökertoimet!$B$6:'Päästökertoimet'!$E$737,4,FALSE)*H8,0)","v":0},{"$f":"IF(D8=0,\"\",D8)","v":""},null,null,{"$f":"IF(B8=0,\"\",B8)","v":""},{"$f":"IFERROR(VLOOKUP(F8,Päästökertoimet!$B$6:'Päästökertoimet'!$C$737,2,FALSE),\"\")","v":""},null,null,{"$f":"IF(D8=\"AUTOMAATIOKOMPONENTIT\",AI8,0)","v":0},{"$f":"IF(D8=\"MEKANIIKKAKOMPONENTIT\",AI8,0)","v":0},{"$f":"IF(D8=\"VALAISTUS_JA_ELEKTRONIIKKA\",AI8,0)","v":0},{"$f":"IF(D8=\"KIINNITYSTARVIKKEET\",AI8,0)","v":0},{"$f":"IF(D8=\"TERÄKSET\",AI8,0)","v":0},{"$f":"IF(D8=\"RUOSTUMATTOMAT_TERÄKSET\",AI8,0)","v":0},{"$f":"IF(D8=\"MUUT_METALLIT\",AI8,0)","v":0},{"$f":"IF(D8=\"KUMI\",AI8,0)","v":0},{"$f":"IF(D8=\"MUOVIT\",AI8,0)","v":0},{"$f":"IF(D8=\"LASI\",AI8,0)","v":0},{"$f":"IF(D8=\"PUUTUOTTEET\",AI8,0)","v":0},{"$f":"IF(D8=\"TEKSTIILIT_JA_TEKSTIILIKUIDUT\",AI8,0)","v":0},{"$f":"IF(D8=\"LIIMAT\",AI8,0)","v":0},{"$f":"IF(D8=\"MAALIT_JA_LIUOTTIMET\",AI8,0)","v":0},{"$f":"IF(D8=\"ERIKOISPINNOITTEET\",AI8,0)","v":0},{"$f":"IF(D8=\"PAKKAUSMATERIAALIT\",AI8,0)","v":0},{"$f":"IF(D8=\"LUOKITTELEMATTOMAT_MATERIAALIT\",AI8,0)","v":0}]
[null,null,null,null,null,null,null,null,{"$f":"IFERROR(VLOOKUP(F9,Päästökertoimet!$B$6:'Päästökertoimet'!$D$737,3,FALSE),\"\")","v":""},{"$f":"IF(H9>0,AI9/$AI$6*100,\"\")","v":""},{"$f":"IF(H9>0,\"%\",\"\")","v":""},{"$f":"IFERROR(VLOOKUP(F9,Päästökertoimet!$B$6:'Päästökertoimet'!$C$737,2,FALSE)*H9,\"\")","v":""},null,null,null,null,null,null,null,null,null,null,null,null,null,null,null,null,null,null,null,null,null,{"$f":"IF(B9=0,\"\",B9)","v":""},{"$f":"IFERROR(VLOOKUP(F9,Päästökertoimet!$B$6:'Päästökertoimet'!$E$737,4,FALSE)*H9,0)","v":0},{"$f":"IF(D9=0,\"\",D9)","v":""},null,null,{"$f":"IF(B9=0,\"\",B9)","v":""},{"$f":"IFERROR(VLOOKUP(F9,Päästökertoimet!$B$6:'Päästökertoimet'!$C$737,2,FALSE),\"\")","v":""},null,null,0,0,0,0,0,0,0,0,0,0,0,0,0,0,0,0,0]
[null,null,null,null,null,null,null,null,{"$f":"IFERROR(VLOOKUP(F10,Päästökertoimet!$B$6:'Päästökertoimet'!$D$737,3,FALSE),\"\")","v":""},{"$f":"IF(H10>0,AI10/$AI$6*100,\"\")","v":""},{"$f":"IF(H10>0,\"%\",\"\")","v":""},{"$f":"IFERROR(VLOOKUP(F10,Päästökertoimet!$B$6:'Päästökertoimet'!$C$737,2,FALSE)*H10,\"\")","v":""},null,null,null,null,null,null,null,null,null,null,null,null,null,null,null,null,null,null,null,null,null,{"$f":"IF(B10=0,\"\",B10)","v":""},{"$f":"IFERROR(VLOOKUP(F10,Päästökertoimet!$B$6:'Päästökertoimet'!$E$737,4,FALSE)*H10,0)","v":0},{"$f":"IF(D10=0,\"\",D10)","v":""},null,null,{"$f":"IF(B10=0,\"\",B10)","v":""},{"$f":"IFERROR(VLOOKUP(F10,Päästökertoimet!$B$6:'Päästökertoimet'!$C$737,2,FALSE),\"\")","v":""},null,null,0,0,0,0,0,0,0,0,0,0,0,0,0,0,0,0,0]
[null,null,null,null,null,null,null,null,{"$f":"IFERROR(VLOOKUP(F11,Päästökertoimet!$B$6:'Päästökertoimet'!$D$737,3,FALSE),\"\")","v":""},{"$f":"IF(H11>0,AI11/$AI$6*100,\"\")","v":""},{"$f":"IF(H11>0,\"%\",\"\")","v":""},{"$f":"IFERROR(VLOOKUP(F11,Päästökertoimet!$B$6:'Päästökertoimet'!$C$737,2,FALSE)*H11,\"\")","v":""},null,null,null,null,null,null,null,null,null,null,null,null,null,null,null,null,null,null,null,null,null,{"$f":"IF(B11=0,\"\",B11)","v":""},{"$f":"IFERROR(VLOOKUP(F11,Päästökertoimet!$B$6:'Päästökertoimet'!$E$737,4,FALSE)*H11,0)","v":0},{"$f":"IF(D11=0,\"\",D11)","v":""},null,null,{"$f":"IF(B11=0,\"\",B11)","v":""},{"$f":"IFERROR(VLOOKUP(F11,Päästökertoimet!$B$6:'Päästökertoimet'!$C$737,2,FALSE),\"\")","v":""},null,null,0,0,0,0,0,0,0,0,0,0,0,0,0,0,0,0,0]
[null,null,null,null,null,null,null,null,{"$f":"IFERROR(VLOOKUP(F12,Päästökertoimet!$B$6:'Päästökertoimet'!$D$737,3,FALSE),\"\")","v":""},{"$f":"H12/$H$6*100","v":{"$error":"#DIV/0!"}},null,{"$f":"IFERROR(VLOOKUP(F12,Päästökertoimet!$B$6:'Päästökertoimet'!$C$737,2,FALSE)*H12,0)","v":0},null,null,null,null,null,null,null,null,null,null,null,null,null,null,null,null,null,null,null,null,null,"",{"$f":"IFERROR(VLOOKUP(F12,Päästökertoimet!$B$6:'Päästökertoimet'!$E$737,4,FALSE)*H12,0)","v":0},"",null,{"$f":"IFERROR(VLOOKUP(F12,Päästökertoimet!$B$6:'Päästökertoimet'!$C$737,2,FALSE),\"\")","v":""},"",{"$f":"IFERROR(VLOOKUP(F12,Päästökertoimet!$B$6:'Päästökertoimet'!$C$737,2,FALSE),\"\")","v":""},null,null,0,0,0,0,0,0,0,0,0,0,0,0,0,0,0,0,0]
[null,null,null,null,null,null,null,null,null,null,null,{"$f":"SUM(L7:L12)","v":0}]
[]
[null," Materiaalien kuljetus"]
{"$rows_left_out":11}
{"sheet":"Valmistus","index":3,"n_rows":69,"n_cols":61,"rows_kept":69,"cut":false,"hidden":false,"merged":[[60,1,60,11],[50,3,50,5],[4,7,4,9],[2,1,2,13],[36,1,36,15],[48,1,48,7],[24,1,24,11]]}
[null,"Tuotteen hiilijalanjäljen laskentatyökalu",null,null,null,null,null,null,null,null,null,null,null,null,null,null,null,null,null,null,null,null,null,null,1]
[]
[null," Valmistusprosessien energian kulutus"]
[]
[null," Valitse valmistettava osa",null,"Tuotantoprosessin kuvaus ",null,"  Kulutettu energia","tai","                Valitse tuotantomenetelmä",null,null,null,"Valitse energiamuoto",null,"kg CO2e"]
[]
[null,null,null,null,null,null,"kWh",null,null,{"$f":"IFERROR(VLOOKUP(H7,'Muut kertoimet'!$B$4:'Muut kertoimet'!$C$732,2,FALSE)*AK7,\"\")","v":""},"kWh",null,null,{"$f":"IFERROR(AO7,\"\")","v":""},null,null,null,null,null,null,null,null,null,null,null,null,null,null,null,null,null,null,null,null,null,null,{"$f":"IFERROR(VLOOKUP(B7,Materiaalit!$AH$7:$AI$189,2,FALSE),\"\")","v":""},{"$f":"IFERROR(VLOOKUP(L7,Päästökertoimet!$B$6:'Päästökertoimet'!$C$737,2,FALSE),\"\")","v":""},{"$f":"IF(J7<>\"\",J7,\"\")","v":""},{"$f":"IF(J7=\"\",F7,\"\")","v":0},{"$f":"SUM(AM7:AN7)*AL7","v":{"$error":"#VALUE!"}}]
[null,null,null,null,null,null,"kWh",null,null,{"$f":"IFERROR(VLOOKUP(H8,'Muut kertoimet'!$B$4:'Muut kertoimet'!$C$732,2,FALSE)*AK8,\"\")","v":""},"kWh",null,null,"",null,null,null,null,null,null,null,null,null,null,null,null,null,null,null,null,null,null,null,null,null,null,{"$f":"IFERROR(VLOOKUP(B8,Materiaalit!$AH$7:$AI$189,2,FALSE),\"\")","v":""},{"$f":"IFERROR(VLOOKUP(L8,Päästökertoimet!$B$6:'Päästökertoimet'!$C$737,2,FALSE),\"\")","v":""},{"$f":"IF(J8<>\"\",J8,\"\")","v":""},0,{"$f":"SUM(AM8:AN8)*AL8","v":{"$error":"#VALUE!"}}]
[null,null,null,null,null,null,"kWh",null,null,{"$f":"IFERROR(VLOOKUP(H9,'Muut kertoimet'!$B$4:'Muut kertoimet'!$C$732,2,FALSE)*AK9,\"\")","v":""},"kWh",null,null,"",null,null,null,null,null,null,null,null,null,null,null,null,null,null,null,null,null,null,null,null,null,null,{"$f":"IFERROR(VLOOKUP(B9,Materiaalit!$AH$7:$AI$189,2,FALSE),\"\")","v":""},{"$f":"IFERROR(VLOOKUP(L9,Päästökertoimet!$B$6:'Päästökertoimet'!$C$737,2,FALSE),\"\")","v":""},"",0,{"$f":"SUM(AM9:AN9)*AL9","v":{"$error":"#VALUE!"}}]
[null,null,null,null,null,null,"kWh",null,null,{"$f":"IFERROR(VLOOKUP(H10,'Muut kertoimet'!$B$4:'Muut kertoimet'!$C$732,2,FALSE)*AK10,\"\")","v":""},"kWh",null,null,"",null,null,null,null,null,null,null,null,null,null,null,null,null,null,null,null,null,null,null,null,null,null,{"$f":"IFERROR(VLOOKUP(B10,Materiaalit!$AH$7:$AI$189,2,FALSE),\"\")","v":""},{"$f":"IFERROR(VLOOKUP(L10,Päästökertoimet!$B$6:'Päästökertoimet'!$C$737,2,FALSE),\"\")","v":""},{"$f":"IF(J10<>\"\",J10,\"\")","v":""},0,{"$error":"#VALUE!"}]
[null,null,null,null,null,null,"kWh",null,null,{"$f":"IFERROR(VLOOKUP(H11,'Muut kertoimet'!$B$4:'Muut kertoimet'!$C$732,2,FALSE)*AK11,\"\")","v":""},"kWh",null,null,"",null,null,null,null,null,null,null,null,null,null,null,null,null,null,null,null,null,null,null,null,null,null,{"$f":"IFERROR(VLOOKUP(B11,Materiaalit!$AH$7:$AI$189,2,FALSE),\"\")","v":""},{"$f":"IFERROR(VLOOKUP(L11,Päästökertoimet!$B$6:'Päästökertoimet'!$C$737,2,FALSE),\"\")","v":""},{"$f":"IF(J11<>\"\",J11,\"\")","v":""},0,{"$error":"#VALUE!"}]
[null,null,null,null,null,null,null,null,null,{"$f":"#REF!/#REF!*100","v":{"$error":"#REF!"}},null,null,null,{"$f":"IFERROR(VLOOKUP(#REF!,Päästökertoimet!$B$6:'Päästökertoimet'!$C$737,2,FALSE)*#REF!,0)","v":0},null,null,null,null,null,null,null,null,null,null,null,null,null,null,null,null,null,null,null,null,null,null,{"$f":"IFERROR(VLOOKUP(B12,Materiaalit!$AH$7:$AI$189,2,FALSE),\"\")","v":""},{"$f":"IFERROR(VLOOKUP(L12,Päästökertoimet!$B$6:'Päästökertoimet'!$C$737,2,FALSE),\"\")","v":""},{"$error":"#REF!"},{"$f":"IF(J12=\"\",#REF!,\"\")","v":{"$error":"#REF!"}},{"$error":"#REF!"}]
[null,null,null,null,null,null,null,null,null,null,null,null,null,{"$f":"SUM(N7:N12)","v":0}]
[]
[null," Valmistusprosessien polttoaineen kulutus"]
{"$rows_left_out":55}
{"sheet":"Kuljetus ja käyttö","index":4,"n_rows":44,"n_cols":14,"rows_kept":44,"cut":false,"hidden":false,"merged":[[2,1,2,9],[13,1,13,9],[23,1,23,9],[25,5,25,6],[32,5,32,6],[4,5,4,7],[20,5,20,6],[15,5,15,6]]}
[null,"Tuotteen hiilijalanjäljen laskentatyökalu",null,null,null,null,null,null,null,null,null,null,null,1]
[]
[null," Valmiin tuotteen kuljetus"]
[]
[null," Valitse kuljetustapa",null,"Valitse kuljetusväline",null,"       Syötä kuljetusmatka   ",null,null,null,"kg CO2e"]
[null,null,null,null,null,{"$f":"SUM(F7:F11)","v":0}]
[null,null,null,null,null,null,{"$f":"IF(B7>0,\"km\",\"\")","v":""},{"$f":"IF(B7>0,Yhteenveto!$G$8/1000*F7,\"\")","v":""},{"$f":"IF(F7>0,\"tkm\",\"\")","v":""},{"$f":"IFERROR(VLOOKUP(D7,Päästökertoimet!$B$4:$C$613,2,FALSE)*H7,\"\")","v":""}]
[null,null,null,null,null,null,"",{"$f":"IF(B8>0,Yhteenveto!$G$8/1000*F8,\"\")","v":""},{"$f":"IF(F8>0,\"tkm\",\"\")","v":""},{"$f":"IFERROR(VLOOKUP(D8,Päästökertoimet!$B$4:$C$613,2,FALSE)*H8,\"\")","v":""}]
[null,null,null,null,null,null,"",{"$f":"IF(B9>0,Yhteenveto!$G$8/1000*F9,\"\")","v":""},{"$f":"IF(F9>0,\"tkm\",\"\")","v":""},{"$f":"IFERROR(VLOOKUP(D9,Päästökertoimet!$B$4:$C$613,2,FALSE)*H9,\"\")","v":""}]
[null,null,null,null,null,null,{"$f":"IF(B10>0,\"km\",\"\")","v":""},{"$f":"IF(B10>0,Yhteenveto!$G$8/1000*F10,\"\")","v":""},{"$f":"IF(F10>0,\"tkm\",\"\")","v":""},{"$f":"IFERROR(VLOOKUP(D10,Päästökertoimet!$B$4:$C$613,2,FALSE)*H10,\"\")","v":""}]
[null,null,null,null,null,null,{"$f":"IFERROR(VLOOKUP(#REF!,Päästökertoimet!$B$6:'Päästökertoimet'!$D$737,3,FALSE),\"\")","v":""},null,{"$f":"IF(B11>0,Yhteenveto!$G$8/1000*F11,\"\")","v":""},{"$f":"IFERROR(VLOOKUP(D11,'Muut kertoimet'!$B$4:$C$584,2,FALSE)*I11,\"\")","v":""}]
[null,null,null,null,null,null,null,null,null,{"$f":"SUM(J7:J11)","v":0}]
[]
[null," Tuotteen käytönaikainen energiankulutus"]
[]
{"$rows_left_out":30}
{"sheet":"Elinkaaren loppu","index":5,"n_rows":23,"n_cols":21,"rows_kept":23,"cut":false,"hidden":false,"merged":[[2,1,2,6]]}
[null,"Tuotteen hiilijalanjäljen laskentatyökalu"]
[]
[null,"Tuotteen hävittäminen"]
[]
[null," Jätelaji",null,"          Syötä määrä",null,null,"kg CO2e"]
[]
[null,"Pahvi",null,null,"kg",null,{"$f":"IF(D7>0,U7,\"\")","v":""},null,null,null,null,null,null,null,null,null,null,null,null,null,{"$f":"IFERROR(VLOOKUP(B7,Päästökertoimet!$B$6:'Päästökertoimet'!$C$737,2,FALSE)*D7,\"\")","v":0}]
[null,"Keräyspaperi",null,null,"kg",null,{"$f":"IF(D8>0,U8,\"\")","v":""},null,null,null,null,null,null,null,null,null,null,null,null,null,{"$f":"IFERROR(VLOOKUP(B8,Päästökertoimet!$B$6:'Päästökertoimet'!$C$737,2,FALSE)*D8,\"\")","v":0}]
[null,"Keräyslasi",null,null,"kg",null,"",null,null,null,null,null,null,null,null,null,null,null,null,null,{"$f":"IFERROR(VLOOKUP(B9,Päästökertoimet!$B$6:'Päästökertoimet'!$C$737,2,FALSE)*D9,\"\")","v":0}]
[null,"Keräysmuovi",null,null,"kg",null,"",null,null,null,null,null,null,null,null,null,null,null,null,null,{"$f":"IFERROR(VLOOKUP(B10,Päästökertoimet!$B$6:'Päästökertoimet'!$C$737,2,FALSE)*D10,\"\")","v":0}]
[null,"Metalli",null,null,"kg",null,"",null,null,null,null,null,null,null,null,null,null,null,null,null,{"$f":"IFERROR(VLOOKUP(B11,Päästökertoimet!$B$6:'Päästökertoimet'!$C$737,2,FALSE)*D11,\"\")","v":0}]
[null,"Akut, paristot",null,null,"kg",null,"",null,null,null,null,null,null,null,null,null,null,null,null,null,{"$f":"IFERROR(VLOOKUP(B12,Päästökertoimet!$B$6:'Päästökertoimet'!$C$737,2,FALSE)*D12,\"\")","v":0}]
[null,"Muovi",null,null,"kg",null,"",null,null,null,null,null,null,null,null,null,null,null,null,null,{"$f":"IFERROR(VLOOKUP(B13,Päästökertoimet!$B$6:'Päästökertoimet'!$C$737,2,FALSE)*D13,\"\")","v":0}]
[null,"Puu",null,null,"kg",null,"",null,null,null,null,null,null,null,null,null,null,null,null,null,{"$f":"IFERROR(VLOOKUP(B14,Päästökertoimet!$B$6:'Päästökertoimet'!$C$737,2,FALSE)*D14,\"\")","v":0}]
[null,"Kyllästetty puu",null,null,"kg",null,"",null,null,null,null,null,null,null,null,null,null,null,null,null,{"$f":"IFERROR(VLOOKUP(B15,Päästökertoimet!$B$6:'Päästökertoimet'!$C$737,2,FALSE)*D15,\"\")","v":0}]
{"$rows_left_out":9}
{"sheet":"Päästökertoimet","index":6,"n_rows":489,"n_cols":7,"rows_kept":489,"cut":false,"hidden":false,"merged":[]}
[null,"Päästölähde","kgCO2e","yksikkö","kg per\nyksikkö","Tietolähde","Huomiot"]
[]
[null,"KOMPONENTIT JA MATERIAALIT"]
[]
[null,"AUTOMAATIOKOMPONENTIT","Sarake1","Sarake2","Sarake3","Sarake4","Sarake5"]
[null,"Anturit - Absoluuttianturi",6.9350399999999999,"kpl",0.59,"ELCD / IPCC 2013 GWP 100a","Päästökerroin johdettu käyttäen ELCD tietokantaa ja IPCC 2013 GWP 100a arviointimenetelmää."]
[null,"Anturit - Induktiivianturi",0.56156000000000006,"kpl",9.9000000000000005E-2,"ELCD / IPCC 2013 GWP 100a","Päästökerroin johdettu käyttäen ELCD tietokantaa ja IPCC 2013 GWP 100a arviointimenetelmää."]
[null,"Anturit - Kapasitiivinen anturi",3.7423200000000003,"kpl",0.22,"ELCD / IPCC 2013 GWP 100a","Päästökerroin johdettu käyttäen ELCD tietokantaa ja IPCC 2013 GWP 100a arviointimenetelmää."]
[null,"Anturit - Laser mittausanturi, metallirunko",8.2051200000000009,"kpl",1.65,"ELCD / IPCC 2013 GWP 100a","Päästökerroin johdettu käyttäen ELCD tietokantaa ja IPCC 2013 GWP 100a arviointimenetelmää."]
[null,"Anturit - Laser mittausanturi, muovirunko",5.4741999999999997,"kpl",0.2,"ELCD / IPCC 2013 GWP 100a","Päästökerroin johdettu käyttäen ELCD tietokantaa ja IPCC 2013 GWP 100a arviointimenetelmää."]
[null,"Anturit - Mekaaninen rajakytkin, metallirunko",1.53918,"kpl",0.2,"ELCD / IPCC 2013 GWP 100a","Päästökerroin johdettu käyttäen ELCD tietokantaa ja IPCC 2013 GWP 100a arviointimenetelmää."]
[null,"Anturit - Mekaaninen rajakytkin, muovirunko",0.95760000000000001,"kpl",0.12,"ELCD / IPCC 2013 GWP 100a","Päästökerroin johdettu käyttäen ELCD tietokantaa ja IPCC 2013 GWP 100a arviointimenetelmää."]
[null,"Anturit - Ultraäänianturi",1.5251000000000001,"kpl",0.14000000000000001,"ELCD / IPCC 2013 GWP 100a","Päästökerroin johdettu käyttäen ELCD tietokantaa ja IPCC 2013 GWP 100a arviointimenetelmää."]
[null,"Anturit - Valokenno, lähetin/vastaanotinpari",2.85704,"kpl",0.25,"ELCD / IPCC 2013 GWP 100a","Päästökerroin johdettu käyttäen ELCD tietokantaa ja IPCC 2013 GWP 100a arviointimenetelmää."]
[null,"Anturit - Valokenno, peili/kohteesta heijastava",2.2780799999999997,"kpl",0.185,"ELCD / IPCC 2013 GWP 100a","Päästökerroin johdettu käyttäen ELCD tietokantaa ja IPCC 2013 GWP 100a arviointimenetelmää."]
{"$rows_left_out":475}
{"sheet":"Muut kertoimet","index":7,"n_rows":23,"n_cols":6,"rows_kept":23,"cut":false,"hidden":false,"merged":[]}
[null,"Työstömenetelmä","kWh per yksikkö","yksikkö","Tietolähde","Huomiot"]
[]
[null,"TYÖSTÖMENETELMÄ","Sarake1","Sarake2","Sarake3","Sarake4"]
[null,"Alumiinin sorvaus",0.35,"kg","ELCD","Keskimääräinen energiankulutus valmistettaessa 1 kg valmista tuotetta"]
[null,"Alumiinin jyrsintä",0.36,"kg","ELCD","Keskimääräinen energiankulutus valmistettaessa 1 kg valmista tuotetta"]
[null,"Alumiinin poraus",7.5999999999999998E-2,"kg","ELCD","Keskimääräinen energiankulutus valmistettaessa 1 kg valmista tuotetta"]
[null,"Kromiteräksen sorvaus",0.47699999999999998,"kg","ELCD","Keskimääräinen energiankulutus valmistettaessa 1 kg valmista tuotetta"]
[null,"Kromiteräksen poraus",0.25,"kg","ELCD","Keskimääräinen energiankulutus valmistettaessa 1 kg valmista tuotetta"]
[null,"Messingin sorvaus",0.189,"kg","ELCD","Keskimääräinen energiankulutus valmistettaessa 1 kg valmista tuotetta"]
[null,"Messingin poraus",2.1000000000000001E-2,"kg","ELCD","Keskimääräinen energiankulutus valmistettaessa 1 kg valmista tuotetta"]
[null,"Teräksen sorvaus",0.21,"kg","ELCD","Keskimääräinen energiankulutus valmistettaessa 1 kg valmista tuotetta"]
[null,"Teräksen jyrsintä",0.192,"kg","ELCD","Keskimääräinen energiankulutus valmistettaessa 1 kg valmista tuotetta"]
[null,"Teräksen poraus",9.5000000000000001E-2,"kg","ELCD","Keskimääräinen energiankulutus valmistettaessa 1 kg valmista tuotetta"]
[null,"Valuraudan sorvaus",0.218,"kg","ELCD","Keskimääräinen energiankulutus valmistettaessa 1 kg valmista tuotetta"]
[null,"Valuraudan jyrsintä",0.14799999999999999,"kg","ELCD","Keskimääräinen energiankulutus valmistettaessa 1 kg valmista tuotetta"]
{"$rows_left_out":9}
{"sheet":"Misc.","index":8,"n_rows":22,"n_cols":9,"rows_kept":22,"cut":false,"hidden":true,"merged":[]}
[]
[null,null,null,"Listaus materiaaliluokista","Listaus kuljetustavoista","Listaus energiamuodoista","Listaus tuotantomenetelmistä","Listaus valmistuksen apuaineista","Jätelistaus"]
[null,null,null,"AUTOMAATIOKOMPONENTIT","MAANTIERAHTI","SÄHKÖ_JA_LÄMPÖENERGIA","KONEPAJATEOLLISUUS","RAEPUHALLUSAINEET","Pahvi"]
[null,null,null,"MEKANIIKKAKOMPONENTIT","JUNARAHTI","POLTTOAINEET","MUOVITEOLLISUUS","PUHDISTUSAINEET","Keräyspaperi"]
[null,null,null,"VALAISTUS_JA_ELEKTRONIIKKA","LAIVARAHTI",null,"PINTAKÄSITTELY","HITSAUSKAASUT","Keräyslasi"]
[null,null,null,"KIINNITYSTARVIKKEET","LENTORAHTI",null,null,null,"Keräysmuovi"]
[null,null,null,"TERÄKSET",null,null,null,null,"Metalli"]
[null,null,null,"RUOSTUMATTOMAT_TERÄKSET",null,null,null,null,"Akut, paristot"]
[null,null,null,"MUUT_METALLIT",null,null,null,null,"Muovi"]
[null,null,null,"KUMI",null,null,null,null,"Puu"]
[null,null,null,"MUOVIT",null,null,null,null,"Kyllästetty puu"]
[null,null,null,"LASI",null,null,null,null,"Kumi"]
[null,null,null,"PUUTUOTTEET",null,null,null,null,"Se-romu"]
[null,null,null,"TEKSTIILIT_JA_TEKSTIILIKUIDUT",null,null,null,null,"Metalli, alumiini"]
[null,null,null,"LIIMAT",null,null,null,null,"Metalli, kaapelit"]
{"$rows_left_out":7}