{"text_format":"1","workbook":"xlsx","n_sheets":4,"sheets":["Introduction","Master2018","DeptoCodes","ResultsSummary"],"not_rendered":{"charts":0,"images":0,"macros":1,"external_links":0,"defined_names":2,"comments":0,"pivot_tables":3},"unopened":[],"bounds":{"document_bytes":16777216,"sheet_cells":100000,"rows_first":2000,"rows_last":500,"rows_between":2000,"halvings":0,"cell_chars":16384,"cell_head_chars":4096},"cells_cut":0,"cells_raw":0,"read":"whole","date_system":"1900"}

{"sheet":"Introduction","index":0,"n_rows":23,"n_cols":2,"rows_kept":23,"cut":false,"hidden":false,"merged":[[2,1,2,10],[18,1,18,10],[3,1,8,10]]}
[]
[]
[null,"Master2018"]
[null,"This tab outlines all the individual courses offered at OSU and their corresponding sustainability offering status. Some courses were undergraduate-graduate dual-listed courses, or were listed under several departments, and this tab separates those courses into individual offerings. It also contains all the courses offered in FY18 and the respective links to their syllabi. This tab was used to determine if a course was qualified as a sustainability course, a course that includes sustainability, or a course with no sustainability content.\n"]
[]
[]
[]
[]
[]
[null,"A course qualified as a sustainability course if there was:"]
[null,"·         Incorporation of sustainability into learning outcomes described in a syllabus."]
[null,"·         Inclusion of more than 50% of content discussing sustainability ."]
[null,"A course qualified as a course that includes sustainability if there was:"]
[null,"·         A module or topic which discusses sustainability within the context of the course."]
[null,"·         Readings, assignments, labs, or activities required by the course covering sustainability concepts."]
[null,"·         Any other course content (less than 50% of material) that discusses sustainability content."]
[]
[]
[null,"DeptoCodes"]
[null,"This tab contains a table outlining the departments that each course subject belongs to."]
[]
[null,"Results Summary"]
[null,"This tab contains two tables summarizing the sustainability course offerings at OSU."]

{"sheet":"Master2018","index":1,"n_rows":4130,"n_cols":9,"rows_kept":4130,"cut":false,"hidden":false,"merged":[]}
[null,"Department","Subject","LEVEL","COMBINED","COURSE TITLE","CLASS","LINKS TO SYLLABI","Status"]
[null,"APEC","AEC",221,"AEC 221","AGRICULTURAL & FOOD MARKETING",{"$f":"IF(D2>499,\"Grad\", \"Undergrad\")","v":"Undergrad"},"https://secure.oregonstate.edu/ap/cps/documents/view/125980","Sustainability Course"]
[null,"APEC","AEC",240,"AEC 240","*RURAL ECONOMICS PLACE & PEOPL","Undergrad","https://catalog.oregonstate.edu/search/?P=AEC%20240","Sustainability Course"]
[null,"APEC","AEC",243,{"$f":"TRIM(C4)&\" \"&TRIM(D4)","v":"AEC 243"},"*GLOB POV AND SUST DEVELOP","Undergrad","https://secure.oregonstate.edu/ap/cps/documents/view/130358","Sustainability Course"]
[null,"APEC","AEC",250,"AEC 250","*INTRO ENVIRON ECON & POLICY","Undergrad","https://catalog.oregonstate.edu/search/?P=AEC%20250","Sustainability Course"]
[null,"APEC","AEC",253,"AEC 253","*ENVIRON LAW, POLICY & ECON","Undergrad","https://catalog.oregonstate.edu/search/?P=AEC%20253","Sustainability Course"]
[null,"APEC","AEC",351,"AEC 351","*NATURAL RESOURCE ECON & POLIC","Undergrad","https://catalog.oregonstate.edu/search/?P=AEC%20351","Sustainability Course"]
[null,"APEC","AEC",352,"AEC 352","*ENVIRONMENTAL ECON & POLICY","Undergrad","https://catalog.oregonstate.edu/search/?P=AEC%20352","Sustainability Course"]
[null,"APEC","AEC",353,"AEC 353","*INTRODUCTION TO COASTAL AND MARINE RESOURCE ECONOMICS. (3 Credits)","Undergrad","https://secure.oregonstate.edu/ap/cps/documents/view/122480","Sustainability Course"]
[null,"APEC","AEC",371,"AEC 371","AEC 371 TOPICS IN GLOBALIZATION (1)  ","Undergrad","https://catalog.oregonstate.edu/search/?P=AEC%20371","Sustainability Course"]
[null,"APEC","AEC",421,"AEC 421","RURAL POVERTY AND SAFETY NET","Undergrad","https://catalog.oregonstate.edu/search/?P=AEC%20421","Sustainability Course"]
[null,"APEC","AEC",440,"AEC 440","THE ECONOMICS OF BUSINESS ORGANIZATION IN THE FOOD SYSTEM. (4 Credits)","Undergrad","https://catalog.oregonstate.edu/search/?P=AEC%20440","Sustainability Course"]
[null,"APEC","AEC",446,"AEC 446","INTRO TO APPLIED ECONOMETRICS","Undergrad","https://catalog.oregonstate.edu/search/?P=AEC%20446","Sustainability Course"]
[null,"APEC","AEC",448,"AEC 448","ADV TOPICS IN ENV & RES ECON","Undergrad","https://catalog.oregonstate.edu/search/?P=AEC%20448","Sustainability Course"]
[null,"APEC","AEC",452,"AEC 452","MARINE ECONOMICS. (3 Credits)","Undergrad","https://secure.oregonstate.edu/ap/cps/documents/view/104743","Sustainability Course"]
[null,"APEC","AEC",453,"AEC 453","CONSERVATION ON PRIVATE LAND. (3 Credits)","Undergrad","https://catalog.oregonstate.edu/search/?P=AEC%20453","Sustainability Course"]
[null,"APEC","AEC",521,"AEC 521","RURAL POVERTY AND SAFETY NET","Grad","https://catalog.oregonstate.edu/search/?P=AEC%20521","Sustainability Course"]
[null,"APEC","AEC",534,"AEC 534","ENVIRON AND RESOURCE ECONOMICS","Grad","https://catalog.oregonstate.edu/search/?P=AEC%20534","Sustainability Course"]
[null,"APEC","AEC",540,"AEC 540","THE ECONOMICS OF BUSINESS ORGANIZATION IN THE FOOD SYSTEM. (4 Credits)","Grad","https://catalog.oregonstate.edu/search/?P=AEC%20540","Sustainability Course"]
[null,"APEC","AEC",546,"AEC 546","INTRO TO APPLIED ECONOMETRICS","Grad","https://catalog.oregonstate.edu/search/?P=AEC%20546","Sustainability Course"]
[null,"APEC","AEC",548,"AEC 548","ADV TOPICS IN ENV & RES ECON","Grad","https://catalog.oregonstate.edu/search/?P=AEC%20548","Sustainability Course"]
[null,"APEC","AEC",550,"AEC 550","ENVRON & NAT RESOURC ECONOMICS","Grad","https://catalog.oregonstate.edu/search/?P=AEC%20550","Sustainability Course"]
[null,"APEC","AEC",551,"AEC 551","APPL OF ENV & NAT RESOURC ECON","Grad","https://catalog.oregonstate.edu/search/?P=AEC%20551","Sustainability Course"]
[null,"APEC","AEC",552,"AEC 552","MARINE ECONOMICS. (3 Credits)","Grad","https://secure.oregonstate.edu/ap/cps/documents/view/104743","Sustainability Course"]
[null,"APEC","AEC",553,"AEC 553","CONSERVATION ON PRIVATE LAND. (3 Credits)","Grad","https://catalog.oregonstate.edu/search/?P=AEC%20553","Sustainability Course"]
[null,"APEC","AEC",640,"AEC 640","SUSTAINABLE DEVELOPMENT. (3 Credits)","Grad","https://catalog.oregonstate.edu/search/?P=AEC%20640","Sustainability Course"]
[null,"APEC","AEC",643,"AEC 643","ADV TOPICS IN DEVELOPMENT ECON","Grad","https://catalog.oregonstate.edu/search/?P=AEC%20643","Sustainability Course"]
[null,"APEC","AEC",653,"AEC 653","EMPIRICAL ENVIRONMENTAL AND RESOURCE ECONOMICS. (3 Credits)","Grad","https://catalog.oregonstate.edu/search/?P=AEC%20653","Sustainability Course"]
[null,"AED","AG",311,"AG 311","*NATIVE AMERICAN AGRICULTURE. (3 Credits)","Undergrad","https://secure.oregonstate.edu/ap/cps/documents/view/133660","Sustainability Course"]
[null,"AED","AG",421,{"$f":"TRIM(C30)&\" \"&TRIM(D30)","v":"AG 421"},"^WRITING IN AGRICULTURE","Undergrad","https://secure.oregonstate.edu/ap/cps/documents/view/132589","Sustainability Course"]
[null,"AED","AG",521,{"$f":"TRIM(C31)&\" \"&TRIM(D31)","v":"AG 521"},"WRITING IN AGRICULTURE","Grad","https://secure.oregonstate.edu/ap/cps/documents/view/132589","Sustainability Course"]
[null,"AG","AGRI",411,"AGRI 411","*INTRODUCTION TO FOOD SYSTEMS","Undergrad","https://catalog.oregonstate.edu/search/?P=AGRI%20411","Sustainability Course"]
[null,"AG","AGRI",511,"AGRI 511","INTRODUCTION TO FOOD SYSTEMS","Grad","https://catalog.oregonstate.edu/search/?P=AGRI%20511","Sustainability Course"]
[null,"AHE","AHE",520,"AHE 520","MULTICULTURAL ISSUES IN HIGHER EDUCATION. (3 Credits)","Grad","https://secure.oregonstate.edu/ap/cps/documents/view/100046","Sustainability Course"]
[null,"AHE","AHE",638,"AHE 638","HISTORY OF HIGHER EDUCATION","Grad","https://secure.oregonstate.edu/ap/cps/documents/view/100994","Sustainability Course"]
[null,"AHE","AHE",645,"AHE 645","ETHICAL PRACTICE","Grad","https://secure.oregonstate.edu/ap/cps/documents/view/98410","Sustainability Course"]
[null,"AHE","AHE",673,"AHE 673","RESEARCH INTERPRETATION IN FOUR-YEAR HIGHER EDUCATION. (3 Credits)","Grad","https://secure.oregonstate.edu/ap/cps/documents/view/122184","Sustainability Course"]
[null,"ALS","ALS",141,"ALS 141","INTRO TO UNIV LISTEN & SPEAK","Undergrad","https://secure.oregonstate.edu/ap/cps/documents/view/126206","Sustainability Course"]
[null,"ANRS","ANS",311,"ANS 311","PRINCIPLES OF ANIMAL NUTRITION","Undergrad","https://secure.oregonstate.edu/ap/cps/documents/view/10207","Sustainability Course"]
[null,"ANRS","ANS",313,"ANS 313","APP NUTR: FEEDS & RATION FORM","Undergrad","https://secure.oregonstate.edu/ap/cps/documents/view/125265","Sustainability Course"]
[null,"ANRS","ANS",421,"ANS 421","Contemporary Issues in Animal Agriculture","Undergrad","https://secure.oregonstate.edu/ap/cps/documents/view/7702","Sustainability Course"]
[null,"ANRS","ANS",460,"ANS 460","SWINE PRODUCTION SYSTEMS","Undergrad","https://secure.oregonstate.edu/ap/cps/documents/view/108864","Sustainability Course"]
[null,"SLCS","ANTH",261,"ANTH 261","*FOOD IN AMERICAN CULTURE","Undergrad","https://secure.oregonstate.edu/ap/cps/documents/view/116431","Sustainability Course"]
[null,"SLCS","ANTH",352,"ANTH 352","*ANTHROPOLOGY, HEALTH, ENVIRO","Undergrad","https://secure.oregonstate.edu/ap/cps/documents/view/101982","Sustainability Course"]
[null,"SLCS","ANTH",361,"ANTH 361","*FOOD JUSTICE","Undergrad","https://secure.oregonstate.edu/ap/cps/documents/view/120126","Sustainability Course"]
[null,"SLCS","ANTH",373,"ANTH 373","APPROACHES TO SOCIAL JUSTICE","Undergrad","https://secure.oregonstate.edu/ap/cps/documents/view/113418","Sustainability Course"]
[null,"SLCS","ANTH",374,"ANTH 374","*ANTHROPOLOGY & GLOBAL HEALTH","Undergrad","https://secure.oregonstate.edu/ap/cps/documents/view/114960","Sustainability Course"]
[null,"SLCS","ANTH",434,{"$f":"TRIM(C48)&\" \"&TRIM(D48)","v":"ANTH 434"},"NORTH AMERICA AFTER ICE AGE","Undergrad","https://secure.oregonstate.edu/ap/cps/documents/view/125271","Sustainability Course"]
[null,"SLCS","ANTH",436,"ANTH 436","NORTHWEST PREHISTORY. (4 Credits)","Undergrad","https://catalog.oregonstate.edu/search/?P=ANTH%20436","Sustainability Course"]
[null,"SLCS","ANTH",442,"ANTH 442","HUMAN ADAPTABILITY. (4 Credits)","Undergrad","https://catalog.oregonstate.edu/search/?P=ANTH%20442","Sustainability Course"]
[null,"SLCS","ANTH",449,"ANTH 449","HUMAN REPRODUCTION","Undergrad","https://catalog.oregonstate.edu/search/?P=ANTH%20449","Sustainability Course"]
[null,"SLCS","ANTH",453,"ANTH 453","COMMUNITY HEALTH FIELD SCHOOL. (3-12 Credits)","Undergrad","https://catalog.oregonstate.edu/search/?P=ANTH%20453","Sustainability Course"]
[null,"SLCS","ANTH",455,"ANTH 455","REPRODUCTIVE JUSTICE: A SERVICE LEARNING COURSE. (4 Credits)","Undergrad","https://catalog.oregonstate.edu/search/?P=ANTH%20455","Sustainability Course"]
[null,"SLCS","ANTH",461,"ANTH 461","NEUROANTHROPOLOGY","Undergrad","https://catalog.oregonstate.edu/search/?P=ANTH%20461","Sustainability Course"]
[null,"SLCS","ANTH",466,"ANTH 466","*RURAL ANTHROPOLOGY. (4 Credits)","Undergrad","https://catalog.oregonstate.edu/search/?P=ANTH%20466","Sustainability Course"]
[null,"SLCS","ANTH",468,"ANTH 468","ANTHROPOLOGY OF CHILDHOOD. (4 Credits)","Undergrad","https://catalog.oregonstate.edu/search/?P=ANTH%20468","Sustainability Course"]
[null,"SLCS","ANTH",469,"ANTH 469","ENERGY IN CULTURAL PERSPECTIVE. (4 Credits)","Undergrad","https://catalog.oregonstate.edu/search/?P=ANTH%20469","Sustainability Course"]
[null,"SLCS","ANTH",471,"ANTH 471","CASH, CLASS AND CULTURE: HUNTER-GATHERERS TO CAPITALISM. (4 Credits)","Undergrad","https://catalog.oregonstate.edu/search/?P=ANTH%20471","Sustainability Course"]
[null,"SLCS","ANTH",472,"ANTH 472","CONTEMPORARY INDIAN ISSUES. (4 Credits)","Undergrad","https://catalog.oregonstate.edu/search/?P=ANTH%20472","Sustainability Course"]
[null,"SLCS","ANTH",478,"ANTH 478","*ANTHROPOLOGY OF TOURISM","Undergrad","https://catalog.oregonstate.edu/search/?P=ANTH%20478","Sustainability Course"]
[null,"SLCS","ANTH",485,"ANTH 485","CAPSTONE IN SOCIAL JUSTICE","Undergrad","https://secure.oregonstate.edu/ap/cps/documents/view/113248","Sustainability Course"]
[null,"SLCS","ANTH",519,"ANTH 519","BIOLOGIES OF POVERTY. (4 Credits)","Grad","https://secure.oregonstate.edu/ap/cps/documents/view/117063","Sustainability Course"]
[null,"SLCS","ANTH",534,"ANTH 534","NORTH AMERICA AFTER THE ICE AGE. (4 Credits)","Grad","https://secure.oregonstate.edu/ap/cps/documents/view/125271","Sustainability Course"]
[null,"SLCS","ANTH",536,"ANTH 536","NORTHWEST PREHISTORY. (4 Credits)","Grad","https://catalog.oregonstate.edu/search/?P=ANTH%20536","Sustainability Course"]
[null,"SLCS","ANTH",542,"ANTH 542","HUMAN ADAPTABILITY. (4 Credits)","Grad","https://catalog.oregonstate.edu/search/?P=ANTH%20542","Sustainability Course"]
[null,"SLCS","ANTH",549,"ANTH 549","BIOCULTURAL PERSPECTIVES ON HUMAN REPRODUCTION. (4 Credits)",{"$f":"IF(D66>499,\"Grad\", \"Undergrad\")","v":"Grad"},"https://catalog.oregonstate.edu/search/?P=ANTH%20549","Sustainability Course"]
[null,"SLCS","ANTH",553,"ANTH 553","COMMUNITY HEALTH FIELD SCHOOL. (3-12 Credits)","Grad","https://catalog.oregonstate.edu/search/?P=ANTH%20553","Sustainability Course"]
[null,"SLCS","ANTH",555,"ANTH 555","REPRODUCTIVE JUSTICE: A SERVICE LEARNING COURSE. (4 Credits)","Grad","https://catalog.oregonstate.edu/search/?P=ANTH%20555","Sustainability Course"]
[null,"SLCS","ANTH",561,"ANTH 561","NEUROANTHROPOLOGY","Grad","https://catalog.oregonstate.edu/search/?P=ANTH%20561","Sustainability Course"]
[null,"SLCS","ANTH",566,"ANTH 566","RURAL ANTHROPOLOGY. (4 Credits)","Grad","https://catalog.oregonstate.edu/search/?P=ANTH%20566","Sustainability Course"]
[null,"SLCS","ANTH",567,"ANTH 567","AGRI-FOOD MOVEMENTS. (4 Credits)","Grad","https://secure.oregonstate.edu/ap/cps/documents/view/105877","Sustainability Course"]
[null,"SLCS","ANTH",568,"ANTH 568","ANTHROPOLOGY OF CHILDHOOD. (4 Credits)","Grad","https://catalog.oregonstate.edu/search/?P=ANTH%20568","Sustainability Course"]
[null,"SLCS","ANTH",569,"ANTH 569","ENERGY IN CULTURAL PERSPECTIVE. (4 Credits)","Grad","https://catalog.oregonstate.edu/search/?P=ANTH%20569","Sustainability Course"]
[null,"SLCS","ANTH",571,"ANTH 571","CASH, CLASS AND CULTURE: HUNTER-GATHERERS TO CAPITALISM. (4 Credits)","Grad","https://catalog.oregonstate.edu/search/?P=ANTH%20571","Sustainability Course"]
[null,"SLCS","ANTH",572,"ANTH 572","CONTEMPORARY INDIAN ISSUES. (4 Credits)","Grad","https://catalog.oregonstate.edu/search/?P=ANTH%20572","Sustainability Course"]
[null,"SLCS","ANTH",578,"ANTH 578","ANTHROPOLOGY OF TOURISM. (4 Credits)","Grad","https://catalog.oregonstate.edu/search/?P=ANTH%20578","Sustainability Course"]
[null,"SLCS","ANTH",591,"ANTH 591","ETHNOGRAPHIC METHODS","Grad","https://secure.oregonstate.edu/ap/cps/documents/view/6381","Sustainability Course"]
[null,"AG","ARE",301,"ARE 301","ARE Junior Seminar","Undergrad","https://secure.oregonstate.edu/ap/cps/documents/view/129071 ","Sustainability Course"]
[null,"AG","ARE",418,"ARE 418","Architectural Engineering Professional Practice","Undergrad","https://secure.oregonstate.edu/ap/cps/documents/view/133466","Sustainability Course"]
[null,"AG","ARE",419,"ARE 419","Architectural Engineering Design","Undergrad","https://secure.oregonstate.edu/ap/cps/documents/view/133467","Sustainability Course"]
[null,"SAC","ART",359,{"$f":"TRIM(C81)&\" \"&TRIM(D81)","v":"ART 359"},"*PHOTOGRAPHY:ACTIVISM & CHANGE","Undergrad","https://secure.oregonstate.edu/ap/cps/documents/view/126868","Sustainability Course"]
[null,"SAC","ART",432,"ART 432","*GENDER, SEXUALITY & PHOTO","Undergrad","https://catalog.oregonstate.edu/search/?P=ART%20432","Sustainability Course"]
[null,"SAC","ART",532,"ART 532","GENDER, SEXUALITY & PHOTOGRAPH","Grad","https://catalog.oregonstate.edu/search/?P=ART%20532","Sustainability Course"]
[null,"AERO","AS",113,"AS 113","FOUNDATIONS OF AIR FORCE III","Undergrad","https://secure.oregonstate.edu/ap/cps/documents/view/8516","Sustainability Course"]
[null,"AERO","AS",313,"AS 313","LEADERSHIP STUDIES","Undergrad","https://secure.oregonstate.edu/ap/cps/documents/view/8510","Sustainability Course"]
[null,"OC","ATS",201,"ATS 201","*CLIMATE SCIENCE","Undergrad","https://secure.oregonstate.edu/ap/cps/documents/view/122571","Sustainability Course"]
[null,"OC","ATS",295,"ATS 295","OBSERVING CLIMATE","Undergrad","https://secure.oregonstate.edu/ap/cps/documents/view/122725","Sustainability Course"]
[null,"OC","ATS",301,"ATS 301","CLIMATE DATA ANALYSIS","Undergrad","https://secure.oregonstate.edu/ap/cps/documents/view/124017","Sustainability Course"]
[null,"OC","ATS",320,"ATS 320","THE CHANGING CLIMATE ","Undergrad","https://secure.oregonstate.edu/ap/cps/documents/view/107913","Sustainability Course"]
[null,"OC","ATS",413,"ATS 413","ATMOSPHERIC CHEMISTRY. (3 Credits)","Undergrad","https://catalog.oregonstate.edu/search/?P=ATS%20413","Sustainability Course"]
[null,"OC","ATS",420,"ATS 420","PRINCIPLES OF CLIMATE","Undergrad","https://catalog.oregonstate.edu/search/?P=ATS%20420","Sustainability Course"]
[null,"OC","ATS",513,"ATS 513","ATMOSPHERIC CHEMISTRY. (3 Credits)","Grad","https://catalog.oregonstate.edu/search/?P=ATS%20513","Sustainability Course"]
[null,"OC","ATS",520,"ATS 520","PRINCIPLES OF CLIMATE","Grad","https://catalog.oregonstate.edu/search/?P=ATS%20520","Sustainability Course"]
[null,"BA","BA",140,"BA 140","FINANCIAL LITERACY FOR COLLEGE","Undergrad","https://secure.oregonstate.edu/ap/cps/documents/view/116473","Sustainability Course"]
[null,"BA","BA",152,"BA 152","EXPLORE SOCIAL ENTREPRENEURSHP","Undergrad","https://secure.oregonstate.edu/ap/cps/documents/view/10016","Sustainability Course"]
[null,"BA","BA",233,"BA 233","LEGAL ENVIRONMENT OF BUSINESS","Undergrad","https://secure.oregonstate.edu/ap/cps/documents/view/5476","Sustainability Course"]
[null,"BA","BA",321,"BA 321","COST MANAGEMENT I","Undergrad","https://secure.oregonstate.edu/ap/cps/documents/view/4788","Sustainability Course"]
[null,"BA","BA",330,"BA 330","LEGAL ENVIRONMENT OF BUSINESS. (4 Credits)","Undergrad","https://secure.oregonstate.edu/ap/cps/documents/view/132205","Sustainability Course"]
[null,"BA","BA",348,"BA 348","INTERNL EXCHANGE ORIENTATION","Undergrad","https://secure.oregonstate.edu/ap/cps/documents/view/100486","Sustainability Course"]
[null,"BA","BA",349,"BA 349","IMPACT OF CULTURE ON BUSINESS","Undergrad","https://secure.oregonstate.edu/ap/cps/documents/view/100484","Sustainability Course"]
[null,"BA","BA",354,"BA 354","^MANAGING ETHICS AND CSR","Undergrad","https://secure.oregonstate.edu/ap/cps/documents/view/123510","Sustainability Course"]
[null,"BA","BA",390,"BA 390","MARKETING","Undergrad","https://secure.oregonstate.edu/ap/cps/documents/view/106141","Sustainability Course"]
[null,"BA","BA",432,"BA 432","*ENVIRO LAW, SUSTAIN & BUSINES","Undergrad","https://catalog.oregonstate.edu/search/?P=BA%20432","Sustainability Course"]
[null,"BA","BA",447,"BA 447","TOPICS IN INTN'L BUSINESS","Undergrad","https://secure.oregonstate.edu/ap/cps/documents/view/7344","Sustainability Course"]
[null,"BA","BA",467,"BA 467","NEW VENTURE LABORATORY","Undergrad","https://secure.oregonstate.edu/ap/cps/documents/view/7937","Sustainability Course"]
[null,"BA","BA",482,"BA 482","SMALL BUSINESS MANAGEMENT","Undergrad","https://secure.oregonstate.edu/ap/cps/proposals/view/84782","Sustainability Course"]
[null,"BA","BA",513,"BA 513","BUSINESS LEGAL ENVIRONMENT","Grad","https://secure.oregonstate.edu/ap/cps/documents/view/125587","Sustainability Course"]
[null,"BA","BA",531,"BA 531","BUSINESS LAW-TECH/NEW VENTURES","Grad","https://secure.oregonstate.edu/ap/cps/documents/view/10410","Sustainability Course"]
[null,"BA","BA",532,"BA 532","ENVIRON LAW, SUSTAIN & BUSINES","Grad","https://catalog.oregonstate.edu/search/?P=BA%20532","Sustainability Course"]
[null,"BA","BA",551,"BA 551","SUPPLY AND SOURCING MANAGEMENT","Grad","https://secure.oregonstate.edu/ap/cps/documents/view/125811","Sustainability Course"]
[null,"BA","BA",561,"BA 561","SUPPLY CHAIN MANAGEMENT","Grad","https://secure.oregonstate.edu/ap/cps/documents/view/116499","Sustainability Course"]
[null,"BA","BA",566,"BA 566","Clean Technology Commercialization","Grad","https://secure.oregonstate.edu/ap/cps/documents/view/102634","Sustainability Course"]
[null,"BA","BA",567,"BA 567","SELECTED TOPICS IN MANAGEMENT","Grad","https://secure.oregonstate.edu/ap/cps/documents/view/102301","Sustainability Course"]
[null,"BA","BA",568,"BA 568","INTEGRATED BUSINESS PROJECT","Grad","https://secure.oregonstate.edu/ap/cps/documents/view/102355","Sustainability Course"]
[null,"BB","BB",332,"BB 332","*MOLECULAR MEDICINE","Undergrad","https://secure.oregonstate.edu/ap/cps/documents/view/2780","Sustainability Course"]
[null,"BEE","BEE",221,"BEE 221","FUNDAMENTAL OF ECO ENGINEERING","Undergrad","https://secure.oregonstate.edu/ap/cps/documents/view/117027","Sustainability Course"]
[null,"BEE","BEE",312,"BEE 312","ECOHYDRAULICS","Undergrad","https://secure.oregonstate.edu/ap/cps/documents/view/116926","Sustainability Course"]
[null,"BEE","BEE",313,"BEE 313","ECOHYDROLOGY","Undergrad","https://secure.oregonstate.edu/ap/cps/documents/view/116927","Sustainability Course"]
[null,"BEE","BEE",407,"BEE 407","SEMINAR","Undergrad","https://secure.oregonstate.edu/ap/cps/documents/view/105958","Sustainability Course"]
[null,"BEE","BEE",411,"BEE 411","GLOBAL ENVIRONMENTAL CHANGE: USING DATA TO INFORM DECISIONS. (3 Credits)","Undergrad","https://catalog.oregonstate.edu/search/?P=BEE%20411","Sustainability Course"]
[null,"BEE","BEE",446,"BEE 446","RIVER ENGINEERING. (4 Credits)","Undergrad","https://catalog.oregonstate.edu/search/?P=BEE%20446","Sustainability Course"]
[null,"BEE","BEE",458,"BEE 458","NP SOURCE POLL ASSESSMT & CONT","Undergrad","https://catalog.oregonstate.edu/search/?P=BEE%20458","Sustainability Course"]
[null,"BEE","BEE",461,"BEE 461","Ecological Engineering Measurement Methods","Undergrad","https://secure.oregonstate.edu/ap/cps/documents/view/99680","Sustainability Course"]
[null,"BEE","BEE",468,"BEE 468","BIOREMEDIATION ENGINEERING","Undergrad","https://catalog.oregonstate.edu/search/?P=BEE%20468","Sustainability Course"]
[null,"BEE","BEE",469,"BEE 469","^ECOLOGICAL ENGR DESIGN I","Undergrad","https://secure.oregonstate.edu/ap/cps/documents/view/110412","Sustainability Course"]
[null,"BEE","BEE",470,"BEE 470","ECOLOGICAL ENGR DESIGN II","Undergrad","https://secure.oregonstate.edu/ap/cps/documents/view/98240","Sustainability Course"]
[null,"BEE","BEE",511,"BEE 511","GLOBAL ENVIRONMENTAL CHANGE: USING DATA TO INFORM DECISIONS. (3 Credits)","Grad","https://catalog.oregonstate.edu/search/?P=BEE%20511","Sustainability Course"]
[null,"BEE","BEE",546,"BEE 546","RIVER ENGINEERING. (4 Credits)","Grad","https://catalog.oregonstate.edu/search/?P=BEE%20546","Sustainability Course"]
[null,"BEE","BEE",558,"BEE 558","NP SOURCE POLL ASSESSMT & CONT","Grad","https://catalog.oregonstate.edu/search/?P=BEE%20558","Sustainability Course"]
[null,"BEE","BEE",561,"BEE 561","Ecological Engineering Measurement Methods",{"$f":"IF(D130>499,\"Grad\", \"Undergrad\")","v":"Grad"},"https://secure.oregonstate.edu/ap/cps/documents/view/99680","Sustainability Course"]
[null,"BEE","BEE",568,"BEE 568","BIOREMEDIATION ENGINEERING","Grad","https://catalog.oregonstate.edu/search/?P=BEE%20568","Sustainability Course"]
[null,"INBI","BI",101,{"$f":"TRIM(C132)&\" \"&TRIM(D132)","v":"BI 101"},"*ECOLOGY, CONS & GLOBAL CHANGE","Undergrad","https://secure.oregonstate.edu/ap/cps/documents/view/133946 ","Sustainability Course"]
[null,"INBI","BI",150,"BI 150","INTRODUCTION TO MARINE BIOLOGY","Undergrad","https://secure.oregonstate.edu/ap/cps/documents/view/9710","Sustainability Course"]
[null,"INBI","BI",302,"BI 302","BIOLOGY OF MARINE MAMMALS","Undergrad","https://catalog.oregonstate.edu/search/?P=BI%20302","Sustainability Course"]
[null,"INBI","BI",347,{"$f":"TRIM(C135)&\" \"&TRIM(D135)","v":"BI 347"},"*OCEANS IN PERIL","Undergrad","https://secure.oregonstate.edu/ap/cps/documents/view/127869 ","Sustainability Course"]
[null,"INBI","BI",351,"BI 351","MARINE ECOLOGY","Undergrad","https://secure.oregonstate.edu/ap/cps/documents/view/120190","Sustainability Course"]
[null,"INBI","BI",415,"BI 415","Biological Sciences Thesis","Undergrad","https://secure.oregonstate.edu/ap/cps/documents/view/119600","Sustainability Course"]
[null,"INBI","BI",435,"BI 435","*GENES & CHEM VALUE & RISK","Undergrad","https://catalog.oregonstate.edu/search/?P=BI%20435","Sustainability Course"]
[null,"INBI","BI",483,"BI 483","POPULATION BIOLOGY","Undergrad","https://catalog.oregonstate.edu/search/?P=BI%20483","Sustainability Course"]
[null,"INBI","BI",535,"BI 535","GENES & CHEM VALUE & RISK","Grad","https://catalog.oregonstate.edu/search/?P=BI%20535","Sustainability Course"]
[null,"INBI","BI",583,"BI 583","POPULATION BIOLOGY","Grad","https://catalog.oregonstate.edu/search/?P=BI%20583","Sustainability Course"]
[null,"CBE","BIOE",420,"BIOE 420","SOCIAL JUSTICE, ETHICS & ENGIN","Undergrad","https://catalog.oregonstate.edu/search/?P=BIOE%20420","Sustainability Course"]
[null,"CBE","BIOE",490,"BIOE 490","BIOENGINEERING PROCESS DESIGN","Undergrad","https://secure.oregonstate.edu/ap/cps/documents/view/123314","Sustainability Course"]
[null,"CBE","BIOE",492,"BIOE 492","BIOENGINEERING CAPSTONE DESIGN","Undergrad","https://secure.oregonstate.edu/ap/cps/documents/view/126013","Sustainability Course"]
[null,"CBE","BIOE",520,"BIOE 520","SOCIAL JUSTICE, ETHICS & ENGIN","Grad","https://catalog.oregonstate.edu/search/?P=BIOE%20520","Sustainability Course"]
[null,"BOT","BOT",322,"BOT 322","ECONOMIC AND ETHNOBOTANY","Undergrad","https://secure.oregonstate.edu/ap/cps/documents/view/8223","Sustainability Course"]
[null,"BOT","BOT",435,"BOT 435","Pollination Biology","Undergrad","https://secure.oregonstate.edu/ap/cps/documents/view/94990","Sustainability Course"]
[null,"BOT","BOT",535,"BOT 535","Pollination Biology","Grad","https://secure.oregonstate.edu/ap/cps/documents/view/94990","Sustainability Course"]
[null,"BOT","BOT",547,"BOT 547","NUTRIENT CYCLING. (3 Credits)","Grad","https://secure.oregonstate.edu/ap/cps/documents/view/111010","Sustainability Course"]
[null,"BRR","BRR",325,"BRR 325","*ENERGY TECH & SOCIAL CHANGE","Undergrad","https://secure.oregonstate.edu/ap/cps/documents/view/120225","Sustainability Course"]
[null,"BRR","BRR",350,"BRR 350","INTRO TO REGIONAL BIOENERGY","Undergrad","https://secure.oregonstate.edu/ap/cps/documents/view/112600","Sustainability Course"]
[null,"BRR","BRR",407,"BRR 407","SEMINAR","Undergrad","https://secure.oregonstate.edu/ap/cps/documents/view/102038","Sustainability Course"]
[null,"BRR","BRR",450,"BRR 450","INTERDISC RESEARCH: BIOENERGY","Undergrad","https://secure.oregonstate.edu/ap/cps/documents/view/112601","Sustainability Course"]
[null,"CBE","CBEE",320,"CBEE 320","PROFESSIONALISM/ENGR ETHICS","Undergrad","https://secure.oregonstate.edu/ap/cps/documents/view/120649","Sustainability Course"]
[null,"CCE","CCE",422,"CCE 422","GREEN BUILDING MATERIALS","Undergrad","https://catalog.oregonstate.edu/search/?P=CCE%20422","Sustainability Course"]
[null,"CCE","CCE",522,"CCE 522","GREEN BUILDING MATERIALS","Grad","https://catalog.oregonstate.edu/search/?P=CCE%20522","Sustainability Course"]
[null,"CCE","CCE",523,"CCE 523","CONCRETE DURABILITY","Grad","https://secure.oregonstate.edu/ap/cps/documents/view/112899","Sustainability Course"]
[null,"CCE","CCE",524,"CCE 524","ASPHALT FUNDAMENTALS. (3 Credits)","Grad","https://secure.oregonstate.edu/ap/cps/documents/view/130874","Sustainability Course"]
[null,"CCE","CCE",545,"CCE 545","Professional responsibility and ethics ","Grad","https://secure.oregonstate.edu/ap/cps/documents/view/121991","Sustainability Course"]
[null,"CCE","CE",201,"CE 201","CCE 201 - CIVIL AND CONSTRUCTION ENGINEERING GRAPHICS AND DESIGN ","Undergrad","https://secure.oregonstate.edu/ap/cps/documents/view/9772","Sustainability Course"]
[null,"CCE","CE",428,"CE 428","PROJECT MANAGEMENT FOR CIVIL ENGINEERS. (4 Credits)","Undergrad","https://catalog.oregonstate.edu/search/?P=CE%20428","Sustainability Course"]
[null,"CCE","CE",491,"CE 491","TRANSPORTATION ENGINEERING","Undergrad","https://secure.oregonstate.edu/ap/cps/documents/view/4718","Sustainability Course"]
[null,"CCE","CE",492,"CE 492","PAVEMENT STRUCTURES","Undergrad","https://catalog.oregonstate.edu/search/?P=CE%20492","Sustainability Course"]
[null,"CCE","CE",528,"CE 528","PROJECT MANAGEMENT FOR CIVIL ENGINEERS. (4 Credits)","Grad","https://catalog.oregonstate.edu/search/?P=CE%20528","Sustainability Course"]
[null,"CCE","CE",572,"CE 572","ADVANCED GEOTECHNICAL LAB","Grad","https://secure.oregonstate.edu/ap/cps/documents/view/104244","Sustainability Course"]
[null,"CCE","CE",592,"CE 592","PAVEMENT STRUCTURES","Grad","https://catalog.oregonstate.edu/search/?P=CE%20592","Sustainability Course"]
[null,"CCE","CE",599,"CE 599","INTELLIGENT TRANSPORTATION SYSTEMS. (3 Credits)","Grad","https://secure.oregonstate.edu/ap/cps/documents/view/9845","Sustainability Course"]
[null,"CH","CH",390,"CH 390","ENVIRONMENTAL CHEMISTRY","Undergrad","https://secure.oregonstate.edu/ap/cps/documents/view/118086","Sustainability Course"]
[null,"CH","CH",661,"CH 661","SEP: CHROMAT & RELATED METHODS","Grad","https://secure.oregonstate.edu/ap/cps/documents/view/8228","Sustainability Course"]
[null,"CBE","CHE",431,"CHE 431","CHEMICAL PLANT DESIGN I","Undergrad","https://secure.oregonstate.edu/ap/cps/documents/view/5041","Sustainability Course"]
[null,"CBE","CHE",450,"CHE 450","CONV & ALTERN ENERGY SYSTEMS","Undergrad","https://catalog.oregonstate.edu/search/?P=CHE%20450","Sustainability Course"]
[null,"CBE","CHE",451,"CHE 451","SOLAR ENERGY TECHNOLOGIES","Undergrad","https://catalog.oregonstate.edu/search/?P=CHE%20451","Sustainability Course"]
[null,"CBE","CHE",550,"CHE 550","CONV & ALTERN ENERGY SYSTEMS","Grad","https://catalog.oregonstate.edu/search/?P=CHE%20550","Sustainability Course"]
[null,"CBE","CHE",551,"CHE 551","SOLAR ENERGY TECHNOLOGIES","Grad","https://catalog.oregonstate.edu/search/?P=CHE%20551","Sustainability Course"]
[null,"SAC","COMM",332,"COMM 332","FAMILY COMMUNICATION","Undergrad","https://secure.oregonstate.edu/ap/cps/documents/view/119741","Sustainability Course"]
[null,"SAC","COMM",437,"COMM 437","HEALTH COMMUNICATION","Undergrad","https://catalog.oregonstate.edu/search/?P=COMM%20437","Sustainability Course"]
[null,"SAC","COMM",537,"COMM 537","HEALTH COMMUNICATION","Grad","https://catalog.oregonstate.edu/search/?P=COMM%20537","Sustainability Course"]
[null,"COUN","COUN",441,"COUN 441","INTRO TO PROF COUNSELING","Undergrad","https://secure.oregonstate.edu/ap/cps/documents/view/123340","Sustainability Course"]
[null,"COUN","COUN",582,"COUN 582","MULTICULTURAL COUNSELING II","Grad","https://secure.oregonstate.edu/ap/cps/documents/view/126191","Sustainability Course"]
[null,"CSS","CROP",280,"CROP 280","INTRO TO CROPPING SYSTEMS","Undergrad","https://secure.oregonstate.edu/ap/cps/documents/view/118436","Sustainability Course"]
[null,"EECS","CS",175,"CS 175","*SECURITY & SOCIAL MOVEMENTS","Undergrad","https://secure.oregonstate.edu/ap/cps/documents/view/123515","Sustainability Course"]
[null,"CSS","CSS",205,"CSS 205","*SOIL SCIENCE","Undergrad","https://secure.oregonstate.edu/ap/cps/documents/view/105158","Sustainability Course"]
[null,"BA","DHE",170,"DHE 170","INTRODUCTION TO THE TEXTILE AND APPAREL INDUSTRY. (4 Credits)","Undergrad","https://secure.oregonstate.edu/ap/cps/documents/view/115015","Sustainability Course"]
[null,"BA","DHE",288,"DHE 288","ENVIRONMENTAL BUILDING SYSTEMS. (3 Credits)","Undergrad","https://secure.oregonstate.edu/ap/cps/documents/view/7560","Sustainability Course"]
[null,"BA","DHE",355,"DHE 355","TEXTILE PERFORMANCE AND EVALUATION. (4 Credits)","Undergrad","https://secure.oregonstate.edu/ap/cps/documents/view/116978","Sustainability Course"]
[null,"BA","DHE",360,"DHE 360","COLLABORATIVE STUDIO","Undergrad","https://secure.oregonstate.edu/ap/cps/documents/view/117184","Sustainability Course"]
[null,"BA","DHE",388,"DHE 388","HOSPITALITY DESIGN      ","Undergrad","https://secure.oregonstate.edu/ap/cps/documents/view/117050","Sustainability Course"]
[null,"BA","DHE",389,"DHE 389","STUDIO IV: KITCHEN AND BATH DESIGN. (4 Credits)","Undergrad","https://secure.oregonstate.edu/ap/cps/documents/view/7554","Sustainability Course"]
[null,"BA","DHE",394,"DHE 394","Interior Design Studio: Lighting Design ","Undergrad","https://secure.oregonstate.edu/ap/cps/documents/view/117051","Sustainability Course"]
[null,"BA","DHE",415,"DHE 415","DHE 415H - *RENEWABLE MATERIALS IN THE MODERN AGE ","Undergrad","https://secure.oregonstate.edu/ap/cps/documents/view/110679","Sustainability Course"]
[null,"BA","DHE",437,"DHE 437","CONSUMER BEHAVIOR AND CULTURE. (4 Credits)","Undergrad","https://secure.oregonstate.edu/ap/cps/documents/view/116984","Sustainability Course"]
[null,"BA","DHE",470,"DHE 470","RETAIL MERCHANDISING. (4 Credits)","Undergrad","https://secure.oregonstate.edu/ap/cps/documents/view/100221","Sustainability Course"]
[null,"BA","DHE",475,"DHE 475","*GLOBAL SOURCING OF TEXTILES, APPAREL, AND FOOTWEAR. (4 Credits)","Undergrad","https://secure.oregonstate.edu/ap/cps/documents/view/118439","Sustainability Course"]
[null,"BA","DSGN",383,{"$f":"TRIM(C194)&\" \"&TRIM(D194)","v":"DSGN 383"},"BUILDING CONSTRUCT & MATERIALS",{"$f":"IF(D194>499,\"Grad\", \"Undergrad\")","v":"Undergrad"},"https://secure.oregonstate.edu/ap/cps/documents/view/128292","Sustainability Course"]
[null,"LA","EAH",411,"EAH 411","*^PERSPECTIVES IN ENV ARTS HUM","Undergrad","https://catalog.oregonstate.edu/search/?P=EAH%20411","Sustainability Course"]
[null,"LA","EAH",511,"EAH 511","PERSPECTIVES IN ENV ARTS & HUM","Grad","https://catalog.oregonstate.edu/search/?P=EAH%20511","Sustainability Course"]
[null,"SPP","ECON",311,"ECON 311","INTER MICROECONOMIC THEORY","Undergrad","https://secure.oregonstate.edu/ap/cps/documents/view/99975","Sustainability Course"]
[null,"SPP","ECON",439,"ECON 439","^PUBLIC POLICY ANALYSIS","Undergrad","https://secure.oregonstate.edu/ap/cps/documents/view/101545","Sustainability Course"]
[null,"SPP","ECON",463,"ECON 463","EFFICIENCY AND PROD ANALYSIS","Undergrad","https://catalog.oregonstate.edu/search/?P=ECON%20463","Sustainability Course"]
[null,"SPP","ECON",466,"ECON 466","^ECONOMICS OF TRADITIONAL AND RENEWABLE ENERGY. (4 Credits)","Undergrad","https://catalog.oregonstate.edu/search/?P=ECON%20466","Sustainability Course"]
[null,"SPP","ECON",517,"ECON 517","MICROECONOMIC THEORY FOR MPP","Grad","https://secure.oregonstate.edu/ap/cps/documents/view/106731","Sustainability Course"]
[null,"SPP","ECON",539,"ECON 539","PUBLIC POLICY ANALYSIS","Grad","https://secure.oregonstate.edu/ap/cps/documents/view/101542","Sustainability Course"]
[null,"SPP","ECON",563,"ECON 563","EFFICIENCY AND PROD ANALYSIS","Grad","https://catalog.oregonstate.edu/search/?P=ECON%20563","Sustainability Course"]
[null,"SPP","ECON",566,"ECON 566","ECONOMICS OF TRADITIONAL AND RENEWABLE ENERGY. (4 Credits)","Grad","https://catalog.oregonstate.edu/search/?P=ECON%20566","Sustainability Course"]
[null,"ED","ED",476,"ED 476","PARTNERSHIP & IDEOLOGIES ESOL","Undergrad","https://catalog.oregonstate.edu/search/?P=ED%20476","Sustainability Course"]
[null,"ED","ED",539,"ED 539","MATHEMATICAL METHODS III","Grad","https://secure.oregonstate.edu/ap/cps/documents/view/120983","Sustainability Course"]
[null,"ED","ED",562,"ED 562","INTRO TO EDUCATIONAL RESEARCH","Grad","https://secure.oregonstate.edu/ap/cps/documents/view/121508","Sustainability Course"]
[null,"ED","ED",576,"ED 576","PARTNERSHIP & IDEOLOGIES ESOL","Grad","https://catalog.oregonstate.edu/search/?P=ED%20576","Sustainability Course"]
[null,"ED","ED",590,{"$f":"TRIM(C209)&\" \"&TRIM(D209)","v":"ED 590"},"SOCIAL JUSTICE IN EDUCATION","Grad","https://secure.oregonstate.edu/ap/cps/documents/view/126843","Sustainability Course"]
[null,"ED","ED",597,"ED 597","STEM INTEGRATION IN K-5 CLASS","Grad","https://secure.oregonstate.edu/ap/cps/documents/view/122109","Sustainability Course"]
[null,"ED","ED",650,"ED 650","EQUITY AND EDUCATION POLICY","Grad","https://secure.oregonstate.edu/ap/cps/documents/view/122165","Sustainability Course"]
[null,"ED","ED",652,"ED 652","ETHNOGRAPHIC METHODS","Grad","https://secure.oregonstate.edu/ap/cps/documents/view/122167","Sustainability Course"]
[null,"SWLF","ENG",204,"ENG 204","*SURV BRIT LIT: BEGIN TO 1660","Undergrad","https://secure.oregonstate.edu/ap/cps/documents/view/99799","Sustainability Course"]
[null,"SWLF","ENG",225,"ENG 225","THE ART, SCIENCE, AND LITERATURE OF FLY FISHING. (1 Credit)","Undergrad","https://secure.oregonstate.edu/ap/cps/documents/view/118384","Sustainability Course"]
[null,"SWLF","ENG",260,"ENG 260","*LITERATURE OF AMERICAN MINORITIES. (4 Credits)","Undergrad","https://secure.oregonstate.edu/ap/cps/documents/view/99824","Sustainability Course"]
[null,"SWLF","ENG",412,"ENG 412","STUDIES IN BRITISH THEATER AND SOCIETY. (4 Credits)","Undergrad","https://catalog.oregonstate.edu/search/?P=ENG%20412","Sustainability Course"]
[null,"SWLF","ENG",438,"ENG 438","STUDIES IN MODERNISM. (4 Credits)","Undergrad","https://catalog.oregonstate.edu/search/?P=ENG%20438","Sustainability Course"]
[null,"SWLF","ENG",482,"ENG 482","STUDIES IN AMERICAN LITERATURE, CULTURE, AND THE ENVIRONMENT. (4 Credits)","Undergrad","https://catalog.oregonstate.edu/search/?P=ENG%20482","Sustainability Course"]
[null,"SWLF","ENG",497,"ENG 497","*INTERNATIONAL WOMEN'S VOICES. (4 Credits)","Undergrad","https://catalog.oregonstate.edu/search/?P=ENG%20497","Sustainability Course"]
[null,"SWLF","ENG",512,"ENG 512","STUDIES IN BRITISH THEATER AND SOCIETY. (4 Credits)","Grad","https://catalog.oregonstate.edu/search/?P=ENG%20512","Sustainability Course"]
[null,"SWLF","ENG",538,"ENG 538","STUDIES IN MODERNISM. (4 Credits)","Grad","https://catalog.oregonstate.edu/search/?P=ENG%20538","Sustainability Course"]
[null,"SWLF","ENG",582,"ENG 582","STUDIES IN AMERICAN LITERATURE, CULTURE, AND THE ENVIRONMENT. (4 Credits)","Grad","https://catalog.oregonstate.edu/search/?P=ENG%20582","Sustainability Course"]
[null,"SWLF","ENG",597,"ENG 597","INTERNATIONAL WOMEN'S VOICES. (4 Credits)","Grad","https://catalog.oregonstate.edu/search/?P=ENG%20597","Sustainability Course"]
[null,"ENGR","ENGR",363,"ENGR 363","*ENERGY MATTERS","Undergrad","https://secure.oregonstate.edu/ap/cps/documents/view/106585","Sustainability Course"]
[null,"ENT","ENT",322,"ENT 322","HONEY BEE BIOLOGY & BEEKEEPING","Undergrad","https://secure.oregonstate.edu/ap/cps/documents/view/106794","Sustainability Course"]
[null,"ENT","ENT",331,"ENT 331","*POLLINATORS IN PERIL","Undergrad","https://secure.oregonstate.edu/ap/cps/documents/view/113380","Sustainability Course"]
[null,"ENT","ENT",444,{"$f":"TRIM(C227)&\" \"&TRIM(D227)","v":"ENT 444"},"INSECT AGROECOLOGY","Undergrad","https://secure.oregonstate.edu/ap/cps/documents/view/127483","Sustainability Course"]
[null,"ENT","ENT",54,"ENT 54","ENT 544 - INSECT AGROECOLOGY ","Undergrad","https://catalog.oregonstate.edu/search/?P=ENT%2054","Sustainability Course"]
[null,"ENT","ENT",544,{"$f":"TRIM(C229)&\" \"&TRIM(D229)","v":"ENT 544"},"INSECT AGROECOLOGY","Grad","https://secure.oregonstate.edu/ap/cps/documents/view/127483","Sustainability Course"]
[null,"CBE","ENVE",431,"ENVE 431","FATE & TRANS CHEM IN ENVIR SYS","Undergrad","https://catalog.oregonstate.edu/search/?P=ENVE%20431","Sustainability Course"]
[null,"CBE","ENVE",456,"ENVE 456","SUSTAINABLE WATER RESOURCES DE","Undergrad","https://catalog.oregonstate.edu/search/?P=ENVE%20456","Sustainability Course"]
[null,"CBE","ENVE",490,"ENVE 490","ENVIRONMENTAL ENGR DESIGN","Undergrad","https://secure.oregonstate.edu/ap/cps/documents/view/108257","Sustainability Course"]
[null,"CBE","ENVE",531,"ENVE 531","FATE & TRANS CHEM IN ENVIR SYS","Grad","https://catalog.oregonstate.edu/search/?P=ENVE%20531","Sustainability Course"]
[null,"CBE","ENVE",554,"ENVE 554","GROUNDWATER REMEDIATION","Grad","https://secure.oregonstate.edu/ap/cps/documents/view/117135","Sustainability Course"]
[null,"CBE","ENVE",556,"ENVE 556","SUSTAINABLE WATER RESOURCES DE","Grad","https://catalog.oregonstate.edu/search/?P=ENVE%20556","Sustainability Course"]
[null,"SLCS","ES",201,"ES 201","*INVENTING ETHNIC AMERICA","Undergrad","https://secure.oregonstate.edu/ap/cps/documents/view/116368","Sustainability Course"]
[null,"SLCS","ES",221,"ES 221","*SURVEY OF AFRICAN AMER ST I","Undergrad","https://secure.oregonstate.edu/ap/cps/documents/view/121949","Sustainability Course"]
[null,"SLCS","ES",260,"ES 260","*INTRODUCTION TO PACIFIC ISLANDS STUDIES. (4 Credits)","Undergrad","https://secure.oregonstate.edu/ap/cps/documents/view/127492","Sustainability Course"]
[null,"SLCS","ES",323,"ES 323","CONTEMP AFR AMER SOC DISCOURSE","Undergrad","https://secure.oregonstate.edu/ap/cps/documents/view/115141","Sustainability Course"]
[null,"SLCS","ES",345,"ES 345","NATIVE AMERICANS IN OREGON. (4 Credits)","Undergrad","https://secure.oregonstate.edu/ap/cps/documents/view/110661","Sustainability Course"]
[null,"SLCS","ES",350,"ES 350","^PUBLIC DISCOURSE AND RACE","Undergrad","https://secure.oregonstate.edu/ap/cps/documents/view/115381","Sustainability Course"]
[null,"SLCS","ES",351,"ES 351","*ETHNIC MINORITIES IN OREGON","Undergrad","https://secure.oregonstate.edu/ap/cps/documents/view/116332","Sustainability Course"]
[null,"SLCS","ES",353,"ES 353","*ENVIRONMENTAL RACISM. (4 Credits)","Undergrad","https://secure.oregonstate.edu/ap/cps/documents/view/113436","Sustainability Course"]
[null,"SLCS","ES",373,"ES 373","APPROACHES TO SOCIAL JUSTICE","Undergrad","https://secure.oregonstate.edu/ap/cps/documents/view/113419","Sustainability Course"]
[null,"SLCS","ES",375,"ES 375","*ARTS AND SOCIAL JUSTICE","Undergrad","https://secure.oregonstate.edu/ap/cps/documents/view/119536","Sustainability Course"]
[null,"SLCS","ES",445,"ES 445","*NATIVE AMERICAN SCIENCE AND TECHNOLOGY. (4 Credits)","Undergrad","https://secure.oregonstate.edu/ap/cps/documents/view/116401","Sustainability Course"]
[null,"SLCS","ES",451,"ES 451","THEORIES OF RACE AND ETHNICITY","Undergrad","https://catalog.oregonstate.edu/search/?P=ES%20451","Sustainability Course"]
[null,"SLCS","ES",453,"ES 453","*ETHNOHISTORY METHODOLOGY. (4 Credits)","Undergrad","https://catalog.oregonstate.edu/search/?P=ES%20453","Sustainability Course"]
[null,"SLCS","ES",457,"ES 457","*LITERATURE BY WOMEN OF COLOR IN THE UNITED STATES. (4 Credits)","Undergrad","https://catalog.oregonstate.edu/search/?P=ES%20457","Sustainability Course"]
[null,"SLCS","ES",458,"ES 458","RACIAL PATTERNS OF URBANIZATION. (4 Credits)","Undergrad","https://catalog.oregonstate.edu/search/?P=ES%20458","Sustainability Course"]
[null,"SLCS","ES",460,"ES 460","ETHNICITY AND SOCIAL JUSTICE","Undergrad","https://catalog.oregonstate.edu/search/?P=ES%20460","Sustainability Course"]
[null,"SLCS","ES",461,"ES 461","RACE & PRISON INDUSTRL COMPLEX","Undergrad","https://catalog.oregonstate.edu/search/?P=ES%20461","Sustainability Course"]
[null,"SLCS","ES",472,"ES 472","^INDIGENOUS TWO-SPIRIT AND QUEER STUDIES. (4 Credits)","Undergrad","https://catalog.oregonstate.edu/search/?P=ES%20472","Sustainability Course"]
[null,"SLCS","ES",477,"ES 477","QUEER/TRANS PEOPLE OF COLOR ARTS AND ACTIVISM. (4 Credits)","Undergrad","https://catalog.oregonstate.edu/search/?P=ES%20477","Sustainability Course"]
[null,"SLCS","ES",485,"ES 485","CAPSTONE IN SOCIAL JUSTICE","Undergrad","https://secure.oregonstate.edu/ap/cps/documents/view/113422","Sustainability Course"]
[null,"SLCS","ES",551,"ES 551","THEORIES OF RACE AND ETHNICITY","Grad","https://catalog.oregonstate.edu/search/?P=ES%20551","Sustainability Course"]
[null,"SLCS","ES",553,"ES 553","ETHNOHISTORY METHODOLOGY. (4 Credits)","Grad","https://catalog.oregonstate.edu/search/?P=ES%20553","Sustainability Course"]
[null,"SLCS","ES",557,"ES 557","LITERATURE BY WOMEN OF COLOR IN THE UNITED STATES. (4 Credits)",{"$f":"IF(D258>499,\"Grad\", \"Undergrad\")","v":"Grad"},"https://catalog.oregonstate.edu/search/?P=ES%20557","Sustainability Course"]
[null,"SLCS","ES",558,"ES 558","RACIAL PATTERNS OF URBANIZATION. (4 Credits)","Grad","https://catalog.oregonstate.edu/search/?P=ES%20558","Sustainability Course"]
[null,"SLCS","ES",560,"ES 560","ETHNICITY AND SOCIAL JUSTICE","Grad","https://catalog.oregonstate.edu/search/?P=ES%20560","Sustainability Course"]
[null,"SLCS","ES",561,"ES 561","RACE & PRISON INDUSTRL COMPLEX","Grad","https://catalog.oregonstate.edu/search/?P=ES%20561","Sustainability Course"]
[null,"SLCS","ES",572,"ES 572","INDIGENOUS TWO-SPIRIT AND QUEER STUDIES. (4 Credits)","Grad","https://catalog.oregonstate.edu/search/?P=ES%20572","Sustainability Course"]
[null,"SLCS","ES",575,"ES 575","CRITICAL RACE FEMINISM","Grad","https://secure.oregonstate.edu/ap/cps/documents/view/123912","Sustainability Course"]
[null,"SLCS","ES",577,"ES 577","QUEER/TRANS PEOPLE OF COLOR ARTS AND ACTIVISM. (4 Credits)","Grad","https://catalog.oregonstate.edu/search/?P=ES%20577","Sustainability Course"]
[null,"MIME","ESE",255,"ESE 255","Energy Regulation","Undergrad","https://secure.oregonstate.edu/ap/cps/documents/view/112354 ","Sustainability Course"]
[null,"MIME","ESE",355,"ESE 355","ENERGY REGULATION","Undergrad","https://secure.oregonstate.edu/ap/cps/documents/view/112354","Sustainability Course"]
[null,"MIME","ESE",360,"ESE 360","ENERGY CONSUMPTION ANALYSIS","Undergrad","https://secure.oregonstate.edu/ap/cps/documents/view/112355","Sustainability Course"]
[null,"MIME","ESE",450,"ESE 450","ENERGY GENERATION SYSTEMS","Undergrad","https://secure.oregonstate.edu/ap/cps/documents/view/112356","Sustainability Course"]
[null,"MIME","ESE",498,"ESE 498","^MIME CAPSTONE DESIGN","Undergrad","https://secure.oregonstate.edu/ap/cps/documents/view/113441","Sustainability Course"]
[null,"BPHS","EXSS",551,"EXSS 551","Current Trends and Issues in Physical Education","Grad","https://secure.oregonstate.edu/ap/cps/documents/view/114978","Sustainability Course"]
[null,"SLCS","FCSJ",261,"FCSJ 261","*FOOD IN AMERICAN CULTURE","Undergrad","https://secure.oregonstate.edu/ap/cps/documents/view/118018","Sustainability Course"]
[null,"SLCS","FCSJ",361,"FCSJ 361","*FOOD JUSTICE","Undergrad","https://secure.oregonstate.edu/ap/cps/documents/view/120125","Sustainability Course"]
[null,"SLCS","FCSJ",422,"FCSJ 422","INTERCULTURAL LEARNING COMMUNI","Undergrad","https://catalog.oregonstate.edu/search/?P=FCSJ%20422","Sustainability Course"]
[null,"SLCS","FCSJ",454,"FCSJ 454","*INTL PERSPECTIVES FOOD SYSTEM","Undergrad","https://catalog.oregonstate.edu/search/?P=FCSJ%20454","Sustainability Course"]
[null,"SLCS","FCSJ",464,"FCSJ 464","FOOD AND ETHNIC IDENTITY","Undergrad","https://catalog.oregonstate.edu/search/?P=FCSJ%20464","Sustainability Course"]
[null,"SLCS","FCSJ",467,"FCSJ 467","CAPSTONE: FOOD CULT SOC JUST","Undergrad","https://secure.oregonstate.edu/ap/cps/documents/view/117731","Sustainability Course"]
[null,"SLCS","FCSJ",522,"FCSJ 522","INTERCULTURAL LEARNING COMMUNI","Grad","https://catalog.oregonstate.edu/search/?P=FCSJ%20522","Sustainability Course"]
[null,"SLCS","FCSJ",554,"FCSJ 554","INTL PERSPECTIVES FOOD SYSTEMS","Grad","https://catalog.oregonstate.edu/search/?P=FCSJ%20554","Sustainability Course"]
[null,"SLCS","FCSJ",564,"FCSJ 564","FOOD AND ETHNIC IDENTITY","Grad","https://catalog.oregonstate.edu/search/?P=FCSJ%20564","Sustainability Course"]
[null,"SLCS","FCSJ",567,"FCSJ 567","AGRI-FOOD MOVEMENTS. (4 Credits)","Grad","https://secure.oregonstate.edu/ap/cps/documents/view/118027","Sustainability Course"]
[null,"FERM","FE",257,"FE 257","GIS & FOREST ENGINEERING APPS","Undergrad","https://secure.oregonstate.edu/ap/cps/documents/view/110351","Sustainability Course"]
[null,"FERM","FE",312,"FE 312","FORESTRY FIELD SCHOOL","Undergrad","https://secure.oregonstate.edu/ap/cps/documents/view/119531","Sustainability Course"]
[null,"FERM","FE",371,"FE 371","HARVESTING PROCESS ENGINEERING","Undergrad","https://secure.oregonstate.edu/ap/cps/proposals/view/94065","Sustainability Course"]
[null,"FERM","FE",426,"FE 426","Forest Disturbance Hydrology ","Undergrad","https://secure.oregonstate.edu/ap/cps/documents/view/129719","Sustainability Course"]
[null,"FERM","FE",434,"FE 434","FOREST WATERSHED MANAGEMENT","Undergrad","https://secure.oregonstate.edu/ap/cps/documents/view/109727","Sustainability Course"]
[null,"FERM","FE",435,"FE 435","FE 435 FOREST WATERSHED MANAGEMENT IMPACTS (3)  ","Undergrad","https://secure.oregonstate.edu/ap/cps/documents/view/109208","Sustainability Course"]
[null,"FERM","FE",457,"FE 457","TECHNIQ FOREST RESOURCE ANALYS","Undergrad","https://catalog.oregonstate.edu/search/?P=FE%20457","Sustainability Course"]
[null,"FERM","FE",460,"FE 460","^FOREST OPERATIONS REGULATIONS AND POLICY ISSUES. (3 Credits)","Undergrad","https://catalog.oregonstate.edu/search/?P=FE%20460","Sustainability Course"]
[null,"FERM","FE",469,"FE 469","FOREST MGMT PLAN & DESIGN II","Undergrad","https://catalog.oregonstate.edu/search/?P=FE%20469","Sustainability Course"]
[null,"FERM","FE",532,"FE 532","FOREST HYDROLOGY","Grad","https://secure.oregonstate.edu/ap/cps/documents/view/108981","Sustainability Course"]
[null,"FERM","FE",557,"FE 557","TECHNIQ FOREST RESOURCE ANALYS","Grad","https://catalog.oregonstate.edu/search/?P=FE%20557","Sustainability Course"]
[null,"FERM","FE",559,"FE 559","Forest Management Planning and Design I ","Grad","https://secure.oregonstate.edu/ap/cps/documents/view/125343","Sustainability Course"]
[null,"FERM","FE",560,"FE 560","FOREST OPERATIONS REGULATIONS AND POLICY ISSUES. (3 Credits)","Grad","https://catalog.oregonstate.edu/search/?P=FE%20560","Sustainability Course"]
[null,"FES","FES",240,"FES 240","*FOREST BIOLOGY","Undergrad","https://secure.oregonstate.edu/ap/cps/documents/view/123176","Sustainability Course"]
[null,"FES","FES",351,"FES 351","FES 351 OUTDOOR RECREATION MANAGEMENT ON PUBLIC LANDS (3) ","Undergrad","https://secure.oregonstate.edu/ap/cps/documents/view/123171","Sustainability Course"]
[null,"FES","FES",353,"FES 353","NATURE, ECO, & ADV TOURISM","Undergrad","https://secure.oregonstate.edu/ap/cps/documents/view/121149","Sustainability Course"]
[null,"FES","FES",354,"FES 354","FES 354 COMMUNITIES, NATURAL AREAS, AND SUSTAINABLE TOURISM (3) ","Undergrad","https://secure.oregonstate.edu/ap/cps/documents/view/121058","Sustainability Course"]
[null,"FES","FES",355,{"$f":"TRIM(C298)&\" \"&TRIM(D298)","v":"FES 355"},"MGMT FOR MULTIPLE RESOURCE VAL","Undergrad","https://secure.oregonstate.edu/ap/cps/documents/view/128609","Sustainability Course"]
[null,"FES","FES",357,"FES 357","PARKS AND PROTECTED AREAS MGMT","Undergrad","https://secure.oregonstate.edu/ap/cps/documents/view/121787","Sustainability Course"]
[null,"FES","FES",412,{"$f":"TRIM(C300)&\" \"&TRIM(D300)","v":"FES 412"},"FOREST ENTOMOLOGY","Undergrad","https://secure.oregonstate.edu/ap/cps/documents/view/125454","Sustainability Course"]
[null,"FES","FES",430,"FES 430","FOREST AS CLASSROOM","Undergrad","https://catalog.oregonstate.edu/search/?P=FES%20430","Sustainability Course"]
[null,"FES","FES",432,"FES 432","FES 432 ECONOMICS OF RECREATION AND TOURISM (3)","Undergrad","https://secure.oregonstate.edu/ap/cps/documents/view/123811","Sustainability Course"]
[null,"FES","FES",433,"FES 433","PLANNING AGROFORESTRY PROJECTS","Undergrad","https://secure.oregonstate.edu/ap/cps/documents/view/5579","Sustainability Course"]
[null,"FES","FES",435,"FES 435","*GENES & CHEM VALUE & RISK","Undergrad","https://catalog.oregonstate.edu/search/?P=FES%20435","Sustainability Course"]
[null,"FES","FES",440,{"$f":"TRIM(C305)&\" \"&TRIM(D305)","v":"FES 440"},"WILDLAND FIRE ECOLOGY","Undergrad","https://secure.oregonstate.edu/ap/cps/documents/view/126482","Sustainability Course"]
[null,"FES","FES",447,"FES 447","ARBORICULTURE","Undergrad","https://catalog.oregonstate.edu/search/?P=FES%20447","Sustainability Course"]
[null,"FES","FES",452,"FES 452","BIODIVERSITY CONSV MNGD FOREST","Undergrad","https://catalog.oregonstate.edu/search/?P=FES%20452","Sustainability Course"]
[null,"FES","FES",456,"FES 456","FES 456 PLANNING FOR SUSTAINABLE RECREATION (4)","Undergrad","https://secure.oregonstate.edu/ap/cps/documents/view/121756","Sustainability Course"]
[null,"FES","FES",457,"FES 457","FES 457 PLANNING FOR SUSTAINABLE TOURISM (4) ","Undergrad","https://secure.oregonstate.edu/ap/cps/documents/view/121468","Sustainability Course"]
[null,"FES","FES",470,"FES 470","Interorganizational Issues in Natural Resource Management","Undergrad","https://secure.oregonstate.edu/ap/cps/documents/view/112608","Sustainability Course"]
[null,"FES","FES",477,{"$f":"TRIM(C311)&\" \"&TRIM(D311)","v":"FES 477"},"*AGROFORESTRY","Undergrad","https://secure.oregonstate.edu/ap/cps/documents/view/129872","Sustainability Course"]
[null,"FES","FES",485,"FES 485","*CONSENSUS & NATURAL RESOURCES","Undergrad","https://catalog.oregonstate.edu/search/?P=FES%20485","Sustainability Course"]
[null,"FES","FES",486,"FES 486","^PUBLIC LANDS POLICY AND MANAGEMENT. (3 Credits)","Undergrad","https://secure.oregonstate.edu/ap/cps/documents/view/133872 Ecampushttps://secure.oregonstate.edu/ap/cps/documents/view/133871","Sustainability Course"]
[null,"FES","FES",500,"FES 500","MRKT TOOLS GRNHS GAS EMISSIONS","Grad","https://catalog.oregonstate.edu/search/?P=FES%20500","Sustainability Course"]
[null,"FES","FES",512,{"$f":"TRIM(C315)&\" \"&TRIM(D315)","v":"FES 512"},"FOREST ENTOMOLOGY","Grad","https://secure.oregonstate.edu/ap/cps/documents/view/125454","Sustainability Course"]
[null,"FES","FES",521,"FES 521","NATURAL RESOURCE RESEARCH PLAN","Grad","https://secure.oregonstate.edu/ap/cps/documents/view/112891","Sustainability Course"]
[null,"FES","FES",530,"FES 530","FOREST AS CLASSROOM","Grad","https://catalog.oregonstate.edu/search/?P=FES%20530","Sustainability Course"]
[null,"FES","FES",533,"FES 533","PLANNING AGROFORESTRY PROJECTS","Grad","https://secure.oregonstate.edu/ap/cps/documents/view/5579","Sustainability Course"]
[null,"FES","FES",535,"FES 535","GENES & CHEM VALUE & RISK","Grad","https://catalog.oregonstate.edu/search/?P=FES%20535","Sustainability Course"]
[null,"FES","FES",536,"FES 536","CARBON SEQUESTRATION IN FOREST","Grad","https://secure.oregonstate.edu/ap/cps/documents/view/104241","Sustainability Course"]
[null,"FES","FES",538,"FES 538","VALUATION OF NON-MARKET RESOURCES. (3 Credits)","Grad","https://secure.oregonstate.edu/ap/cps/documents/view/116290","Sustainability Course"]
[null,"FES","FES",540,{"$f":"TRIM(C322)&\" \"&TRIM(D322)","v":"FES 540"},"WILDLAND FIRE ECOLOGY",{"$f":"IF(D322>499,\"Grad\", \"Undergrad\")","v":"Grad"},"https://secure.oregonstate.edu/ap/cps/documents/view/126482","Sustainability Course"]
[null,"FES","FES",546,"FES 546","ADV FOREST COMMUNITY ECOLOGY","Grad","https://secure.oregonstate.edu/ap/cps/documents/view/112838","Sustainability Course"]
[null,"FES","FES",547,"FES 547","ARBORICULTURE","Grad","https://catalog.oregonstate.edu/search/?P=FES%20547","Sustainability Course"]
[null,"FES","FES",552,"FES 552","FOREST WILDLIFE HABITAT MGMT","Grad","https://secure.oregonstate.edu/ap/cps/documents/view/118016","Sustainability Course"]
[null,"FES","FES",560,"FES 560","GREEN INFRASTRUCTURE","Grad","https://secure.oregonstate.edu/ap/cps/documents/view/115846","Sustainability Course"]
[null,"FES","FES",570,"FES 570","Interorganizational Issues in Natural Resource Management","Grad","https://secure.oregonstate.edu/ap/cps/documents/view/112608","Sustainability Course"]
[null,"FES","FES",577,{"$f":"TRIM(C328)&\" \"&TRIM(D328)","v":"FES 577"},"AGROFORESTRY","Grad","https://secure.oregonstate.edu/ap/cps/documents/view/129872","Sustainability Course"]
[null,"FES","FES",586,"FES 586","PUBLIC LANDS POLICY AND MANAGEMENT. (3 Credits)","Grad","https://secure.oregonstate.edu/ap/cps/documents/view/133872 Ecampushttps://secure.oregonstate.edu/ap/cps/documents/view/133871","Sustainability Course"]
[null,"FES","FES",600,"FES 600","GLOBAL CHANGE ECOLOGY","Grad","https://secure.oregonstate.edu/ap/cps/documents/view/121564","Sustainability Course"]
[null,"FERM","FOR",206,"FOR 206","*FOREST SOILS LAB FOR SOIL 205","Undergrad","https://secure.oregonstate.edu/ap/cps/documents/view/116514","Sustainability Course"]
[null,"FERM","FOR",208,"FOR 208","FOREST SOILS RECITATION","Undergrad","https://secure.oregonstate.edu/ap/cps/documents/view/116968","Sustainability Course"]
[null,"FERM","FOR",312,"FOR 312","FORESTRY FIELD SCHOOL","Undergrad","https://secure.oregonstate.edu/ap/cps/documents/view/119532","Sustainability Course"]
[null,"FERM","FOR",330,"FOR 330","FOREST RESOURCE ECONOMICS I","Undergrad","https://secure.oregonstate.edu/ap/cps/documents/view/125143","Sustainability Course"]
[null,"FERM","FOR",331,"FOR 331","FOREST RESOURCE ECONOMICS II","Undergrad","https://secure.oregonstate.edu/ap/cps/documents/view/125298","Sustainability Course"]
[null,"FERM","FOR",332,"FOR 332","Risk and Decision-making for Natural Resource Management","Undergrad","https://secure.oregonstate.edu/ap/cps/documents/view/5749","Sustainability Course"]
[null,"FERM","FOR",341,"FOR 341","Forest Ecology","Undergrad","https://secure.oregonstate.edu/ap/cps/documents/view/5750","Sustainability Course"]
[null,"FERM","FOR",346,"FOR 346","TOPICS IN WILDLAND FIRE","Undergrad","https://secure.oregonstate.edu/ap/cps/documents/view/123804","Sustainability Course"]
[null,"FERM","FOR",355,"FOR 355","Amenity Resource Management","Undergrad","https://secure.oregonstate.edu/ap/cps/documents/view/100422","Sustainability Course"]
[null,"FERM","FOR",374,"FOR 374","Tourism Information Technology Syllabus","Undergrad","https://secure.oregonstate.edu/ap/cps/documents/view/5921","Sustainability Course"]
[null,"FERM","FOR",376,"FOR 376","Tourism and Outdoor Recreation for Special Populations","Undergrad","https://secure.oregonstate.edu/ap/cps/documents/view/5956","Sustainability Course"]
[null,"FERM","FOR",380,"FOR 380","Expeditions II - Water","Undergrad","https://secure.oregonstate.edu/ap/cps/documents/view/111929","Sustainability Course"]
[null,"FERM","FOR",413,"FOR 413","FOREST PATHOLOGY","Undergrad","https://catalog.oregonstate.edu/search/?P=FOR%20413","Sustainability Course"]
[null,"FERM","FOR",417,"FOR 417","ADVANCED FOREST SOILS","Undergrad","https://catalog.oregonstate.edu/search/?P=FOR%20417","Sustainability Course"]
[null,"FERM","FOR",429,"FOR 429","INTEGRATED PRESCRIPTIONS. (3 Credits)","Undergrad","https://secure.oregonstate.edu/ap/cps/documents/view/5958","Sustainability Course"]
[null,"FERM","FOR",431,"FOR 431","ECON & PLCY FOREST WLDLND FIRE","Undergrad","https://secure.oregonstate.edu/ap/cps/documents/view/122226","Sustainability Course"]
[null,"FERM","FOR",442,"FOR 442","SILVICULTURE REFORESTATION","Undergrad","https://secure.oregonstate.edu/ap/cps/documents/view/123575","Sustainability Course"]
[null,"FERM","FOR",446,"FOR 446","Wildland Fire Ecology","Undergrad","https://secure.oregonstate.edu/ap/cps/documents/view/123809 \nhttps://secure.oregonstate.edu/ap/cps/documents/view/123810","Sustainability Course"]
[null,"FERM","FOR",447,"FOR 447","Arboriculture","Undergrad","https://secure.oregonstate.edu/ap/cps/documents/view/10705","Sustainability Course"]
[null,"FERM","FOR",454,"FOR 454","Managing at the Wildland-Urban Interface","Undergrad","https://secure.oregonstate.edu/ap/cps/documents/view/7351","Sustainability Course"]
[null,"FERM","FOR",455,"FOR 455","Urban Forest Planning, Policy and Management ","Undergrad","https://secure.oregonstate.edu/ap/cps/documents/view/108511","Sustainability Course"]
[null,"FERM","FOR",457,"FOR 457","TECHNIQ FOREST RESOURCE ANALYS","Undergrad","https://catalog.oregonstate.edu/search/?P=FOR%20457","Sustainability Course"]
[null,"FERM","FOR",469,"FOR 469","FOREST MGMT PLAN & DESIGN II","Undergrad","https://catalog.oregonstate.edu/search/?P=FOR%20469","Sustainability Course"]
[null,"FERM","FOR",471,"FOR 471","Sustainability in Tourism and Outdoor Leadership","Undergrad","https://secure.oregonstate.edu/ap/cps/documents/view/101860","Sustainability Course"]
[null,"FERM","FOR",479,"FOR 479","Nature and the Human Experience","Undergrad","https://secure.oregonstate.edu/ap/cps/documents/view/109257","Sustainability Course"]
[null,"FERM","FOR",513,"FOR 513","FOREST PATHOLOGY","Grad","https://catalog.oregonstate.edu/search/?P=FOR%20513","Sustainability Course"]
[null,"FERM","FOR",517,"FOR 517","ADVANCED FOREST SOILS","Grad","https://catalog.oregonstate.edu/search/?P=FOR%20517","Sustainability Course"]
[null,"FERM","FOR",534,{"$f":"TRIM(C358)&\" \"&TRIM(D358)","v":"FOR 534"},"ECON OF THE FOREST RESOURCE","Grad","https://secure.oregonstate.edu/ap/cps/documents/view/133880","Sustainability Course"]
[null,"FERM","FOR",546,"FOR 546","Wildland Fire Ecology","Grad","https://secure.oregonstate.edu/ap/cps/documents/view/123809 \nhttps://secure.oregonstate.edu/ap/cps/documents/view/123810","Sustainability Course"]
[null,"FERM","FOR",549,"FOR 549","SILVICULTURAL INFLUENCES","Grad","https://secure.oregonstate.edu/ap/cps/documents/view/123133","Sustainability Course"]
[null,"FERM","FOR",550,"FOR 550","SUSTAINABLE FOREST MANAGEMENT","Grad","https://secure.oregonstate.edu/ap/cps/documents/view/125447","Sustainability Course"]
[null,"FERM","FOR",554,"FOR 554","Managing at the Wildland-Urban Interface","Grad","https://secure.oregonstate.edu/ap/cps/documents/view/7351","Sustainability Course"]
[null,"FERM","FOR",555,"FOR 555","Urban Forest Planning, Policy and Management ","Grad","https://secure.oregonstate.edu/ap/cps/documents/view/108511","Sustainability Course"]
[null,"FERM","FOR",557,"FOR 557","TECHNIQ FOREST RESOURCE ANALYS","Grad","https://catalog.oregonstate.edu/search/?P=FOR%20557","Sustainability Course"]
[null,"FERM","FOR",559,"FOR 559","Forest Management Planning and Design I ","Grad","https://secure.oregonstate.edu/ap/cps/documents/view/125343","Sustainability Course"]
[null,"FERM","FS",535,"FS 535","Genes and Chemicals in Agriculture: Value and Risk","Grad","https://secure.oregonstate.edu/ap/cps/documents/view/101319","Sustainability Course"]
[null,"FERM","FS",536,"FS 536","Carbon Sequestration in Forests","Grad","https://secure.oregonstate.edu/ap/cps/documents/view/101561","Sustainability Course"]
[null,"FERM","FS",542,"FS 542","Silviculture: The Art and Practice of Conservation Planting","Grad","https://secure.oregonstate.edu/ap/cps/documents/view/8123","Sustainability Course"]
[null,"FERM","FS",547,"FS 547","Nutrient Cycling","Grad","https://secure.oregonstate.edu/ap/cps/documents/view/111010","Sustainability Course"]
[null,"FW","FW",112,"FW 112","SCIENCE OF FLY FISHING TROUT. (1 Credit)","Undergrad","https://secure.oregonstate.edu/ap/cps/documents/view/117640","Sustainability Course"]
[null,"FW","FW",113,{"$f":"TRIM(C371)&\" \"&TRIM(D371)","v":"FW 113"},"INTRO MARINE BIRDS & MAMMALS","Undergrad","https://secure.oregonstate.edu/ap/cps/documents/view/130487","Sustainability Course"]
[null,"FW","FW",289,"FW 289","COMMUNICATION SKILLS FOR F&W","Undergrad","https://secure.oregonstate.edu/ap/cps/documents/view/125329","Sustainability Course"]
[null,"FW","FW",301,"FW 301","FIELD TECH MARINE MAMMAL CONS","Undergrad","https://secure.oregonstate.edu/ap/cps/documents/view/114793","Sustainability Course"]
[null,"FW","FW",302,"FW 302","BIOLOGY OF MARINE MAMMALS","Undergrad","https://catalog.oregonstate.edu/search/?P=FW%20302","Sustainability Course"]
[null,"FW","FW",321,{"$f":"TRIM(C375)&\" \"&TRIM(D375)","v":"FW 321"},"COMMUNITY & ECOSYSTEM ECOLOGY","Undergrad","https://secure.oregonstate.edu/ap/cps/documents/view/99968","Sustainability Course"]
[null,"FW","FW",324,{"$f":"TRIM(C376)&\" \"&TRIM(D376)","v":"FW 324"},"*FOOD FROM THE SEA","Undergrad","https://secure.oregonstate.edu/ap/cps/documents/view/130197","Sustainability Course"]
[null,"FW","FW",331,"FW 331","ECO MARINE & ESTUARINE BIRDS","Undergrad","https://secure.oregonstate.edu/ap/cps/documents/view/115388","Sustainability Course"]
[null,"FW","FW",345,{"$f":"TRIM(C378)&\" \"&TRIM(D378)","v":"FW 345"},"*GLOBAL CHANGE BIOLOGY","Undergrad","https://secure.oregonstate.edu/ap/cps/proposals/view/100350","Sustainability Course"]
[null,"FW","FW",366,"FW 366","ENVIROMNTL CONTAMINANTS IN FW","Undergrad","https://secure.oregonstate.edu/ap/cps/documents/view/125366","Sustainability Course"]
[null,"FW","FW",415,"FW 415","FISH & WILDLIFE LAW AND POLICY","Undergrad","https://catalog.oregonstate.edu/search/?P=FW%20415","Sustainability Course"]
[null,"FW","FW",419,"FW 419","WHALES AND WHALING","Undergrad","https://catalog.oregonstate.edu/search/?P=FW%20419","Sustainability Course"]
[null,"FW","FW",422,"FW 422","INTRODUCTION TO OCEAN LAW","Undergrad","https://catalog.oregonstate.edu/search/?P=FW%20422","Sustainability Course"]
[null,"FW","FW",426,"FW 426","COASTAL ECOLOGY & RESOURCE MGT","Undergrad","https://catalog.oregonstate.edu/search/?P=FW%20426","Sustainability Course"]
[null,"FW","FW",434,"FW 434","ESTUARINE ECOLOGY","Undergrad","https://catalog.oregonstate.edu/search/?P=FW%20434","Sustainability Course"]
[null,"FW","FW",439,"FW 439","^HUMAN DIMENSIONS OF F&W MGMT","Undergrad","https://secure.oregonstate.edu/ap/cps/documents/view/109989","Sustainability Course"]
[null,"FW","FW",445,"FW 445","ECOLOGICAL RESTORATION",{"$f":"IF(D386>499,\"Grad\", \"Undergrad\")","v":"Undergrad"},"https://catalog.oregonstate.edu/search/?P=FW%20445","Sustainability Course"]
[null,"FW","FW",446,"FW 446","Wildland Fire Ecology","Undergrad","https://secure.oregonstate.edu/ap/cps/documents/view/6573","Sustainability Course"]
[null,"FW","FW",452,"FW 452","BIODIVERSITY CONSV MNGD FOREST","Undergrad","https://catalog.oregonstate.edu/search/?P=FW%20452","Sustainability Course"]
[null,"FW","FW",456,{"$f":"TRIM(C389)&\" \"&TRIM(D389)","v":"FW 456"},"FRESHWATER ECOLOGY","Undergrad","https://secure.oregonstate.edu/ap/cps/documents/view/129923","Sustainability Course"]
[null,"FW","FW",458,"FW 458","MAMMAL CONSERVATION AND MGMT","Undergrad","https://catalog.oregonstate.edu/search/?P=FW%20458","Sustainability Course"]
[null,"FW","FW",462,"FW 462","ECOSYSTEM SERVICES","Undergrad","https://catalog.oregonstate.edu/search/?P=FW%20462","Sustainability Course"]
[null,"FW","FW",467,"FW 467","ANTARCTIC SCIENCE & CONSERV","Undergrad","https://secure.oregonstate.edu/ap/cps/documents/view/106134","Sustainability Course"]
[null,"FW","FW",481,"FW 481","WILDLIFE ECOLOGY","Undergrad","https://catalog.oregonstate.edu/search/?P=FW%20481","Sustainability Course"]
[null,"FW","FW",485,"FW 485","FW 485 CONSENSUS AND NATURAL RESOURCES (3)","Undergrad","https://catalog.oregonstate.edu/search/?P=FW%20485","Sustainability Course"]
[null,"FW","FW",488,"FW 488","PROBLEM SOLVING IN FW SCIENCE","Undergrad","https://secure.oregonstate.edu/ap/cps/documents/view/9184","Sustainability Course"]
[null,"FW","FW",489,"FW 489","EFFECTIVE COMMUNICATIONS IN FW","Undergrad","https://secure.oregonstate.edu/ap/cps/documents/view/9197","Sustainability Course"]
[null,"FW","FW",515,"FW 515","FISH & WILDLIFE LAW AND POLICY","Grad","https://catalog.oregonstate.edu/search/?P=FW%20515","Sustainability Course"]
[null,"FW","FW",519,"FW 519","WHALES AND WHALING","Grad","https://catalog.oregonstate.edu/search/?P=FW%20519","Sustainability Course"]
[null,"FW","FW",520,"FW 520","FW 520 ECOLOGY AND MANAGEMENT OF MARINE FISHES (3)","Grad","https://secure.oregonstate.edu/ap/cps/documents/view/3716","Sustainability Course"]
[null,"FW","FW",522,"FW 522","INTRODUCTION TO OCEAN LAW","Grad","https://catalog.oregonstate.edu/search/?P=FW%20522","Sustainability Course"]
[null,"FW","FW",524,"FW 524","INTRO TO FISHERES ASSESSMENT","Grad","https://secure.oregonstate.edu/ap/cps/documents/view/112705","Sustainability Course"]
[null,"FW","FW",526,"FW 526","COASTAL ECOLOGY & RESOURCE MGT","Grad","https://catalog.oregonstate.edu/search/?P=FW%20526","Sustainability Course"]
[null,"FW","FW",534,"FW 534","ESTUARINE ECOLOGY","Grad","https://catalog.oregonstate.edu/search/?P=FW%20534","Sustainability Course"]
[null,"FW","FW",537,"FW 537","STRUCTURED DECISION MAKING IN NATURAL RESOURCE MANAGEMENT. (2 Credits)","Grad","https://secure.oregonstate.edu/ap/cps/documents/view/103847","Sustainability Course"]
[null,"FW","FW",545,"FW 545","ECOLOGICAL RESTORATION","Grad","https://catalog.oregonstate.edu/search/?P=FW%20545","Sustainability Course"]
[null,"FW","FW",546,"FW 546","Wildland Fire Ecology","Grad","https://secure.oregonstate.edu/ap/cps/documents/view/6573","Sustainability Course"]
[null,"FW","FW",552,"FW 552","FOREST WILDLIFE HABITAT MGMT","Grad","https://secure.oregonstate.edu/ap/cps/documents/view/118024","Sustainability Course"]
[null,"FW","FW",556,{"$f":"TRIM(C408)&\" \"&TRIM(D408)","v":"FW 556"},"FRESHWATER ECOLOGY","Grad","https://secure.oregonstate.edu/ap/cps/documents/view/129923","Sustainability Course"]
[null,"FW","FW",558,"FW 558","MAMMAL CONSERVATION AND MGMT","Grad","https://catalog.oregonstate.edu/search/?P=FW%20558","Sustainability Course"]
[null,"FW","FW",560,{"$f":"TRIM(C410)&\" \"&TRIM(D410)","v":"FW 560"},"ENVIRONMENTAL DECISIONS","Grad","https://secure.oregonstate.edu/ap/cps/documents/view/128344","Sustainability Course"]
[null,"FW","FW",562,"FW 562","ECOSYSTEM SERVICES","Grad","https://catalog.oregonstate.edu/search/?P=FW%20562","Sustainability Course"]
[null,"FW","FW",581,"FW 581","WILDLIFE ECOLOGY. (3 Credits)","Grad","https://secure.oregonstate.edu/ap/cps/documents/view/120213","Sustainability Course"]
[null,"FW","FW",583,"FW 583","SPECIES RCVRY PLNNG & RSTORTON","Grad","https://secure.oregonstate.edu/ap/cps/documents/view/117124","Sustainability Course"]
[null,"FW","FW",585,"FW 585","FW 585 CONSENSUS AND NATURAL RESOURCES (3)","Grad","https://catalog.oregonstate.edu/search/?P=FW%20585","Sustainability Course"]
[null,"FW","FW",620,"FW 620","ECOLOGICAL POLICY","Grad","https://secure.oregonstate.edu/ap/cps/documents/view/6305","Sustainability Course"]
[null,"GEO","GEO",204,"GEO 204","CLIMATE CHANGE, WATER AND SOCIETY","Undergrad","https://secure.oregonstate.edu/ap/cps/documents/view/116663","Sustainability Course"]
[null,"GEO","GEO",221,"GEO 221","*ENVIRONMENTAL GEOLOGY","Undergrad","https://secure.oregonstate.edu/ap/cps/documents/view/5446","Sustainability Course"]
[null,"GEO","GEO",304,"GEO 304","GEOGRAPHY OF NATURAL HAZARDS","Undergrad","https://secure.oregonstate.edu/ap/cps/documents/view/116584","Sustainability Course"]
[null,"GEO","GEO",311,"GEO 311","Environmental Policy in 20th Century America ","Undergrad","https://secure.oregonstate.edu/ap/cps/documents/view/3647","Sustainability Course"]
[null,"GEO","GEO",340,"GEO 340","STRUCTURAL GEOLOGY","Undergrad","https://secure.oregonstate.edu/ap/cps/documents/view/110122","Sustainability Course"]
[null,"GEO","GEO",409,"GEO 409","Contemporary Earth Science Issues","Undergrad","https://secure.oregonstate.edu/ap/cps/documents/view/109473","Sustainability Course"]
[null,"GEO","GEO",426,"GEO 426","Development and Global Resources","Undergrad","https://secure.oregonstate.edu/ap/cps/documents/view/109200","Sustainability Course"]
[null,"GEO","GEO",433,"GEO 433","COASTAL GEOMORPHOLOGY","Undergrad","https://catalog.oregonstate.edu/search/?P=GEO%20433","Sustainability Course"]
[null,"GEO","GEO",449,"GEO 449","Geography of Food and Agriculture","Undergrad","https://secure.oregonstate.edu/ap/cps/documents/view/115428","Sustainability Course"]
[null,"GEO","GEO",486,"GEO 486","QUATERNARY PALEOCLIMATOLOGY. (3 Credits)","Undergrad","https://catalog.oregonstate.edu/search/?P=GEO%20486","Sustainability Course"]
[null,"GEO","GEO",526,"GEO 526","Development and Global Resources","Grad","https://secure.oregonstate.edu/ap/cps/documents/view/109200","Sustainability Course"]
[null,"GEO","GEO",533,"GEO 533","COASTAL GEOMORPHOLOGY. (3 Credits)","Grad","https://catalog.oregonstate.edu/search/?P=GEO%20533","Sustainability Course"]
[null,"GEO","GEO",549,"GEO 549","Geography of Food and Agriculture","Grad","https://secure.oregonstate.edu/ap/cps/documents/view/115428","Sustainability Course"]
[null,"GEO","GEO",586,"GEO 586","QUATERNARY PALEOCLIMATOLOGY","Grad","https://catalog.oregonstate.edu/search/?P=GEO%20586","Sustainability Course"]
[null,"GEO","GEOG",100,{"$f":"TRIM(C430)&\" \"&TRIM(D430)","v":"GEOG 100"},"*CLIMATE JUSTICE","Undergrad","https://secure.oregonstate.edu/ap/cps/documents/view/127906 ","Sustainability Course"]
[null,"GEO","GEOG",102,"GEOG 102","*PHYSICAL GEOGRAPHY","Undergrad","https://secure.oregonstate.edu/ap/cps/documents/view/124441","Sustainability Course"]
[null,"GEO","GEOG",103,"GEOG 103","*HUMAN GEOGRAPHY","Undergrad","https://secure.oregonstate.edu/ap/cps/documents/view/124842","Sustainability Course"]
[null,"GEO","GEOG",203,"GEOG 203","*HUMAN-ENVIRONMENT GEOGRAPHY","Undergrad","https://secure.oregonstate.edu/ap/cps/documents/view/124299","Sustainability Course"]
[null,"GEO","GEOG",240,"GEOG 240","*CLIMATE CHANGE, WATER & SOC","Undergrad","https://secure.oregonstate.edu/ap/cps/documents/view/122867","Sustainability Course"]
[null,"GEO","GEOG",250,"GEOG 250","*LAND USE PLANNING","Undergrad","https://secure.oregonstate.edu/ap/cps/documents/view/124300","Sustainability Course"]
[null,"GEO","GEOG",313,"GEOG 313","*GEOGRAPHY OF ASIA","Undergrad","https://secure.oregonstate.edu/ap/cps/documents/view/122471","Sustainability Course"]
[null,"GEO","GEOG",331,{"$f":"TRIM(C437)&\" \"&TRIM(D437)","v":"GEOG 331"},"*POPULATION, CONSUMPTION,& ENV","Undergrad","https://secure.oregonstate.edu/ap/cps/documents/view/126600","Sustainability Course"]
[null,"GEO","GEOG",340,"GEOG 340","*INTRO WATER SCIENCE & POLICY","Undergrad","https://secure.oregonstate.edu/ap/cps/documents/view/124013","Sustainability Course"]
[null,"GEO","GEOG",350,{"$f":"TRIM(C439)&\" \"&TRIM(D439)","v":"GEOG 350"},"*GEOGRAPHY OF NATURAL HAZARDS","Undergrad","https://secure.oregonstate.edu/ap/cps/documents/view/126597","Sustainability Course"]
[null,"GEO","GEOG",430,"GEOG 430","RESILIENCE-BASED NAT RES MGMT","Undergrad","https://catalog.oregonstate.edu/search/?P=GEOG%20430","Sustainability Course"]
[null,"GEO","GEOG",431,"GEOG 431","GLOBAL RESOURCES AND DEVELOPMENT. (3 Credits)","Undergrad","https://catalog.oregonstate.edu/search/?P=GEOG%20431","Sustainability Course"]
[null,"GEO","GEOG",432,{"$f":"TRIM(C442)&\" \"&TRIM(D442)","v":"GEOG 432"},"*GEOG OF FOOD & AGRICULTURE","Undergrad","https://secure.oregonstate.edu/ap/cps/documents/view/127907","Sustainability Course"]
[null,"GEO","GEOG",440,"GEOG 440","WATER RESOURCES MGMT IN THE US","Undergrad","https://catalog.oregonstate.edu/search/?P=GEOG%20440","Sustainability Course"]
[null,"GEO","GEOG",441,"GEOG 441","INTNL WATER RESOURCES MGMT","Undergrad","https://catalog.oregonstate.edu/search/?P=GEOG%20441","Sustainability Course"]
[null,"GEO","GEOG",451,"GEOG 451","PLANNING PRIN/PRAC FOR COMM","Undergrad","https://catalog.oregonstate.edu/search/?P=GEOG%20451","Sustainability Course"]
[null,"GEO","GEOG",452,"GEOG 452","SUSTAINABLE SITE PLANNING","Undergrad","https://catalog.oregonstate.edu/search/?P=GEOG%20452","Sustainability Course"]
[null,"GEO","GEOG",463,"GEOG 463","GISCIENCE IV: SPATIAL MODELING. (4 Credits)","Undergrad","https://catalog.oregonstate.edu/search/?P=GEOG%20463","Sustainability Course"]
[null,"GEO","GEOG",464,"GEOG 464","GEOSPATIAL PERSPECTIVES","Undergrad","https://catalog.oregonstate.edu/search/?P=GEOG%20464","Sustainability Course"]
[null,"GEO","GEOG",511,"GEOG 511","HISTORY & PHILOSOPHY OF GEOG","Grad","https://secure.oregonstate.edu/ap/cps/documents/view/122461","Sustainability Course"]
[null,"GEO","GEOG",512,"GEOG 512","SOCIAL-ECOLOGICAL SYSTEMS",{"$f":"IF(D450>499,\"Grad\", \"Undergrad\")","v":"Grad"},"https://secure.oregonstate.edu/ap/cps/documents/view/124888","Sustainability Course"]
[null,"GEO","GEOG",530,"GEOG 530","RESILIENCE-BASED NAT RES MGMT","Grad","https://catalog.oregonstate.edu/search/?P=GEOG%20530","Sustainability Course"]
[null,"GEO","GEOG",531,"GEOG 531","GLOBAL RESOURCES AND DEVELOPMENT. (3 Credits)","Grad","https://catalog.oregonstate.edu/search/?P=GEOG%20531","Sustainability Course"]
[null,"GEO","GEOG",532,{"$f":"TRIM(C453)&\" \"&TRIM(D453)","v":"GEOG 532"},"GEOG OF FOOD & AGRICULTURE","Grad","https://secure.oregonstate.edu/ap/cps/documents/view/127907","Sustainability Course"]
[null,"GEO","GEOG",540,"GEOG 540","WATER RESOURCES MGMT IN THE US","Grad","https://catalog.oregonstate.edu/search/?P=GEOG%20540","Sustainability Course"]
[null,"GEO","GEOG",541,"GEOG 541","INTNL WATER RESOURCES MGMT","Grad","https://catalog.oregonstate.edu/search/?P=GEOG%20541","Sustainability Course"]
[null,"GEO","GEOG",551,"GEOG 551","PLANNING PRIN/PRAC FOR COMM","Grad","https://catalog.oregonstate.edu/search/?P=GEOG%20551","Sustainability Course"]
[null,"GEO","GEOG",552,"GEOG 552","SUSTAINABLE SITE PLANNING","Grad","https://catalog.oregonstate.edu/search/?P=GEOG%20552","Sustainability Course"]
[null,"GEO","GEOG",561,"GEOG 561","GISCIENCE II: ANALYSIS & APPS","Grad","https://secure.oregonstate.edu/ap/cps/documents/view/124840","Sustainability Course"]
[null,"GEO","GEOG",563,"GEOG 563","GISCIENCE IV: SPATIAL MODELING. (4 Credits)","Grad","https://catalog.oregonstate.edu/search/?P=GEOG%20563","Sustainability Course"]
[null,"GEO","GEOG",564,"GEOG 564","GEOSPATIAL PERSPECTIVES","Grad","https://catalog.oregonstate.edu/search/?P=GEOG%20564","Sustainability Course"]
[null,"SLCS","GER",375,"GER 375","LITERATURES OF POWER AND RESISTANCE: GERMAN. (2 Credits)","Undergrad","https://secure.oregonstate.edu/ap/cps/documents/view/121719","Sustainability Course"]
[null,"GRAD","GRAD",540,"GRAD 540","INTERVENING THE ISMS:  Diversity Awareness And Tools For Intervention","Grad","https://secure.oregonstate.edu/ap/cps/documents/view/112724","Sustainability Course"]
[null,"GRAD","GRAD",542,"GRAD 542","THE INCLUSIVE CLASSROOM: DPD","Grad","https://secure.oregonstate.edu/ap/cps/documents/view/115695","Sustainability Course"]
[null,"SBHS","H",100,"H 100","INTRODUCTION TO PUBLIC HEALTH","Undergrad","https://secure.oregonstate.edu/ap/cps/documents/view/126188","Sustainability Course"]
[null,"SBHS","H",333,"H 333","*GLOBAL PUBLIC HEALTH","Undergrad","https://secure.oregonstate.edu/ap/cps/documents/view/117757","Sustainability Course"]
[null,"SBHS","H",421,"H 421","MENTAL HEALTH. (3 Credits)","Undergrad","https://secure.oregonstate.edu/ap/cps/documents/view/101677","Sustainability Course"]
[null,"SBHS","H",422,"H 422","HEALTH, AGING AND CONTROL OF CHRONIC DISEASES. (4 Credits)","Undergrad","https://catalog.oregonstate.edu/search/?P=H%20422","Sustainability Course"]
[null,"SBHS","H",480,{"$f":"TRIM(C468)&\" \"&TRIM(D468)","v":"H 480"},"UNDERGRADUATE EOH SEMINAR","Undergrad","https://secure.oregonstate.edu/ap/cps/documents/view/127043","Sustainability Course"]
[null,"SBHS","H",512,"H 512","INTRO TO ENVIRO & OCCUPAT HLTH","Grad","https://secure.oregonstate.edu/ap/cps/documents/view/107718","Sustainability Course"]
[null,"SBHS","H",513,{"$f":"TRIM(C470)&\" \"&TRIM(D470)","v":"H 513"},"INTEGRED APPR TO PUBLIC HEALTH","Grad","https://secure.oregonstate.edu/ap/cps/documents/view/128474","Sustainability Course"]
[null,"SBHS","H",519,"H 519","DISPLACE MIGRATION & GLOB HLTH","Grad","https://secure.oregonstate.edu/ap/cps/documents/view/116145","Sustainability Course"]
[null,"SBHS","H",520,"H 520","HEALTH DISPARITIES. (3 Credits)","Grad","https://secure.oregonstate.edu/ap/cps/documents/view/130460","Sustainability Course"]
[null,"SBHS","H",522,"H 522","HEALTH, AGING AND CONTROL OF CHRONIC DISEASES. (4 Credits)","Grad","https://catalog.oregonstate.edu/search/?P=H%20522","Sustainability Course"]
[null,"SBHS","H",523,"H 523","FOUNDATIONS OF PUBLIC HEALTH","Grad","https://secure.oregonstate.edu/ap/cps/documents/view/107858","Sustainability Course"]
[null,"SBHS","H",527,"H 527","CRIT ASSESS OF INTL HLTH PROGS","Grad","https://secure.oregonstate.edu/ap/cps/documents/view/121371","Sustainability Course"]
[null,"SBHS","H",533,"H 533","HEALTH SYSTEMS ORGANIZATION","Grad","https://secure.oregonstate.edu/ap/cps/documents/view/5354","Sustainability Course"]
[null,"SBHS","H",540,"H 540","WATER AND HUMAN HEALTH","Grad","https://secure.oregonstate.edu/ap/cps/documents/view/109440","Sustainability Course"]
[null,"SBHS","H",541,"H 541","AIR QUALITY AND HUMAN HEALTH","Grad","https://secure.oregonstate.edu/ap/cps/documents/view/108275","Sustainability Course"]
[null,"SBHS","H",546,"H 546","PHYSICAL AGENTS AND HUMAN HEALTH. (3 Credits)","Grad","https://secure.oregonstate.edu/ap/cps/documents/view/118761","Sustainability Course"]
[null,"SBHS","H",552,"H 552","DISASTER EPIDEMIOLOGY","Grad","https://secure.oregonstate.edu/ap/cps/documents/view/110794","Sustainability Course"]
[null,"SBHS","H",583,"H 583","EOHS MANAGEMENT","Grad","https://secure.oregonstate.edu/ap/cps/documents/view/108164","Sustainability Course"]
[null,"SBHS","H",620,"H 620","ADV TPCS/GLBL HLTH INTERV/PRAC","Grad","https://secure.oregonstate.edu/ap/cps/documents/view/124639","Sustainability Course"]
[null,"SBHS","H",626,"H 626","GLOBAL HEALTH SYSTEM FINANCE AND STRENGTHENING. (3 Credits)","Grad","https://secure.oregonstate.edu/ap/cps/documents/view/124641","Sustainability Course"]
[null,"SBHS","H",632,"H 632","APPLIED HEALTH ECONOMICS","Grad","https://secure.oregonstate.edu/ap/cps/documents/view/122687","Sustainability Course"]
[null,"SBHS","H",642,"H 642","ENVIRON & REG RISK ASSESSMENT","Grad","https://secure.oregonstate.edu/ap/cps/documents/view/108199","Sustainability Course"]
[null,"SBHS","H",655,"H 655","Global Health Systems, Policy and Politics","Grad","https://secure.oregonstate.edu/ap/cps/documents/view/124640","Sustainability Course"]
[null,"SBHS","H",673,"H 673","MEASUREMENT OF HEALTH BEHAVIOR CONCEPTS. (4 Credits)","Grad","https://secure.oregonstate.edu/ap/cps/documents/view/111229","Sustainability Course"]
[null,"SBHS","H",675,"H 675","HEALTH BEHAVIOR INTERVENTIONS","Grad","https://secure.oregonstate.edu/ap/cps/documents/view/108470","Sustainability Course"]
[null,"SBHS","H",681,"H 681","ADVANCED TOPICS IN EOHS","Grad","https://secure.oregonstate.edu/ap/cps/documents/view/108361","Sustainability Course"]
[null,"SBHS","H",682,"H 682","EOHS: RESEARCH TO PRACTICE","Grad","https://secure.oregonstate.edu/ap/cps/documents/view/108364","Sustainability Course"]
[null,"SBHS","HDFS",331,"HDFS 331","DIRECTED EXP IN EARLY CHILDHOO","Undergrad","https://secure.oregonstate.edu/ap/cps/documents/view/100445","Sustainability Course"]
[null,"SBHS","HDFS",431,"HDFS 431","FAMILY, SCHOOL & COMMUN COLLAB","Undergrad","https://secure.oregonstate.edu/ap/cps/documents/view/6631","Sustainability Course"]
[null,"SBHS","HDFS",461,"HDFS 461","^PROG DEV & PROPOSAL WRITING","Undergrad","https://secure.oregonstate.edu/ap/cps/documents/view/108155","Sustainability Course"]
[null,"SBHS","HDFS",533,"HDFS 533","SOCIAL POLICY & HUMAN DEVEL","Grad","https://secure.oregonstate.edu/ap/cps/documents/view/9779","Sustainability Course"]
[null,"SBHS","HDFS",587,"HDFS 587","SOCIAL GERONTOLOGY","Grad","https://secure.oregonstate.edu/ap/cps/documents/view/6213","Sustainability Course"]
[null,"ENGR","HEST",241,{"$f":"TRIM(C496)&\" \"&TRIM(D496)","v":"HEST 241"},"HH ENERGY IN GUATEMALA: BKGRND","Undergrad","https://secure.oregonstate.edu/ap/cps/documents/view/130527","Sustainability Course"]
[null,"ENGR","HEST",242,"HEST 242","HOUSEHOLD ENERGY IN GUATEMALA: APPLICATIONS. (3 Credits)","Undergrad","https://secure.oregonstate.edu/ap/cps/documents/view/130530","Sustainability Course"]
[null,"ENGR","HEST",541,"HEST 541","HOUSEHOLD ENERGY IN GUATEMALA: BACKGROUND. (1 Credit)","Grad","https://secure.oregonstate.edu/ap/cps/documents/view/130528","Sustainability Course"]
[null,"ENGR","HEST",542,"HEST 542","HOUSEHOLD ENERGY IN GUATEMALA: APPLICATIONS. (3 Credits)","Grad","https://secure.oregonstate.edu/ap/cps/documents/view/130531","Sustainability Course"]
[null,"BPHS","HHS",513,"HHS 513","INTEGRATED APPROACH TO PUBLIC HEALTH I. (6 Credits)","Grad","https://secure.oregonstate.edu/ap/cps/documents/view/131576","Sustainability Course"]
[null,"BPHS","HHS",514,"HHS 514","INTEGRATED APPROACH TO PUBLIC HEALTH II. (6 Credits)","Grad","https://secure.oregonstate.edu/ap/cps/documents/view/131895","Sustainability Course"]
[null,"BPHS","HHS",537,"HHS 537","EVIDENCE-BASED LEADERSHIP IN PUBLIC HEALTH. (3 Credits)","Grad","https://secure.oregonstate.edu/ap/cps/documents/view/131894","Sustainability Course"]
[null,"BPHS","HHS",597,"HHS 597","GLOBAL HEALTH SYSTEMS. (3 Credits)","Grad","https://secure.oregonstate.edu/ap/cps/documents/view/130462","Sustainability Course"]
[null,"HORT","HORT",112,"HORT 112","INTRO HORT SYSTEMS & PRACTICES","Undergrad","https://secure.oregonstate.edu/ap/cps/documents/view/9975","Sustainability Course"]
[null,"HORT","HORT",217,{"$f":"TRIM(C505)&\" \"&TRIM(D505)","v":"HORT 217"},"*SOCIAL IMPACTS OF SCIENCE","Undergrad","https://secure.oregonstate.edu/ap/cps/documents/view/126628","Sustainability Course"]
[null,"HORT","HORT",228,"HORT 228","LANDSCAPE PLANT MATERIALS II","Undergrad","https://secure.oregonstate.edu/ap/cps/documents/view/106660","Sustainability Course"]
[null,"HORT","HORT",260,"HORT 260","ORGANIC FARMING & GARDENING","Undergrad","https://secure.oregonstate.edu/ap/cps/documents/view/6045","Sustainability Course"]
[null,"HORT","HORT",271,"HORT 271","TECHNIQUES AND ADAPTIVE STRATEGIES IN THERAPEUTIC HORTICULTURE. (2 Credits)","Undergrad","https://secure.oregonstate.edu/ap/cps/documents/view/4711","Sustainability Course"]
[null,"HORT","HORT",275,"HORT 275","THERAPEUTIC GARDEN DESIGN, MAINTENANCE AND PROGRAMMING. (2 Credits)","Undergrad","https://secure.oregonstate.edu/ap/cps/documents/view/4715","Sustainability Course"]
[null,"HORT","HORT",285,"HORT 285","PERMACULTURE DESIGN AND THEORY","Undergrad","https://secure.oregonstate.edu/ap/cps/documents/view/113030","Sustainability Course"]
[null,"HORT","HORT",300,"HORT 300","CROP PRODUCTION IN PACIFIC NW","Undergrad","https://secure.oregonstate.edu/ap/cps/documents/view/108377","Sustainability Course"]
[null,"HORT","HORT",301,"HORT 301","GROWTH DEVELOPMENT HORT CROPS","Undergrad","https://secure.oregonstate.edu/ap/cps/documents/view/101894","Sustainability Course"]
[null,"HORT","HORT",315,"HORT 315","SUSTAINABLE LANDSCAPES","Undergrad","https://secure.oregonstate.edu/ap/cps/documents/view/108684","Sustainability Course"]
[null,"HORT","HORT",318,"HORT 318","^ECOLOGY OF MANAGED ECOSYSTEMS",{"$f":"IF(D514>499,\"Grad\", \"Undergrad\")","v":"Undergrad"},"https://secure.oregonstate.edu/ap/cps/documents/view/100047","Sustainability Course"]
[null,"HORT","HORT",319,"HORT 319","RESTORATION HORTICULTURE","Undergrad","https://secure.oregonstate.edu/ap/cps/documents/view/107666","Sustainability Course"]
[null,"HORT","HORT",331,"HORT 331","*POLLINATORS IN PERIL","Undergrad","https://secure.oregonstate.edu/ap/cps/documents/view/113380","Sustainability Course"]
[null,"HORT","HORT",349,"HORT 349","DIAGNOSING PLANT PROBLEMS. (3 Credits)","Undergrad","https://secure.oregonstate.edu/ap/cps/documents/view/105866","Sustainability Course"]
[null,"HORT","HORT",350,"HORT 350","URBAN FORESTRY","Undergrad","https://secure.oregonstate.edu/ap/cps/documents/view/94410\nhttps://secure.oregonstate.edu/ap/cps/documents/view/94400","Sustainability Course"]
[null,"HORT","HORT",444,{"$f":"TRIM(C519)&\" \"&TRIM(D519)","v":"HORT 444"},"INSECT AGROECOLOGY","Undergrad","https://secure.oregonstate.edu/ap/cps/documents/view/127482","Sustainability Course"]
[null,"HORT","HORT",447,"HORT 447","ARBORICULTURE","Undergrad","https://catalog.oregonstate.edu/search/?P=HORT%20447","Sustainability Course"]
[null,"HORT","HORT",454,"HORT 454","VITICULTURE PRODUCTION","Undergrad","https://secure.oregonstate.edu/ap/cps/documents/view/9067","Sustainability Course"]
[null,"HORT","HORT",455,"HORT 455","URBAN FOREST PLNNG, POL & MGMT","Undergrad","https://catalog.oregonstate.edu/search/?P=HORT%20455","Sustainability Course"]
[null,"HORT","HORT",481,{"$f":"TRIM(C523)&\" \"&TRIM(D523)","v":"HORT 481"},"HORT PRODUCTION CASE STUDIES","Undergrad","https://secure.oregonstate.edu/ap/cps/documents/view/130275","Sustainability Course"]
[null,"HORT","HORT",544,{"$f":"TRIM(C524)&\" \"&TRIM(D524)","v":"HORT 544"},"INSECT AGROECOLOGY","Grad","https://secure.oregonstate.edu/ap/cps/documents/view/127482","Sustainability Course"]
[null,"HORT","HORT",547,"HORT 547","ARBORICULTURE","Grad","https://catalog.oregonstate.edu/search/?P=HORT%20547","Sustainability Course"]
[null,"HORT","HORT",555,"HORT 555","URBAN FOREST PLNNG, POL & MGMT","Grad","https://catalog.oregonstate.edu/search/?P=HORT%20555","Sustainability Course"]
[null,"HORT","HORT",581,{"$f":"TRIM(C527)&\" \"&TRIM(D527)","v":"HORT 581"},"HORT PRODUCTION CASE STUDIES","Grad","https://secure.oregonstate.edu/ap/cps/documents/view/130275","Sustainability Course"]
[null,"SHPR","HST",105,"HST 105","*WORLD HIST II: MID & EAR MOD","Undergrad","https://secure.oregonstate.edu/ap/cps/documents/view/8690","Sustainability Course"]
[null,"SHPR","HST",352,"HST 352","*AFRICANS IN LATIN AMERICAN HISTORY. (4 Credits)","Undergrad","https://catalog.oregonstate.edu/search/?P=HST%20352","Sustainability Course"]
[null,"SHPR","HST",353,"HST 353","*SLAVERY IN THE AMERICAS. (4 Credits)","Undergrad","https://secure.oregonstate.edu/ap/cps/documents/view/115930","Sustainability Course"]
[null,"SHPR","HST",386,"HST 386","*MODERN IRAN: REVOLUTION AND ITS AFTERMATH. (4 Credits)","Undergrad","https://secure.oregonstate.edu/ap/cps/documents/view/7802","Sustainability Course"]
[null,"SHPR","HST",390,"HST 390","*MIDEAST WOMEN: IN THEIR OWN WORDS. (4 Credits)","Undergrad","https://secure.oregonstate.edu/ap/cps/documents/view/5628","Sustainability Course"]
[null,"SHPR","HST",392,"HST 392","*MODERN CHINA AND JAPAN","Undergrad","https://secure.oregonstate.edu/ap/cps/documents/view/104340","Sustainability Course"]
[null,"SHPR","HST",422,"HST 422","MEDIEVAL SLAVERY. (4 Credits)","Undergrad","https://secure.oregonstate.edu/ap/cps/documents/view/128983","Sustainability Course"]
[null,"SHPR","HST",425,"HST 425","*THE HOLOCAUST IN ITS HISTORY","Undergrad","https://catalog.oregonstate.edu/search/?P=HST%20425","Sustainability Course"]
[null,"SHPR","HST",427,"HST 427","TEACHING THE HOLOCAUST. (4 Credits)","Undergrad","https://catalog.oregonstate.edu/search/?P=HST%20427","Sustainability Course"]
[null,"SHPR","HST",466,"HST 466","RELIGION AND U.S. FOREIGN RELATIONS. (4 Credits)","Undergrad","https://catalog.oregonstate.edu/search/?P=HST%20466","Sustainability Course"]
[null,"SHPR","HST",485,"HST 485","*POLITICS & REL IN MOD MID EAS","Undergrad","https://catalog.oregonstate.edu/search/?P=HST%20485","Sustainability Course"]
[null,"SHPR","HST",522,"HST 522","MEDIEVAL SLAVERY. (4 Credits)","Grad","https://secure.oregonstate.edu/ap/cps/documents/view/128983","Sustainability Course"]
[null,"SHPR","HST",525,"HST 525","THE HOLOCAUST IN ITS HISTORY","Grad","https://catalog.oregonstate.edu/search/?P=HST%20525","Sustainability Course"]
[null,"SHPR","HST",527,"HST 527","TEACHING THE HOLOCAUST. (4 Credits)","Grad","https://catalog.oregonstate.edu/search/?P=HST%20527","Sustainability Course"]
[null,"SHPR","HST",566,"HST 566","RELIGION AND U.S. FOREIGN RELATIONS. (4 Credits)","Grad","https://catalog.oregonstate.edu/search/?P=HST%20566","Sustainability Course"]
[null,"SHPR","HST",585,"HST 585","POLITICS & REL IN MOD MID EAST","Grad","https://catalog.oregonstate.edu/search/?P=HST%20585","Sustainability Course"]
[null,"SHPR","HSTS",437,"HSTS 437","^HISTORY OF ANIMALS IN SCIENCE","Undergrad","https://catalog.oregonstate.edu/search/?P=HSTS%20437","Sustainability Course"]
[null,"SHPR","HSTS",537,"HSTS 537","HISTORY OF ANIMALS IN SCIENCE","Grad","https://catalog.oregonstate.edu/search/?P=HSTS%20537","Sustainability Course"]
[null,"MIME","IE",366,"IE 366","WORK SYSTEMS ENGINEERING","Undergrad","https://secure.oregonstate.edu/ap/cps/documents/view/106728","Sustainability Course"]
[null,"MIME","IE",380,"IE 380","*THE RESPONSIBLE ENGINEER","Undergrad","https://secure.oregonstate.edu/ap/cps/documents/view/101950","Sustainability Course"]
[null,"MIME","IE",497,"IE 497","^MIME CAPSTONE DESIGN","Undergrad","https://secure.oregonstate.edu/ap/cps/documents/view/113391","Sustainability Course"]
[null,"MIME","IE",498,"IE 498","^MIME CAPSTONE DESIGN","Undergrad","https://secure.oregonstate.edu/ap/cps/documents/view/113441","Sustainability Course"]
[null,"SLCS","IT",261,"IT 261","Women in Italian Cinema","Undergrad","https://secure.oregonstate.edu/ap/cps/documents/view/114649","Sustainability Course"]
[null,"BPHS","KIN",435,"KIN 435","PHYSICAL ACTIVITY PROMOTION","Undergrad","https://catalog.oregonstate.edu/search/?P=KIN%20435","Sustainability Course"]
[null,"BPHS","KIN",535,"KIN 535","PHYSICAL ACTIVITY PROMOTION. (3 Credits)","Grad","https://catalog.oregonstate.edu/search/?P=KIN%20535","Sustainability Course"]
[null,"SLCS","LING",545,"LING 545","METHODS AND MATERIALS FOR SECOND LANGUAGE ACQUISITION. (4 Credits)","Grad","https://secure.oregonstate.edu/ap/cps/documents/view/4794","Sustainability Course"]
[null,"MB","MB",225,"MB 225","Allied Health Microbiology","Undergrad","https://secure.oregonstate.edu/ap/cps/documents/view/130150","Sustainability Course"]
[null,"MB","MB",513,"MB 513","MICROBIAL SYSTEMS","Grad","https://secure.oregonstate.edu/ap/cps/documents/view/112110","Sustainability Course"]
[null,"MCB","MCB",530,"MCB 530","INTRO TO POPULATION GENETICS","Grad","https://secure.oregonstate.edu/ap/cps/documents/view/100006","Sustainability Course"]
[null,"MCB","MCB",535,"MCB 535","GENES & CHEM IN AGRICULTURE","Grad","https://catalog.oregonstate.edu/search/?P=MCB%20535","Sustainability Course"]
[null,"MCB","MCB",565,"MCB 565","Mammalian Molecular Genetics","Grad","https://secure.oregonstate.edu/ap/cps/documents/view/7127","Sustainability Course"]
[null,"MIME","ME",443,"ME 443","RENEWABLE ENERGY: THERMAL FLUID SYSTEMS. (4 Credits)","Undergrad","https://catalog.oregonstate.edu/search/?P=ME%20443","Sustainability Course"]
[null,"MIME","ME",497,"ME 497","^MIME CAPSTONE DESIGN","Undergrad","https://secure.oregonstate.edu/ap/cps/documents/view/99911","Sustainability Course"]
[null,"MIME","ME",498,"ME 498","^MIME CAPSTONE DESIGN","Undergrad","https://secure.oregonstate.edu/ap/cps/documents/view/99962","Sustainability Course"]
[null,"MIME","ME",543,"ME 543","RENEWABLE ENERGY: THERMAL FLUID SYSTEMS. (4 Credits)","Grad","https://catalog.oregonstate.edu/search/?P=ME%20543","Sustainability Course"]
[null,"MIME","ME",613,{"$f":"TRIM(C563)&\" \"&TRIM(D563)","v":"ME 613"},"SUSTAINABLE PRODUCT DESIGN","Grad","https://secure.oregonstate.edu/ap/cps/documents/view/131017","Sustainability Course"]
[null,"MIME","MFGE",337,"MFGE 337","MATERIALS & MANUFACT PROCESSES","Undergrad","https://secure.oregonstate.edu/ap/cps/documents/view/125740","Sustainability Course"]
[null,"MIME","MFGE",535,"MFGE 535","INDUST SUSTAINABILITY ANALYSIS","Grad","https://secure.oregonstate.edu/ap/cps/documents/view/111905","Sustainability Course"]
[null,"BA","MGMT",459,"MGMT 459","MANAGING ETHICS AND CORPORATE SOCIAL RESPONSIBILITY. (4 Credits)","Undergrad","https://secure.oregonstate.edu/ap/cps/documents/view/110723","Sustainability Course"]
[null,"BA","MGMT",548,"MGMT 548","EMPLOYEE RECRUITMENT AND SELECTION. (4 Credits)","Grad","https://secure.oregonstate.edu/ap/cps/documents/view/134064","Sustainability Course"]
[null,"FES","MNR",500,"MNR 500","MRKT TOOLS GRNHS GAS EMISSIONS","Grad","https://catalog.oregonstate.edu/search/?P=MNR%20500","Sustainability Course"]
[null,"FES","MNR",511,"MNR 511","INTRO TO SUSTAINABLE NAT RES","Grad","https://secure.oregonstate.edu/ap/cps/documents/view/101558","Sustainability Course"]
[null,"FES","MNR",530,"MNR 530","TROPICAL FOREST ECOLOGY AND MANAGEMENT: A GLOBAL PERSPECTIVE. (3 Credits)","Grad","https://secure.oregonstate.edu/ap/cps/documents/view/121593","Sustainability Course"]
[null,"FES","MNR",538,"MNR 538","ADAPTING FORESTS TO CLIMATE CHANGE. (3 Credits)","Grad","https://secure.oregonstate.edu/ap/cps/documents/view/121935","Sustainability Course"]
[null,"FES","MNR",550,"MNR 550","CLIMATE CHANGE IMPACTS FOREST","Grad","https://secure.oregonstate.edu/ap/cps/documents/view/123923","Sustainability Course"]
[null,"FES","MNR",560,"MNR 560","MASTER'S CASE STUDY","Grad","https://secure.oregonstate.edu/ap/cps/documents/view/102499","Sustainability Course"]
[null,"OC","MRM",525,"MRM 525","ST/MARINE RESOURCE MANAGEMENT","Grad","https://catalog.oregonstate.edu/search/?P=MRM%20525","Sustainability Course"]
[null,"OC","MRM",530,"MRM 530","PRIN & PRACT OF MARINE RES MGT","Grad","https://catalog.oregonstate.edu/search/?P=MRM%20530","Sustainability Course"]
[null,"OC","MRM",534,"MRM 534","OCEANS IN CRISIS. (3 Credits)","Grad","https://secure.oregonstate.edu/ap/cps/documents/view/125656","Sustainability Course"]
[null,"OC","MRM",535,"MRM 535","RIGHTS-BASED FISHERIES MGMT","Grad","https://secure.oregonstate.edu/ap/cps/documents/view/8882","Sustainability Course"]
[null,"OC","MRM",552,"MRM 552","MARINE ECONOMICS. (3 Credits)",{"$f":"IF(D578>499,\"Grad\", \"Undergrad\")","v":"Grad"},"https://secure.oregonstate.edu/ap/cps/documents/view/104743","Sustainability Course"]
[null,"SAC","MUED",100,"MUED 100","MUSIC EDUCATION IN PUBLIC SCHOOLS. (3 Credits)","Undergrad","https://secure.oregonstate.edu/ap/cps/documents/view/131309","Sustainability Course"]
[null,"SNSE","NE",561,"NE 561","Nuclear Reactor Systems Laboratory","Grad","https://secure.oregonstate.edu/ap/cps/documents/view/8889","Sustainability Course"]
[null,"SAC","NMC",441,"NMC 441","MEDIA ENTREPRENEURSHIP","Undergrad","https://secure.oregonstate.edu/ap/cps/documents/view/122481","Sustainability Course"]
[null,"FES","NR",201,"NR 201","MNGING NAT RES FOR THE FUTURE","Undergrad","https://secure.oregonstate.edu/ap/cps/documents/view/7208","Sustainability Course"]
[null,"FES","NR",202,"NR 202","NAT RES PROBLEMS & SOLUTIONS","Undergrad","https://secure.oregonstate.edu/ap/cps/documents/view/122277","Sustainability Course"]
[null,"FES","NR",312,"NR 312","CRIT THINK FOR NAT RES CHALL","Undergrad","https://secure.oregonstate.edu/ap/cps/documents/view/120991","Sustainability Course"]
[null,"FES","NR",325,"NR 325","SCI METHODS FOR NR PROBLEMS","Undergrad","https://secure.oregonstate.edu/ap/cps/documents/view/122941","Sustainability Course"]
[null,"FES","NR",351,"NR 351","*WHEN SCIENCE ESCAPES THE LAB","Undergrad","https://secure.oregonstate.edu/ap/cps/documents/view/123175","Sustainability Course"]
[null,"FES","NR",455,"NR 455","NATURAL RESOURCE DECISION MAK","Undergrad","https://secure.oregonstate.edu/ap/cps/documents/view/101464","Sustainability Course"]
[null,"FES","NR",477,"NR 477","*AGROFORESTRY","Undergrad","https://secure.oregonstate.edu/ap/cps/documents/view/103073","Sustainability Course"]
[null,"FES","NR",577,"NR 577","AGROFORESTRY ","Grad","https://secure.oregonstate.edu/ap/cps/documents/view/129873","Sustainability Course"]
[null,"BPHS","NUR",413,"NUR 413","ADVANCED HEALTH ASSESSMENT. (3 Credits)","Undergrad","https://secure.oregonstate.edu/ap/cps/documents/view/133810","Sustainability Course"]
[null,"BPHS","NUR",416,"NUR 416","POPULATION-FOCUSED AND COMMUNITY-BASED NURSING PRACTICE I. (4 Credits)","Undergrad","https://secure.oregonstate.edu/ap/cps/documents/view/133976","Sustainability Course"]
[null,"BPHS","NUTR",319,"NUTR 319","PROMOTING FOOD AND NUTRITION","Undergrad","https://secure.oregonstate.edu/ap/cps/documents/view/9626","Sustainability Course"]
[null,"BPHS","NUTR",325,"NUTR 325","NUTRITION THROUGH  LIFE CYLE","Undergrad","https://secure.oregonstate.edu/ap/cps/documents/view/4597","Sustainability Course"]
[null,"OC","OC",201,"OC 201","OCEANOGRAPHY","Undergrad","https://secure.oregonstate.edu/ap/cps/documents/view/115374","Sustainability Course"]
[null,"OC","OC",333,"OC 333","OCEANS, COASTS, AND PEOPLE","Undergrad","https://secure.oregonstate.edu/ap/cps/documents/view/116280","Sustainability Course"]
[null,"OC","OC",334,"OC 334","^POLAR OCEANOGRAPHY","Undergrad","https://secure.oregonstate.edu/ap/cps/documents/view/115327","Sustainability Course"]
[null,"OC","OC",434,"OC 434","ESTUARINE ECOLOGY","Undergrad","https://catalog.oregonstate.edu/search/?P=OC%20434","Sustainability Course"]
[null,"OC","OC",474,"OC 474","Early life history of fishes ","Undergrad","https://secure.oregonstate.edu/ap/cps/documents/view/6455","Sustainability Course"]
[null,"OC","OC",522,"OC 522","OCEAN BIOGEOCHEMICAL DYNAMICS","Grad","https://secure.oregonstate.edu/ap/cps/documents/view/114476","Sustainability Course"]
[null,"OC","OC",523,"OC 523","OCEAN ECOLOGICAL DYNAMICS","Grad","https://secure.oregonstate.edu/ap/cps/documents/view/115126","Sustainability Course"]
[null,"OC","OC",534,"OC 534","ESTUARINE ECOLOGY","Grad","https://catalog.oregonstate.edu/search/?P=OC%20534","Sustainability Course"]
[null,"OC","OC",646,"OC 646","PHYSICAL/BIOLOGICAL INTERACTIONS IN THE UPPER OCEAN. (4 Credits)","Grad","https://secure.oregonstate.edu/ap/cps/documents/view/110971","Sustainability Course"]
[null,"OC","OC",657,"OC 657","SEDIMENT BIOGEOCHEMISTRY. (3 Credits)","Grad","https://secure.oregonstate.edu/ap/cps/documents/view/4626","Sustainability Course"]
[null,"OC","OEAS",500,"OEAS 500","CASCADIA FIELD TRIP","Grad","https://secure.oregonstate.edu/ap/cps/documents/view/100419","Sustainability Course"]
[null,"OC","OEAS",520,"OEAS 520","THE SOLID EARTH","Grad","https://secure.oregonstate.edu/ap/cps/documents/view/100385","Sustainability Course"]
[null,"OC","OEAS",530,"OEAS 530","THE FLUID EARTH","Grad","https://secure.oregonstate.edu/ap/cps/documents/view/100383","Sustainability Course"]
[null,"OC","OEAS",540,"OEAS 540","THE BIOGEOCHEMICAL EARTH","Grad","https://secure.oregonstate.edu/ap/cps/documents/view/100417","Sustainability Course"]
[null,"BPHS","PAC",300,"PAC 300","ALI: HIKING LOCAL TRAILS","Undergrad","https://secure.oregonstate.edu/ap/cps/documents/view/121216","Sustainability Course"]
[null,"BPHS","PAC",313,"PAC 313","ALI: CANYONEERING","Undergrad","https://secure.oregonstate.edu/ap/cps/documents/view/121769","Sustainability Course"]
[null,"BPHS","PAC",321,"PAC 321","ALI: MOUNTAINEERING II","Undergrad","https://secure.oregonstate.edu/ap/cps/documents/view/109578","Sustainability Course"]
[null,"BPHS","PAC",326,"PAC 326","ALI: WILDERNESS LIVING TECH","Undergrad","https://secure.oregonstate.edu/ap/cps/documents/view/115565","Sustainability Course"]
[null,"PH","PH",315,{"$f":"TRIM(C612)&\" \"&TRIM(D612)","v":"PH 315"},"CONTEMPORARY CHALLENGES","Undergrad","https://secure.oregonstate.edu/ap/cps/documents/view/125872","Sustainability Course"]
[null,"PHAR","PHAR",565,"PHAR 565","Mammalian Molecular Genetics","Grad","https://secure.oregonstate.edu/ap/cps/documents/view/7127","Sustainability Course"]
[null,"PHAR","PHAR",716,"PHAR 716","HEALTHCARE CHALLENGES","Grad","https://secure.oregonstate.edu/ap/cps/documents/view/101114","Sustainability Course"]
[null,"PHAR","PHAR",717,"PHAR 717","SENIOR CARE PHARMACY","Grad","https://secure.oregonstate.edu/ap/cps/documents/view/9594","Sustainability Course"]
[null,"PHAR","PHAR",738,"PHAR 738","HEALTHCARE SYSTEMS I","Grad","https://secure.oregonstate.edu/ap/cps/documents/view/113194","Sustainability Course"]
[null,"SHPR","PHL",275,{"$f":"TRIM(C617)&\" \"&TRIM(D617)","v":"PHL 275"},"*INTRO TO DISABILITY STUDIES","Undergrad","https://secure.oregonstate.edu/ap/cps/documents/view/126322","Sustainability Course"]
[null,"SHPR","PHL",434,"PHL 434","*SPIRITUALITY AND ECOLOGY: GREEN YOGA. (4 Credits)","Undergrad","https://catalog.oregonstate.edu/search/?P=PHL%20434","Sustainability Course"]
[null,"SHPR","PHL",440,"PHL 440","*ENVIRONMENTAL ETHICS","Undergrad","https://catalog.oregonstate.edu/search/?P=PHL%20440","Sustainability Course"]
[null,"SHPR","PHL",443,"PHL 443","*WORLD VIEWS & ENVIRON VALUES","Undergrad","https://catalog.oregonstate.edu/search/?P=PHL%20443","Sustainability Course"]
[null,"SHPR","PHL",444,"PHL 444","*BIOMEDICAL ETHICS","Undergrad","https://catalog.oregonstate.edu/search/?P=PHL%20444","Sustainability Course"]
[null,"SHPR","PHL",540,"PHL 540","ENVIRONMENTAL ETHICS","Grad","https://catalog.oregonstate.edu/search/?P=PHL%20540","Sustainability Course"]
[null,"SHPR","PHL",543,"PHL 543","WORLD VIEWS & ENVIRON VALUES","Grad","https://catalog.oregonstate.edu/search/?P=PHL%20543","Sustainability Course"]
[null,"SHPR","PHL",574,"PHL 574","PHILOSOPHY OF BIOLOGY","Grad","https://secure.oregonstate.edu/ap/cps/documents/view/110649","Sustainability Course"]
[null,"SPP","PPOL",413,"PPOL 413","ETHICS IN PUBLIC POLICY. (4 Credits)","Undergrad","https://secure.oregonstate.edu/ap/cps/documents/view/130213 ","Sustainability Course"]
[null,"SPP","PPOL",441,"PPOL 441","*ENERGY AND SOCIETY","Undergrad","https://catalog.oregonstate.edu/search/?P=PPOL%20441","Sustainability Course"]
[null,"SPP","PPOL",446,{"$f":"TRIM(C627)&\" \"&TRIM(D627)","v":"PPOL 446"},"POLICY & LAW OF US COASTAL GOV","Undergrad","https://secure.oregonstate.edu/ap/cps/documents/view/126336","Sustainability Course"]
[null,"SPP","PPOL",447,{"$f":"TRIM(C628)&\" \"&TRIM(D628)","v":"PPOL 447"},"FOOD, ENERGY, WATER, CLIMATE","Undergrad","https://secure.oregonstate.edu/ap/cps/documents/view/127831 ","Sustainability Course"]
[null,"SPP","PPOL",522,"PPOL 522","QUANTITATIVE POLICY ANALYSIS","Grad","https://secure.oregonstate.edu/ap/cps/documents/view/122491","Sustainability Course"]
[null,"SPP","PPOL",541,"PPOL 541","ENERGY AND SOCIETY","Grad","https://catalog.oregonstate.edu/search/?P=PPOL%20541","Sustainability Course"]
[null,"SPP","PPOL",544,"PPOL 544","COLLABORATIVE GOVERNANCE. (4 Credits)","Grad","https://secure.oregonstate.edu/ap/cps/documents/view/118213","Sustainability Course"]
[null,"SPP","PPOL",546,"PPOL 546","POLICY & LAW OF US COASTAL GOV","Grad","https://secure.oregonstate.edu/ap/cps/documents/view/117269","Sustainability Course"]
[null,"SPP","PPOL",547,"PPOL 547","FOOD, ENERGY, WATER, CLIMATE","Grad","https://secure.oregonstate.edu/ap/cps/documents/view/118874","Sustainability Course"]
[null,"SPP","PS",322,"PS 322","*CONSTITUTIONAL LAW: CIVIL RIGHTS AND LIBERTIES. (4 Credits)","Undergrad","https://secure.oregonstate.edu/ap/cps/documents/view/122536","Sustainability Course"]
[null,"SPP","PS",341,"PS 341","*EUROPEAN AND EU POLITICS","Undergrad","https://secure.oregonstate.edu/ap/cps/documents/view/119856","Sustainability Course"]
[null,"SPP","PS",343,"PS 343","*RUSSIAN POLITICS","Undergrad","https://secure.oregonstate.edu/ap/cps/documents/view/110372","Sustainability Course"]
[null,"SPP","PS",346,"PS 346","*MIDDLE EAST POLITICS","Undergrad","https://secure.oregonstate.edu/ap/cps/documents/view/122045","Sustainability Course"]
[null,"SPP","PS",356,"PS 356","INTL POLITICS OF ASIA PACIFIC","Undergrad","https://secure.oregonstate.edu/ap/cps/documents/view/119848","Sustainability Course"]
[null,"SPP","PS",374,"PS 374","*SUSTAINABLE LIVING: PRAC &POL","Undergrad","https://secure.oregonstate.edu/ap/cps/documents/view/119018","Sustainability Course"]
[null,"SPP","PS",455,"PS 455","POLITICS OF CLIMATE CHANGE","Undergrad","https://catalog.oregonstate.edu/search/?P=PS%20455","Sustainability Course"]
[null,"SPP","PS",461,"PS 461","ENVIRONMENTAL POLITICAL THEORY. (4 Credits)","Undergrad","https://catalog.oregonstate.edu/search/?P=PS%20461","Sustainability Course"]
[null,"SPP","PS",470,"PS 470","GLOBAL FOOD POLITICS & POLICY",{"$f":"IF(D642>499,\"Grad\", \"Undergrad\")","v":"Undergrad"},"https://catalog.oregonstate.edu/search/?P=PS%20470","Sustainability Course"]
[null,"SPP","PS",471,"PS 471","NUCLEAR POLITICS AND POLICY. (4 Credits)","Undergrad","https://secure.oregonstate.edu/ap/cps/documents/view/123421","Sustainability Course"]
[null,"SPP","PS",473,"PS 473","US ENERGY POLICY","Undergrad","https://catalog.oregonstate.edu/search/?P=PS%20473","Sustainability Course"]
[null,"SPP","PS",477,"PS 477","INTL ENVIRONMENTAL POLITICS","Undergrad","https://catalog.oregonstate.edu/search/?P=PS%20477","Sustainability Course"]
[null,"SPP","PS",555,"PS 555","THE POLITICS OF CLIMATE CHANGE","Grad","https://catalog.oregonstate.edu/search/?P=PS%20555","Sustainability Course"]
[null,"SPP","PS",561,"PS 561","ENVIRONMENTAL POLITICAL THEORY. (4 Credits)","Grad","https://catalog.oregonstate.edu/search/?P=PS%20561","Sustainability Course"]
[null,"SPP","PS",570,"PS 570","GLOBAL FOOD POLITICS & POLICY","Grad","https://catalog.oregonstate.edu/search/?P=PS%20570","Sustainability Course"]
[null,"SPP","PS",573,"PS 573","US ENERGY POLICY","Grad","https://catalog.oregonstate.edu/search/?P=PS%20573","Sustainability Course"]
[null,"SPP","PS",575,"PS 575","ENVIRONMENTAL POLITICS & POLIC","Grad","https://secure.oregonstate.edu/ap/cps/documents/view/121742","Sustainability Course"]
[null,"SPP","PS",576,"PS 576","SCIENCE AND POLITICS","Grad","https://secure.oregonstate.edu/ap/cps/documents/view/124448","Sustainability Course"]
[null,"SPP","PS",577,"PS 577","INTL ENVIRONMENTAL POLITICS","Grad","https://catalog.oregonstate.edu/search/?P=PS%20577","Sustainability Course"]
[null,"SPS","PSY",426,"PSY 426","*PSYCHOLOGY OF GENDER","Undergrad","https://catalog.oregonstate.edu/search/?P=PSY%20426","Sustainability Course"]
[null,"SPS","PSY",465,"PSY 465","WOMEN, WEIGHT, AND BODY IMAGE. (4 Credits)","Undergrad","https://catalog.oregonstate.edu/search/?P=PSY%20465","Sustainability Course"]
[null,"SPS","PSY",466,"PSY 466","*FAT STUDIES","Undergrad","https://secure.oregonstate.edu/ap/cps/documents/view/127739","Sustainability Course"]
[null,"SPS","PSY",492,"PSY 492","CONSERVATION PSYCHOLOGY. (4 Credits)","Undergrad","https://catalog.oregonstate.edu/search/?P=PSY%20492","Sustainability Course"]
[null,"SPS","PSY",498,"PSY 498","HEALTH PSYCHOLOGY","Undergrad","https://catalog.oregonstate.edu/search/?P=PSY%20498","Sustainability Course"]
[null,"SPS","PSY",526,"PSY 526","PSYCHOLOGY OF GENDER. (4 Credits)","Grad","https://catalog.oregonstate.edu/search/?P=PSY%20526","Sustainability Course"]
[null,"SPS","PSY",565,"PSY 565","WOMEN, WEIGHT, AND BODY IMAGE. (4 Credits)","Grad","https://catalog.oregonstate.edu/search/?P=PSY%20565","Sustainability Course"]
[null,"SPS","PSY",566,"PSY 566","FAT STUDIES","Grad","https://catalog.oregonstate.edu/search/?P=PSY%20566","Sustainability Course"]
[null,"SPS","PSY",592,"PSY 592","CONSERVATION PSYCHOLOGY. (4 Credits)","Grad","https://catalog.oregonstate.edu/search/?P=PSY%20592","Sustainability Course"]
[null,"SPS","PSY",598,"PSY 598","HEALTH PSYCHOLOGY. (4 Credits)","Grad","https://catalog.oregonstate.edu/search/?P=PSY%20598","Sustainability Course"]
[null,"SLCS","QS",262,"QS 262","*INTRODUCTION TO QUEER STUDIES","Undergrad","https://secure.oregonstate.edu/ap/cps/documents/view/111058","Sustainability Course"]
[null,"SLCS","QS",321,"QS 321","*QUEER POP CULTURE","Undergrad","https://secure.oregonstate.edu/ap/cps/documents/view/120864","Sustainability Course"]
[null,"SLCS","QS",362,{"$f":"TRIM(C665)&\" \"&TRIM(D665)","v":"QS 362"},"*SERVING LGBTQ+ COMMUNITIES","Undergrad","https://secure.oregonstate.edu/ap/cps/documents/view/130486","Sustainability Course"]
[null,"SLCS","QS",375,"QS 375","*ARTS AND SOCIAL JUSTICE","Undergrad","https://secure.oregonstate.edu/ap/cps/documents/view/119536","Sustainability Course"]
[null,"SLCS","QS",432,"QS 432","*GENDER, SEXUALITY, AND THE PHOTOGRAPHIC IMAGE. (3 Credits)","Undergrad","https://catalog.oregonstate.edu/search/?P=QS%20432","Sustainability Course"]
[null,"SLCS","QS",462,"QS 462","*QUEER THEORIES","Undergrad","https://catalog.oregonstate.edu/search/?P=QS%20462","Sustainability Course"]
[null,"SLCS","QS",473,"QS 473","TRANSGENDER LIVES. (4 Credits)","Undergrad","https://catalog.oregonstate.edu/search/?P=QS%20473","Sustainability Course"]
[null,"SLCS","QS",476,"QS 476","*TRANSNATIONAL SEXUALITIES","Undergrad","https://secure.oregonstate.edu/ap/cps/documents/view/115820","Sustainability Course"]
[null,"SLCS","QS",477,"QS 477","QUEER OF COLOR ARTS/ACTIVISM","Undergrad","https://catalog.oregonstate.edu/search/?P=QS%20477","Sustainability Course"]
[null,"SLCS","QS",532,"QS 532","GENDER, SEXUALITY, AND THE PHOTOGRAPHIC IMAGE. (3 Credits)","Grad","https://catalog.oregonstate.edu/search/?P=QS%20532","Sustainability Course"]
[null,"SLCS","QS",562,"QS 562","QUEER THEORIES","Grad","https://catalog.oregonstate.edu/search/?P=QS%20562","Sustainability Course"]
[null,"SLCS","QS",573,"QS 573","TRANSGENDER LIVES. (4 Credits)","Grad","https://catalog.oregonstate.edu/search/?P=QS%20573","Sustainability Course"]
[null,"SLCS","QS",576,{"$f":"TRIM(C675)&\" \"&TRIM(D675)","v":"QS 576"},"TRANSNATIONAL SEXUALITIES","Grad","https://secure.oregonstate.edu/ap/cps/documents/view/115820","Sustainability Course"]
[null,"SLCS","QS",577,"QS 577","QUEER/TRANS PEOPLE OF COLOR ARTS AND ACTIVISM. (4 Credits)","Grad","https://catalog.oregonstate.edu/search/?P=QS%20577","Sustainability Course"]
[null,"SHPR","REL",352,"REL 352","*AFRICANS IN LATIN AMERICAN HISTORY. (4 Credits)","Undergrad","https://catalog.oregonstate.edu/search/?P=REL%20352","Sustainability Course"]
[null,"SHPR","REL",353,"REL 353","*SLAVERY IN THE AMERICAS. (4 Credits)","Undergrad","https://secure.oregonstate.edu/ap/cps/documents/view/132902","Sustainability Course"]
[null,"SHPR","REL",425,"REL 425","*THE HOLOCAUST IN ITS HISTORY","Undergrad","https://catalog.oregonstate.edu/search/?P=REL%20425","Sustainability Course"]
[null,"SHPR","REL",434,"REL 434","*SPIRITUALITY AND ECOLOGY: GREEN YOGA. (4 Credits)","Undergrad","https://catalog.oregonstate.edu/search/?P=REL%20434","Sustainability Course"]
[null,"SHPR","REL",443,"REL 443","*WORLD VIEWS & ENVIRON VALUES","Undergrad","https://catalog.oregonstate.edu/search/?P=REL%20443","Sustainability Course"]
[null,"SHPR","REL",444,"REL 444","*BIOMEDICAL ETHICS","Undergrad","https://catalog.oregonstate.edu/search/?P=REL%20444","Sustainability Course"]
[null,"SHPR","REL",466,"REL 466","RELIGION AND U.S. FOREIGN RELATIONS. (4 Credits)","Undergrad","https://catalog.oregonstate.edu/search/?P=REL%20466","Sustainability Course"]
[null,"SHPR","REL",485,"REL 485","*POLITICS AND RELIGION IN THE MODERN MIDDLE EAST. (4 Credits)","Undergrad","https://catalog.oregonstate.edu/search/?P=REL%20485","Sustainability Course"]
[null,"SHPR","REL",525,"REL 525","THE HOLOCAUST IN ITS HISTORY","Grad","https://catalog.oregonstate.edu/search/?P=REL%20525","Sustainability Course"]
[null,"SHPR","REL",543,"REL 543","WORLD VIEWS & ENVIRON VALUES","Grad","https://catalog.oregonstate.edu/search/?P=REL%20543","Sustainability Course"]
[null,"SHPR","REL",566,"REL 566","RELIGION AND U.S. FOREIGN RELATIONS. (4 Credits)","Grad","https://catalog.oregonstate.edu/search/?P=REL%20566","Sustainability Course"]
[null,"SHPR","REL",585,"REL 585","POLITICS AND RELIGION IN THE MODERN MIDDLE EAST. (4 Credits)","Grad","https://catalog.oregonstate.edu/search/?P=REL%20585","Sustainability Course"]
[null,"SNSE","RHP",588,"RHP 588","RADIOECOLOGY ","Grad","https://secure.oregonstate.edu/ap/cps/documents/view/121928","Sustainability Course"]
[null,"ANRS","RNG",121,"RNG 121","*INTRO TO WILDLAND ECOLOGY","Undergrad","https://secure.oregonstate.edu/ap/cps/documents/view/121866","Sustainability Course"]
[null,"ANRS","RNG",253,"RNG 253","Wildland Plant Identification ","Undergrad","https://secure.oregonstate.edu/ap/cps/documents/view/8050","Sustainability Course"]
[null,"ANRS","RNG",341,"RNG 341","RANGELAND ECOLOGY & MANAGEMENT","Undergrad","https://secure.oregonstate.edu/ap/cps/documents/view/9994","Sustainability Course"]
[null,"ANRS","RNG",351,"RNG 351","RANGE ECOLOGY I-GRASSLANDS","Undergrad","https://secure.oregonstate.edu/ap/cps/documents/view/7732","Sustainability Course"]
[null,"ANRS","RNG",353,"RNG 353","WILDLAND PLANT IDENTIFICATION","Undergrad","https://secure.oregonstate.edu/ap/cps/documents/view/10116","Sustainability Course"]
[null,"ANRS","RNG",355,{"$f":"TRIM(C695)&\" \"&TRIM(D695)","v":"RNG 355"},"DESERT WATERSHED MANAGEMENT","Undergrad","https://secure.oregonstate.edu/ap/cps/documents/view/128355","Sustainability Course"]
[null,"ANRS","RNG",430,"RNG 430","APPLIED GIS IN RANGELAND SCIENCE. (4 Credits)","Undergrad","https://secure.oregonstate.edu/ap/cps/documents/view/124899","Sustainability Course"]
[null,"ANRS","RNG",436,"RNG 436","WILDLAND FIRE AND FUELS MANAGEMENT","Undergrad","https://secure.oregonstate.edu/ap/cps/documents/view/6589","Sustainability Course"]
[null,"ANRS","RNG",442,"RNG 442","RANGELAND-ANIMAL RELATIONS","Undergrad","https://secure.oregonstate.edu/ap/cps/documents/view/116432","Sustainability Course"]
[null,"ANRS","RNG",446,"RNG 446","Wildland Fire Ecology","Undergrad","https://secure.oregonstate.edu/ap/cps/documents/view/6573","Sustainability Course"]
[null,"ANRS","RNG",470,"RNG 470","PASTORAL SYSTEMS OF THE WORLD","Undergrad","https://secure.oregonstate.edu/ap/cps/documents/view/116570","Sustainability Course"]
[null,"ANRS","RNG",536,"RNG 536","WILDLAND FIRE AND FUELS MANAGEMENT","Grad","https://secure.oregonstate.edu/ap/cps/documents/view/6589","Sustainability Course"]
[null,"ANRS","RNG",546,"RNG 546","Wildland Fire Ecology","Grad","https://secure.oregonstate.edu/ap/cps/documents/view/6573","Sustainability Course"]
[null,"ANRS","RNG",643,"RNG 643","WILDLAND PLANT ECOPHYSIOLOGY. (4 Credits)","Grad","https://secure.oregonstate.edu/ap/cps/documents/view/3325","Sustainability Course"]
[null,"ANRS","RNG",662,"RNG 662","RANGELAND ECOLOGY","Grad","https://secure.oregonstate.edu/ap/cps/documents/view/104233","Sustainability Course"]
[null,"ANRS","RNG",670,"RNG 670","ECOLOGICAL INVASIVE PLANT MANAGEMENT. (2 Credits)","Grad","https://secure.oregonstate.edu/ap/cps/documents/view/4708","Sustainability Course"]
[null,"APEC","RS",421,"RS 421","RURAL POVERTY AND SAFETY NET",{"$f":"IF(D706>499,\"Grad\", \"Undergrad\")","v":"Undergrad"},"https://catalog.oregonstate.edu/search/?P=RS%20421","Sustainability Course"]
[null,"APEC","RS",513,"RS 513","CONTEMPORARY RURAL ISSUES. (2 Credits)","Grad","https://secure.oregonstate.edu/ap/cps/proposals/view/87745","Sustainability Course"]
[null,"APEC","RS",521,"RS 521","RURAL POVERTY AND SAFETY NET","Grad","https://catalog.oregonstate.edu/search/?P=RS%20521","Sustainability Course"]
[null,"SED","SED",525,"SED 525","Science/Mathematics Curriculum Implementation & Instructional Strategies for High School ","Grad","https://secure.oregonstate.edu/ap/cps/documents/view/5004","Sustainability Course"]
[null,"SED","SED",541,"SED 541","WEATHER CONCEPTS FOR SCIENCE AND MATH TEACHING. (3 Credits)","Grad","https://secure.oregonstate.edu/ap/cps/documents/view/110756","Sustainability Course"]
[null,"SED","SED",550,"SED 550","HIGH QUALITY SCI & MATH INST","Grad","https://secure.oregonstate.edu/ap/cps/documents/view/123929","Sustainability Course"]
[null,"SED","SED",582,"SED 582","PERSONAL DIMENSION OF LEARNING","Grad","https://secure.oregonstate.edu/ap/cps/documents/view/6183","Sustainability Course"]
[null,"SED","SED",592,"SED 592","PROFESSIONAL DEVELOPMENT AND PRACTICUM IN SCIENCE. (3 Credits)","Grad","https://secure.oregonstate.edu/ap/cps/documents/view/7513","Sustainability Course"]
[null,"FES","SNR",506,"SNR 506","IND PROJ IN NAT RESOUR SUSTAIN","Grad","https://secure.oregonstate.edu/ap/cps/documents/view/8627","Sustainability Course"]
[null,"FES","SNR",511,"SNR 511","SUS NAT RESOURCE DEVELOPMENT","Grad","https://secure.oregonstate.edu/ap/cps/documents/view/9126","Sustainability Course"]
[null,"FES","SNR",520,"SNR 520","SOCIALLY SUSTAINABLE NAT RES","Grad","https://secure.oregonstate.edu/ap/cps/documents/view/9154","Sustainability Course"]
[null,"FES","SNR",521,"SNR 521","ECON OF SUS NAT RESOURCE MGMT","Grad","https://secure.oregonstate.edu/ap/cps/documents/view/9156","Sustainability Course"]
[null,"FES","SNR",522,"SNR 522","BASIC BELIEFS & ETH IN NAT RES","Grad","https://secure.oregonstate.edu/ap/cps/documents/view/8647","Sustainability Course"]
[null,"FES","SNR",531,"SNR 531","SUSTAINABLE SILVICULTURE AND FOREST CERTIFICATION. (3 Credits)","Grad","https://secure.oregonstate.edu/ap/cps/documents/view/9160","Sustainability Course"]
[null,"FES","SNR",532,"SNR 532","PLANNING AGROFORESTRY PROJECTS","Grad","https://secure.oregonstate.edu/ap/cps/documents/view/5579","Sustainability Course"]
[null,"FES","SNR",533,"SNR 533","NONTIMBER FOREST PRODUCTS","Grad","https://secure.oregonstate.edu/ap/cps/documents/view/9163","Sustainability Course"]
[null,"FES","SNR",534,"SNR 534","REDUCED IMPACT TIMBER HARVEST. (2 Credits)","Grad","https://secure.oregonstate.edu/ap/cps/documents/view/9165","Sustainability Course"]
[null,"FES","SNR",535,"SNR 535","SUS MGMT OF AQUATIC & RIP RES","Grad","https://secure.oregonstate.edu/ap/cps/documents/view/9318","Sustainability Course"]
[null,"FES","SNR",540,"SNR 540","GLOBAL ENVIRONMENTAL CHANGE","Grad","https://secure.oregonstate.edu/ap/cps/documents/view/10493","Sustainability Course"]
[null,"SPP","SOC",381,"SOC 381","SOC DIMENSIONS SUSTAINABILITY","Undergrad","https://secure.oregonstate.edu/ap/cps/documents/view/117850","Sustainability Course"]
[null,"SPP","SOC",460,"SOC 460","THE SOCIOLOGY OF GLOBALIZATION. (4 Credits)","Undergrad","https://catalog.oregonstate.edu/search/?P=SOC%20460","Sustainability Course"]
[null,"SPP","SOC",470,"SOC 470","COLLECTIVE BEHAVIOR","Undergrad","https://catalog.oregonstate.edu/search/?P=SOC%20470","Sustainability Course"]
[null,"SPP","SOC",485,"SOC 485","*CONSENSUS & NATURAL RESOURCES","Undergrad","https://catalog.oregonstate.edu/search/?P=SOC%20485","Sustainability Course"]
[null,"SPP","SOC",560,"SOC 560","THE SOCIOLOGY OF GLOBALIZATION. (4 Credits)","Grad","https://catalog.oregonstate.edu/search/?P=SOC%20560","Sustainability Course"]
[null,"SPP","SOC",570,"SOC 570","COLLECTIVE BEHAVIOR","Grad","https://catalog.oregonstate.edu/search/?P=SOC%20570","Sustainability Course"]
[null,"CSS","SOIL",102,"SOIL 102","Introduction to Environmental Science and Sustainability","Undergrad","https://secure.oregonstate.edu/ap/cps/documents/view/116629","Sustainability Course"]
[null,"CSS","SOIL",205,"SOIL 205","SOIL SCIENCE","Undergrad","https://secure.oregonstate.edu/ap/cps/documents/view/116384","Sustainability Course"]
[null,"CSS","SOIL",206,"SOIL 206","*SOIL SCIENCE LAB FOR SOIL 205","Undergrad","https://secure.oregonstate.edu/ap/cps/documents/view/115684","Sustainability Course"]
[null,"CSS","SOIL",316,"SOIL 316","NUTRIENT CYCLING IN AGROECOSYS","Undergrad","https://secure.oregonstate.edu/ap/cps/documents/view/113456","Sustainability Course"]
[null,"CSS","SOIL",366,"SOIL 366","ECOSYSTEMS OF WILDLAND SOILS","Undergrad","https://secure.oregonstate.edu/ap/cps/documents/view/107931","Sustainability Course"]
[null,"CSS","SOIL",388,"SOIL 388","SOIL SYSTEMS AND PLANT GROWTH","Undergrad","https://secure.oregonstate.edu/ap/cps/documents/view/122195","Sustainability Course"]
[null,"CSS","SOIL",475,"SOIL 475","SOIL RESOURCE POTENTIALS. (4 Credits)","Undergrad","https://secure.oregonstate.edu/ap/cps/documents/view/108575","Sustainability Course"]
[null,"CSS","SOIL",511,"SOIL 511","SOIL AND SOCIETY","Grad","https://secure.oregonstate.edu/ap/cps/documents/view/121270","Sustainability Course"]
[null,"CSS","SOIL",547,"SOIL 547","NUTRIENT CYCLING. (3 Credits)","Grad","https://secure.oregonstate.edu/ap/cps/documents/view/111010","Sustainability Course"]
[null,"CSS","SOIL",635,"SOIL 635","ADVANCED SOIL PHYSICS. (3 Credits)","Grad","https://secure.oregonstate.edu/ap/cps/documents/view/106761","Sustainability Course"]
[null,"SLCS","SPAN",117,"SPAN 117","FIRST-YEAR SPANISH-COMPLETE SEQUENCE. (12 Credits)","Undergrad","https://secure.oregonstate.edu/ap/cps/documents/view/110170","Sustainability Course"]
[null,"SLCS","SPAN",217,"SPAN 217","SECOND-YEAR SPANISH-COMPLETE","Undergrad","https://secure.oregonstate.edu/ap/cps/documents/view/110658","Sustainability Course"]
[null,"SLCS","SPAN",222,"SPAN 222","SPANISH FOR MEDICAL PROFESSIONS II. (4 Credits)","Undergrad","https://secure.oregonstate.edu/ap/cps/documents/view/125150","Sustainability Course"]
[null,"SLCS","SPAN",237,"SPAN 237","*U.S. LATINO/A IDENTITIES AND CULTURES. (3 Credits)","Undergrad","https://secure.oregonstate.edu/ap/cps/documents/view/105579","Sustainability Course"]
[null,"SLCS","SPAN",313,"SPAN 313","SPANISH LANG THROUGH CULTURE","Undergrad","https://secure.oregonstate.edu/ap/cps/documents/view/100513","Sustainability Course"]
[null,"SLCS","SPAN",365,"SPAN 365","MIGRANT NARRATIVES: SPANISH. (2 Credits)","Undergrad","https://secure.oregonstate.edu/ap/cps/documents/view/121712","Sustainability Course"]
[null,"SLCS","SPAN",455,"SPAN 455","INTRODUCTION TO SPANISH TRANSLATION. (3 Credits)","Undergrad","https://catalog.oregonstate.edu/search/?P=SPAN%20455","Sustainability Course"]
[null,"SLCS","SPAN",456,"SPAN 456","SPANISH IN THE UNITED STATES","Undergrad","https://catalog.oregonstate.edu/search/?P=SPAN%20456","Sustainability Course"]
[null,"SLCS","SPAN",470,"SPAN 470","*ADVANCED SPANISH COORDINATED STUDIES. (1-30 Credits)","Undergrad","https://secure.oregonstate.edu/ap/cps/documents/view/123846","Sustainability Course"]
[null,"SLCS","SPAN",555,"SPAN 555","INTRODUCTION TO SPANISH TRANSLATION. (3 Credits)","Grad","https://catalog.oregonstate.edu/search/?P=SPAN%20555","Sustainability Course"]
[null,"SLCS","SPAN",556,"SPAN 556","SPANISH IN THE UNITED STATES. (3 Credits)","Grad","https://catalog.oregonstate.edu/search/?P=SPAN%20556","Sustainability Course"]
[null,"CSS","SUS",103,"SUS 103","*INTRO TO CLIMATE CHANGE","Undergrad","https://secure.oregonstate.edu/ap/cps/documents/view/121733","Sustainability Course"]
[null,"CSS","SUS",304,"SUS 304","SUSTAINABILITY ASSESSMENT","Undergrad","https://secure.oregonstate.edu/ap/cps/documents/view/108845","Sustainability Course"]
[null,"CSS","SUS",325,"SUS 325","^AG AND ENVIRONMENTAL PREDICAMENTS: A CASE STUDY APPROACH. (3 Credits)","Undergrad","https://secure.oregonstate.edu/ap/cps/documents/view/130506","Sustainability Course"]
[null,"CSS","SUS",420,"SUS 420","SOCIAL DIMEN OF SUSTAINABILITY","Undergrad","https://secure.oregonstate.edu/ap/cps/documents/view/116241","Sustainability Course"]
[null,"CSS","SUS",512,"SUS 512","TOPICS IN THE SCIENCE OF SUSTAINABILITY. (4 Credits)","Grad","https://secure.oregonstate.edu/ap/cps/documents/view/128037 ","Sustainability Course"]
[null,"CSS","SUS",514,{"$f":"TRIM(C757)&\" \"&TRIM(D757)","v":"SUS 514"},"SUSTAINABILITY ASSESSMENT","Grad","https://secure.oregonstate.edu/ap/cps/documents/view/128382","Sustainability Course"]
[null,"SAC","TA",415,"TA 415","INTRODUCTION TO ARTS ENTREPRENEURSHIP","Undergrad","https://secure.oregonstate.edu/ap/cps/documents/view/119611","Sustainability Course"]
[null,"TCE","TCE",219,"TCE 219","Civil Rights & Multicultural Issues in Educational Settings ","Undergrad","https://secure.oregonstate.edu/ap/cps/documents/view/9001","Sustainability Course"]
[null,"TCE","TCE",340,"TCE 340","Supportive Differentiated Environments ","Undergrad","https://secure.oregonstate.edu/ap/cps/documents/view/9172","Sustainability Course"]
[null,"TCE","TCE",456,"TCE 456","Strategies for Teaching Language Arts and Social Studies","Undergrad","https://secure.oregonstate.edu/ap/cps/documents/view/118238","Sustainability Course"]
[null,"TCE","TCE",457,"TCE 457","Teaching Elementary Mathematics for Understanding","Undergrad","https://secure.oregonstate.edu/ap/cps/documents/view/108856","Sustainability Course"]
[null,"TCE","TCE",545,"TCE 545","Planning Curriculum Aligned to Standards ","Grad","https://secure.oregonstate.edu/ap/cps/documents/view/4434","Sustainability Course"]
[null,"FES","TOL",370,"TOL 370","TOL 370. DESIGN AND MANAGEMENT OF OUTDOOR EXPERIENCES","Undergrad","https://secure.oregonstate.edu/ap/cps/documents/view/123582","Sustainability Course"]
[null,"EMT","TOX",435,"TOX 435","*GENES & CHEM VALUE & RISK","Undergrad","https://catalog.oregonstate.edu/search/?P=TOX%20435","Sustainability Course"]
[null,"EMT","TOX",535,"TOX 535","GENES & CHEM VALUE & RISK","Grad","https://catalog.oregonstate.edu/search/?P=TOX%20535","Sustainability Course"]
[null,"FES","TRAL",353,"TRAL 353","NATURE, ECO, AND ADVENTURE TOURISM. (3 Credits)","Undergrad","https://secure.oregonstate.edu/ap/cps/documents/view/121149","Sustainability Course"]
[null,"FES","TRAL",354,{"$f":"TRIM(C768)&\" \"&TRIM(D768)","v":"TRAL 354"},"COMM, NAT AREAS, & SUST TOUR","Undergrad","https://secure.oregonstate.edu/ap/cps/documents/view/121058","Sustainability Course"]
[null,"FES","TRAL",357,"TRAL 357","PARKS AND PROTECTED AREAS MANAGEMENT. (3 Credits)","Undergrad","https://secure.oregonstate.edu/ap/cps/documents/view/121787 ","Sustainability Course"]
[null,"FES","TRAL",456,{"$f":"TRIM(C770)&\" \"&TRIM(D770)","v":"TRAL 456"},"PLANNING FOR SUSTAIN RECREAT",{"$f":"IF(D770>499,\"Grad\", \"Undergrad\")","v":"Undergrad"},"https://secure.oregonstate.edu/ap/cps/documents/view/121756","Sustainability Course"]
[null,"BMS","VMB",660,"VMB 660","VETERINARY PARASITOLOGY","Grad","https://secure.oregonstate.edu/ap/cps/documents/view/10214","Sustainability Course"]
[null,"BMS","VMB",766,"VMB 766","EPIDEMIOLOGY AND PUBLIC HEALTH","Grad","https://secure.oregonstate.edu/ap/cps/documents/view/115192","Sustainability Course"]
[null,"SLCS","WGSS",235,"WGSS 235","*WOMEN IN WORLD CINEMA","Undergrad","https://secure.oregonstate.edu/ap/cps/documents/view/110138","Sustainability Course"]
[null,"SLCS","WGSS",262,"WGSS 262","*INTRODUCTION TO QUEER STUDIES","Undergrad","https://secure.oregonstate.edu/ap/cps/documents/view/111538","Sustainability Course"]
[null,"SLCS","WGSS",280,"WGSS 280","*WOMEN WORLDWIDE","Undergrad","https://secure.oregonstate.edu/ap/cps/documents/view/112054","Sustainability Course"]
[null,"SLCS","WGSS",321,"WGSS 321","*QUEER POP CULTURE","Undergrad","https://secure.oregonstate.edu/ap/cps/documents/view/121757","Sustainability Course"]
[null,"SLCS","WGSS",362,{"$f":"TRIM(C777)&\" \"&TRIM(D777)","v":"WGSS 362"},"*SERVING LGBTQ+ COMMUNITIES","Undergrad","https://secure.oregonstate.edu/ap/cps/documents/view/130529","Sustainability Course"]
[null,"SLCS","WGSS",373,"WGSS 373","APPROACHES TO SOCIAL JUSTICE","Undergrad","https://secure.oregonstate.edu/ap/cps/documents/view/113418","Sustainability Course"]
[null,"SLCS","WGSS",375,"WGSS 375","*ARTS AND SOCIAL JUSTICE","Undergrad","https://secure.oregonstate.edu/ap/cps/documents/view/119536","Sustainability Course"]
[null,"SLCS","WGSS",416,"WGSS 416","THEORIES OF FEMINISM","Undergrad","https://secure.oregonstate.edu/ap/cps/documents/view/114371","Sustainability Course"]
[null,"SLCS","WGSS",430,"WGSS 430","WOMEN OF COLOR FEMINISMS","Undergrad","https://catalog.oregonstate.edu/search/?P=WGSS%20430","Sustainability Course"]
[null,"SLCS","WGSS",432,"WGSS 432","*GENDER, SEXUALITY, AND THE PHOTOGRAPHIC IMAGE. (3 Credits)","Undergrad","https://catalog.oregonstate.edu/search/?P=WGSS%20432","Sustainability Course"]
[null,"SLCS","WGSS",462,"WGSS 462","*QUEER THEORIES","Undergrad","https://catalog.oregonstate.edu/search/?P=WGSS%20462","Sustainability Course"]
[null,"SLCS","WGSS",463,"WGSS 463","*GLOBAL SEX WORK AND TRAFFICKING. (3 Credits)","Undergrad","https://secure.oregonstate.edu/ap/cps/documents/view/109826","Sustainability Course"]
[null,"SLCS","WGSS",466,{"$f":"TRIM(C785)&\" \"&TRIM(D785)","v":"WGSS 466"},"*FAT STUDIES","Undergrad","https://secure.oregonstate.edu/ap/cps/documents/view/127739","Sustainability Course"]
[null,"SLCS","WGSS",476,{"$f":"TRIM(C786)&\" \"&TRIM(D786)","v":"WGSS 476"},"*TRANSNATIONAL SEXUALITIES","Undergrad","https://secure.oregonstate.edu/ap/cps/documents/view/115820","Sustainability Course"]
[null,"SLCS","WGSS",477,"WGSS 477","QUEER OF COLOR ARTS/ACTIVISM","Undergrad","https://catalog.oregonstate.edu/search/?P=WGSS%20477","Sustainability Course"]
[null,"SLCS","WGSS",482,"WGSS 482","GLOBAL PERSPECTIVES ON WOMEN'S HEALTH. (4 Credits)","Undergrad","https://catalog.oregonstate.edu/search/?P=WGSS%20482","Sustainability Course"]
[null,"SLCS","WGSS",483,"WGSS 483","RACE, GENDER, & HEALTH JUSTICE","Undergrad","https://catalog.oregonstate.edu/search/?P=WGSS%20483","Sustainability Course"]
[null,"SLCS","WGSS",485,"WGSS 485","CAPSTONE IN SOCIAL JUSTICE","Undergrad","https://secure.oregonstate.edu/ap/cps/documents/view/113421","Sustainability Course"]
[null,"SLCS","WGSS",495,"WGSS 495","*GLOBAL FEMINIST THEOLOGIES. (4 Credits)","Undergrad","https://catalog.oregonstate.edu/search/?P=WGSS%20495","Sustainability Course"]
[null,"SLCS","WGSS",496,"WGSS 496","*FEMINIST THEOLOGIES IN THE UNITED STATES. (4 Credits)","Undergrad","https://catalog.oregonstate.edu/search/?P=WGSS%20496","Sustainability Course"]
[null,"SLCS","WGSS",498,"WGSS 498","FEMINIST PRACTICE","Undergrad","https://secure.oregonstate.edu/ap/cps/documents/view/114407","Sustainability Course"]
[null,"SLCS","WGSS",516,"WGSS 516","THEORIES OF FEMINISM","Grad","https://secure.oregonstate.edu/ap/cps/documents/view/114173","Sustainability Course"]
[null,"SLCS","WGSS",521,"WGSS 521","FEMINIST LEADERSHIP","Grad","https://secure.oregonstate.edu/ap/cps/documents/view/114392","Sustainability Course"]
[null,"SLCS","WGSS",530,"WGSS 530","WOMEN OF COLOR FEMINISMS. (4 Credits)","Grad","https://catalog.oregonstate.edu/search/?P=WGSS%20530","Sustainability Course"]
[null,"SLCS","WGSS",532,"WGSS 532","GENDER, SEXUALITY, AND THE PHOTOGRAPHIC IMAGE. (3 Credits)","Grad","https://catalog.oregonstate.edu/search/?P=WGSS%20532","Sustainability Course"]
[null,"SLCS","WGSS",562,"WGSS 562","QUEER THEORIES","Grad","https://catalog.oregonstate.edu/search/?P=WGSS%20562","Sustainability Course"]
[null,"SLCS","WGSS",566,{"$f":"TRIM(C799)&\" \"&TRIM(D799)","v":"WGSS 566"},"FAT STUDIES","Grad","https://secure.oregonstate.edu/ap/cps/documents/view/127739","Sustainability Course"]
[null,"SLCS","WGSS",575,"WGSS 575","CRITICAL RACE FEMINISM","Grad","https://secure.oregonstate.edu/ap/cps/documents/view/123912","Sustainability Course"]
[null,"SLCS","WGSS",576,"WGSS 576","TRANSNATIONAL SEXUALITIES","Grad","https://secure.oregonstate.edu/ap/cps/documents/view/115820","Sustainability Course"]
[null,"SLCS","WGSS",577,"WGSS 577","QUEER/TRANS PEOPLE OF COLOR ARTS AND ACTIVISM. (4 Credits)","Grad","https://catalog.oregonstate.edu/search/?P=WGSS%20577","Sustainability Course"]
[null,"SLCS","WGSS",582,"WGSS 582","GLOBAL PERSPECTIVES ON WOMEN'S HEALTH. (4 Credits)","Grad","https://catalog.oregonstate.edu/search/?P=WGSS%20582","Sustainability Course"]
[null,"SLCS","WGSS",583,"WGSS 583","RACE, GENDER, & HEALTH JUSTICE","Grad","https://catalog.oregonstate.edu/search/?P=WGSS%20583","Sustainability Course"]
[null,"SLCS","WGSS",585,"WGSS 585","TRANSNATIONAL FEMINISMS","Grad","https://secure.oregonstate.edu/ap/cps/documents/view/114385","Sustainability Course"]
[null,"SLCS","WGSS",595,"WGSS 595","GLOBAL FEMINIST THEOLOGIES. (4 Credits)","Grad","https://catalog.oregonstate.edu/search/?P=WGSS%20595","Sustainability Course"]
[null,"SLCS","WGSS",596,"WGSS 596","FEMINIST THEOLOGIES IN THE UNITED STATES. (4 Credits)","Grad","https://catalog.oregonstate.edu/search/?P=WGSS%20596","Sustainability Course"]
[null,"SLCS","WGSS",610,"WGSS 610","INTERNSHIP. (1-6 Credits)","Grad","https://secure.oregonstate.edu/ap/cps/documents/view/114077","Sustainability Course"]
[null,"SLCS","WGSS",616,"WGSS 616","FEMINISMS","Grad","https://secure.oregonstate.edu/ap/cps/documents/view/115712","Sustainability Course"]
[null,"SLCS","WGSS",619,"WGSS 619","DECOLONIZING METHODS","Grad","https://secure.oregonstate.edu/ap/cps/documents/view/124270","Sustainability Course"]
[null,"SLCS","WLC",231,{"$f":"TRIM(C811)&\" \"&TRIM(D811)","v":"WLC 231"},"*GERMAN DICTATORSHIPS","Undergrad","https://secure.oregonstate.edu/ap/cps/documents/view/109170","Sustainability Course"]
[null,"SLCS","WLC",338,"WLC 338","Deaf Culture","Undergrad","https://secure.oregonstate.edu/ap/cps/documents/view/133844","Sustainability Course"]
[null,"SLCS","WLC",373,"WLC 373","APPROACHES TO SOCIAL JUSTICE","Undergrad","https://secure.oregonstate.edu/ap/cps/documents/view/113420","Sustainability Course"]
[null,"SLCS","WLC",375,"WLC 375","WLC 375 LITERATURES OF POWER AND RESISTANCE (2) ","Undergrad","https://secure.oregonstate.edu/ap/cps/documents/view/121717","Sustainability Course"]
[null,"SLCS","WLC",376,"WLC 376","WLC 376 EMPIRES AND GLOBALIZATION (2)","Undergrad","https://secure.oregonstate.edu/ap/cps/documents/view/123830","Sustainability Course"]
[null,"SLCS","WLC",485,"WLC 485","CAPSTONE IN SOCIAL JUSTICE","Undergrad","https://secure.oregonstate.edu/ap/cps/documents/view/113423","Sustainability Course"]
[null,"SWLF","WR",462,"WR 462","^ENVIRONMENTAL WRITING","Undergrad","https://catalog.oregonstate.edu/search/?P=WR%20462","Sustainability Course"]
[null,"SWLF","WR",532,"WR 532","Community Organizing & Collective Action ","Grad","https://secure.oregonstate.edu/ap/cps/documents/view/103543","Sustainability Course"]
[null,"SWLF","WR",562,"WR 562","ENVIRONMENTAL WRITING","Grad","https://catalog.oregonstate.edu/search/?P=WR%20562","Sustainability Course"]
[null,"GRD","WRP",521,"WRP 521","WATER CONFLICT MGMT & TRANSFOR","Grad","https://secure.oregonstate.edu/ap/cps/documents/view/112397","Sustainability Course"]
[null,"GRD","WRP",523,"WRP 523","ENVIRONMNTL WATER TRANSACTIONS","Grad","\nhttps://secure.oregonstate.edu/ap/cps/documents/view/111682","Sustainability Course"]
[null,"GRD","WRP",524,"WRP 524","SOCIOTECH ASPECTS OF WATER","Grad","https://secure.oregonstate.edu/ap/cps/documents/view/5754","Sustainability Course"]
[null,"GRD","WRP",544,"WRP 544","MANAGING NATURAL RESOURCES FOR CLIMATE ADAPTATION. (3 Credits)","Grad","https://secure.oregonstate.edu/ap/cps/documents/view/133957","Sustainability Course"]
[null,"GRD","WRP",548,"WRP 548","CONDUCTING COLLABORATIVE PROJECTS. (3 Credits)","Grad","https://secure.oregonstate.edu/ap/cps/documents/view/123722","Sustainability Course"]
[null,"GRD","WRS",532,"WRS 532","APPLIED FIELD PROBLEMS. (3 Credits)","Grad","https://secure.oregonstate.edu/ap/cps/documents/view/123704","Sustainability Course"]
[null,"GRD","WRS",536,"WRS 536","FUNDAMENTALS OF HYDROLOGY","Grad","https://secure.oregonstate.edu/ap/cps/documents/view/123707","Sustainability Course"]
[null,"WSE","WSE",111,"WSE 111","RENEWABLE M FOR A GREEN PLANET","Undergrad","https://secure.oregonstate.edu/ap/cps/documents/view/106567","Sustainability Course"]
[null,"WSE","WSE",225,{"$f":"TRIM(C828)&\" \"&TRIM(D828)","v":"WSE 225"},"PRINC OF ARCHITECTURAL DESIGN","Undergrad","https://secure.oregonstate.edu/ap/cps/documents/view/129079 ","Sustainability Course"]
[null,"WSE","WSE",266,"WSE 266","*INDUSTRIAL HEMP","Undergrad","https://secure.oregonstate.edu/ap/cps/documents/view/108327","Sustainability Course"]
[null,"WSE","WSE",324,"WSE 324","RENEWABLE MATERIALS LABORATORY","Undergrad","https://secure.oregonstate.edu/ap/cps/documents/view/100873","Sustainability Course"]
[null,"WSE","WSE",385,"WSE 385","*EVALUATING SUSTAINABILITY THROUGH LIFE CYCLE ANALYSIS. (3 Credits)","Undergrad","https://secure.oregonstate.edu/ap/cps/documents/view/130246","Sustainability Course"]
[null,"WSE","WSE",392,"WSE 392","*BAMBOOLOOZA: WORLD OF BAMBOO","Undergrad","https://secure.oregonstate.edu/ap/cps/documents/view/116038","Sustainability Course"]
[null,"WSE","WSE",415,"WSE 415","WSE 415H - *RENEWABLE MATERIALS IN THE MODERN AGE ","Undergrad","https://catalog.oregonstate.edu/search/?P=WSE%20415","Sustainability Course"]
[null,"WSE","WSE",453,"WSE 453","^FOREST PRODUCTS BUSINESS",{"$f":"IF(D834>499,\"Grad\", \"Undergrad\")","v":"Undergrad"},"https://catalog.oregonstate.edu/search/?P=WSE%20453","Sustainability Course"]
[null,"WSE","WSE",455,"WSE 455","INDUSTRIAL MKTNG FOREST SECTOR","Undergrad","https://catalog.oregonstate.edu/search/?P=WSE%20455","Sustainability Course"]
[null,"WSE","WSE",461,"WSE 461","BIO-BASED PRODUCTS MNFNG","Undergrad","https://catalog.oregonstate.edu/search/?P=WSE%20461","Sustainability Course"]
[null,"WSE","WSE",462,"WSE 462","ADVANCED MANUFACTURING 1","Undergrad","https://catalog.oregonstate.edu/search/?P=WSE%20462","Sustainability Course"]
[null,"WSE","WSE",473,"WSE 473","BIOENERGY & ENVIRONMENT IMPACT","Undergrad","https://catalog.oregonstate.edu/search/?P=WSE%20473","Sustainability Course"]
[null,"WSE","WSE",475,"WSE 475","ENVIRO ASSESS BUILD MATERIALS","Undergrad","https://catalog.oregonstate.edu/search/?P=WSE%20475","Sustainability Course"]
[null,"WSE","WSE",515,"WSE 515","WSE 515 RENEWABLE MATERIALS IN THE MODERN AGE (3)","Grad","https://catalog.oregonstate.edu/search/?P=WSE%20515","Sustainability Course"]
[null,"WSE","WSE",520,"WSE 520","GLOBAL CONTEXT FOREST SECTOR","Grad","https://secure.oregonstate.edu/ap/cps/documents/view/110160","Sustainability Course"]
[null,"WSE","WSE",553,"WSE 553","FOREST PRODUCTS BUSINESS","Grad","https://catalog.oregonstate.edu/search/?P=WSE%20553","Sustainability Course"]
[null,"WSE","WSE",555,"WSE 555","INDUSTRIAL MKTNG FOREST SECTOR","Grad","https://catalog.oregonstate.edu/search/?P=WSE%20555","Sustainability Course"]
[null,"WSE","WSE",561,"WSE 561","BIO-BASED PRODUCTS MNFNG","Grad","https://catalog.oregonstate.edu/search/?P=WSE%20561","Sustainability Course"]
[null,"WSE","WSE",562,"WSE 562","ADVANCED MANUFACTURING 1","Grad","https://catalog.oregonstate.edu/search/?P=WSE%20562","Sustainability Course"]
[null,"WSE","WSE",573,"WSE 573","BIOENERGY & ENVIRONMENT IMPACT","Grad","https://catalog.oregonstate.edu/search/?P=WSE%20573","Sustainability Course"]
[null,"WSE","WSE",575,"WSE 575","ENVIRO ASSESS BUILD MATERIALS","Grad","https://catalog.oregonstate.edu/search/?P=WSE%20575","Sustainability Course"]
[null,"WSE","WSE",592,"WSE 592","ADVANCED WOOD DESIGN","Grad","https://secure.oregonstate.edu/ap/cps/documents/view/112277","Sustainability Course"]
[null,"INBI","Z",200,"Z 200","HUMANS AND THE ENVIRONMENT: IMPACTS AND CONSERVATION","Undergrad","https://secure.oregonstate.edu/ap/cps/documents/view/2623","Sustainability Course"]
[null,"INBI","Z",349,"Z 349","*BIODIVERSITY: CAUSES, CONSER","Undergrad","https://secure.oregonstate.edu/ap/cps/documents/view/119616","Sustainability Course"]
[null,"INBI","Z",350,"Z 350","ANIMAL BEHAVIOR","Undergrad","https://secure.oregonstate.edu/ap/cps/documents/view/116661","Sustainability Course"]
[null,"INBI","Z",371,"Z 371","VERTEBRATE BIOLOGY","Undergrad","https://secure.oregonstate.edu/ap/cps/documents/view/116491","Sustainability Course"]
[null,"INBI","Z",423,"Z 423","ENVIRONMENTAL PHYSIOLOGY","Undergrad","https://catalog.oregonstate.edu/search/?P=Z%20423","Sustainability Course"]
[null,"INBI","Z",523,"Z 523","ENVIRONMENTAL PHYSIOLOGY","Grad","https://catalog.oregonstate.edu/search/?P=Z%20523","Sustainability Course"]
[null,"INBI","Z",565,"Z 565","Z 565 MARINE CONSERVATION SCIENCE AND POLICY (3)","Grad","https://secure.oregonstate.edu/ap/cps/documents/view/3128","Sustainability Course"]
[null,"BA","ACTG",321,"ACTG 321","COST MANAGEMENT I","Undergrad","https://secure.oregonstate.edu/ap/cps/documents/view/100131","Course that includes sustainability "]
[null,"APEC","AEC",121,"AEC 121","DISCOVER AG & RES ECONOMICS","Undergrad","https://catalog.oregonstate.edu/search/?P=AEC%20121","Course that includes sustainability "]
[null,"APEC","AEC",460,"AEC 460","CAP INVEST ANAL USIN AGBIZ LOG","Undergrad","https://catalog.oregonstate.edu/search/?P=AEC%20460","Course that includes sustainability "]
[null,"APEC","AEC",560,"AEC 560","CAP INVEST ANAL USIN AGBIZ LOG","Grad","https://catalog.oregonstate.edu/search/?P=AEC%20560","Course that includes sustainability "]
[null,"APEC","AEC",612,"AEC 612","ADV MICROECONOMIC THEORY II","Grad","https://secure.oregonstate.edu/ap/cps/documents/view/100790","Course that includes sustainability "]
[null,"AED","AG",351,"AG 351","*COMMUNICATING AG TO PUBLIC","Undergrad","https://secure.oregonstate.edu/ap/cps/documents/view/117866","Course that includes sustainability "]
[null,"AG","AGRI",438,"AGRI 438","EXPLORING WORLD AGRICULTURE","Undergrad","https://secure.oregonstate.edu/ap/cps/documents/view/121312","Course that includes sustainability "]
[null,"AHE","AHE",534,"AHE 534","ORGANIZATIONS & SYSTEMS THEORY","Grad","https://secure.oregonstate.edu/ap/cps/documents/view/102483","Course that includes sustainability "]
[null,"ANRS","ANS",100,"ANS 100","OR TO ANIMAL & RANGE SCIENCES","Undergrad","https://secure.oregonstate.edu/ap/cps/documents/view/125254","Course that includes sustainability "]
[null,"ANRS","ANS",440,"ANS 440","DAIRY PRODUCTION SYSTEMS. (3 Credits)","Undergrad","https://catalog.oregonstate.edu/search/?P=ANS%20440","Course that includes sustainability "]
[null,"ANRS","ANS",540,"ANS 540","DAIRY PRODUCTION SYSTEMS. (3 Credits)","Grad","https://catalog.oregonstate.edu/search/?P=ANS%20540","Course that includes sustainability "]
[null,"SLCS","ANTH",372,"ANTH 372","*SOCIAL NETWORKS AND SOCIETY","Undergrad","https://secure.oregonstate.edu/ap/cps/documents/view/122923","Course that includes sustainability "]
[null,"SLCS","ANTH",438,"ANTH 438","ARCHAEOLOGY FIELD SCHOOL","Undergrad","https://catalog.oregonstate.edu/search/?P=ANTH%20438","Course that includes sustainability "]
[null,"SLCS","ANTH",444,"ANTH 444","NUTRITIONAL ANTHROPOLOGY","Undergrad","https://secure.oregonstate.edu/ap/cps/documents/view/99350","Course that includes sustainability "]
[null,"SLCS","ANTH",460,"ANTH 460","ETHNOGRAPHIC FIELD SCHOOL","Undergrad","https://catalog.oregonstate.edu/search/?P=ANTH%20460","Course that includes sustainability "]
[null,"SLCS","ANTH",477,"ANTH 477","ECOLOGICAL ANTHROPOLOGY","Undergrad","https://catalog.oregonstate.edu/search/?P=ANTH%20477","Course that includes sustainability "]
[null,"SLCS","ANTH",482,"ANTH 482","*ANTHRO OF INTERNL DEVELOPMENT","Undergrad","https://catalog.oregonstate.edu/search/?P=ANTH%20482","Course that includes sustainability "]
[null,"SLCS","ANTH",486,"ANTH 486","ANTHROPOLOGY OF FOOD","Undergrad","https://catalog.oregonstate.edu/search/?P=ANTH%20486","Course that includes sustainability "]
[null,"SLCS","ANTH",487,"ANTH 487","LANGUAGE IN GLOBAL CONTEXT. (4 Credits)","Undergrad","https://catalog.oregonstate.edu/search/?P=ANTH%20487","Course that includes sustainability "]
[null,"SLCS","ANTH",538,"ANTH 538","ARCHAEOLOGY FIELD SCHOOL","Grad","https://catalog.oregonstate.edu/search/?P=ANTH%20538","Course that includes sustainability "]
[null,"SLCS","ANTH",547,"ANTH 547","METHODS IN FOOD IN CULTURE AND SOCIAL JUSTICE STUDIES. (4 Credits)","Grad","https://secure.oregonstate.edu/ap/cps/documents/view/123484","Course that includes sustainability "]
[null,"SLCS","ANTH",560,"ANTH 560","ETHNOGRAPHIC FIELD SCHOOL","Grad","https://catalog.oregonstate.edu/search/?P=ANTH%20560","Course that includes sustainability "]
[null,"SLCS","ANTH",575,"ANTH 575","THEORY OF CULTURE","Grad","https://secure.oregonstate.edu/ap/cps/documents/view/116089","Course that includes sustainability "]
[null,"SLCS","ANTH",576,"ANTH 576","ADVANCED ANTHROPOLOGICAL THEORY SEMINAR. (4 Credits)","Grad","https://secure.oregonstate.edu/ap/cps/documents/view/122937","Course that includes sustainability "]
[null,"SLCS","ANTH",577,"ANTH 577","ECOLOGICAL ANTHROPOLOGY","Grad","https://catalog.oregonstate.edu/search/?P=ANTH%20577","Course that includes sustainability "]
[null,"SLCS","ANTH",581,"ANTH 581","NATURAL RESOURCES AND COMMUNITY VALUES. (4 Credits)","Grad","https://secure.oregonstate.edu/ap/cps/documents/view/6447","Course that includes sustainability "]
[null,"SLCS","ANTH",582,"ANTH 582","ANTHRO OF INTERNL DEVELOPMENT","Grad","https://catalog.oregonstate.edu/search/?P=ANTH%20582","Course that includes sustainability "]
[null,"SLCS","ANTH",585,"ANTH 585","USES OF ANTHROPOLOGY","Grad","https://secure.oregonstate.edu/ap/cps/documents/view/6446","Course that includes sustainability "]
[null,"SLCS","ANTH",586,"ANTH 586","ANTHROPOLOGY OF FOOD","Grad","https://catalog.oregonstate.edu/search/?P=ANTH%20586","Course that includes sustainability "]
[null,"SLCS","ANTH",587,"ANTH 587","LANGUAGE IN GLOBAL CONTEXT. (4 Credits)","Grad","https://catalog.oregonstate.edu/search/?P=ANTH%20587","Course that includes sustainability "]
[null,"SAC","ART",264,"ART 264","*PHOTO: HIST-TECH-CULTURE ART","Undergrad","https://secure.oregonstate.edu/ap/cps/documents/view/117647","Course that includes sustainability "]
[null,"SAC","ART",310,"ART 310","*EARLY CHINESE ART AND ARCHAEOLOGY. (3 Credits)","Undergrad","https://secure.oregonstate.edu/ap/cps/documents/view/114157","Course that includes sustainability "]
[null,"SAC","ART",313,"ART 313","*ART OF JAPAN. (3 Credits)","Undergrad","https://secure.oregonstate.edu/ap/cps/documents/view/113401","Course that includes sustainability "]
[null,"SAC","ART",352,"ART 352","*CREATIVE COLLABORATION","Undergrad","https://catalog.oregonstate.edu/search/?P=ART%20352","Course that includes sustainability "]
[null,"SAC","ART",366,"ART 366","ART SINCE 1945","Undergrad","https://secure.oregonstate.edu/ap/cps/documents/view/123169","Course that includes sustainability "]
[null,"SAC","ART",414,{"$f":"TRIM(C891)&\" \"&TRIM(D891)","v":"ART 414"},"ARTS MANAGEMENT","Undergrad","https://secure.oregonstate.edu/ap/cps/documents/view/130763","Course that includes sustainability "]
[null,"SAC","ART",514,{"$f":"TRIM(C892)&\" \"&TRIM(D892)","v":"ART 514"},"ARTS MANAGEMENT","Grad","https://secure.oregonstate.edu/ap/cps/documents/view/130763","Course that includes sustainability "]
[null,"OC","ATS",421,"ATS 421","CLIMATE MODELING","Undergrad","https://catalog.oregonstate.edu/search/?P=ATS%20421","Course that includes sustainability "]
[null,"OC","ATS",521,"ATS 521","CLIMATE MODELING","Grad","https://catalog.oregonstate.edu/search/?P=ATS%20521","Course that includes sustainability "]
[null,"OC","ATS",546,"ATS 546","EXPERIMENTAL ENERGY AND GAS EXCHANGE. (4 Credits)","Grad","https://secure.oregonstate.edu/ap/cps/documents/view/108787","Course that includes sustainability "]
[null,"BA","BA",270,{"$f":"TRIM(C896)&\" \"&TRIM(D896)","v":"BA 270"},"BUSINESS PROCESS MANAGEMENT","Undergrad","https://secure.oregonstate.edu/ap/cps/documents/view/129550","Course that includes sustainability "]
[null,"BA","BA",284,{"$f":"TRIM(C897)&\" \"&TRIM(D897)","v":"BA 284"},"PPL DEVELOPMENT III","Undergrad","https://secure.oregonstate.edu/ap/cps/documents/view/128716","Course that includes sustainability "]
[null,"BA","BA",302,"BA 302","BUSINESS PROCESS MANAGEMENT",{"$f":"IF(D898>499,\"Grad\", \"Undergrad\")","v":"Undergrad"},"https://secure.oregonstate.edu/ap/cps/documents/view/7237","Course that includes sustainability "]
[null,"BA","BA",314,{"$f":"TRIM(C899)&\" \"&TRIM(D899)","v":"BA 314"},"SUSTAINABLE BUSINESS OPS","Undergrad","https://secure.oregonstate.edu/ap/cps/documents/view/127282","Course that includes sustainability "]
[null,"BA","BA",352,"BA 352","MNGNG INDIV & TEAM PERFORMANCE","Undergrad","https://secure.oregonstate.edu/ap/cps/documents/view/7341","Course that includes sustainability "]
[null,"BA","BA",451,"BA 451","SUPPLY & SOURCING MANAGEMENT","Undergrad","https://secure.oregonstate.edu/ap/cps/documents/view/125314","Course that includes sustainability "]
[null,"BA","BA",468,"BA 468","TECHNOLOGY COMMERCIALIZATION","Undergrad","https://secure.oregonstate.edu/ap/cps/documents/view/7907","Course that includes sustainability "]
[null,"BA","BA",552,"BA 552","MANUFACTURING AND SERVICE OPS","Grad","https://secure.oregonstate.edu/ap/cps/documents/view/125810","Course that includes sustainability "]
[null,"BA","BA",590,"BA 590","MARKETING MANAGEMENT","Grad","https://secure.oregonstate.edu/ap/cps/documents/view/112086","Course that includes sustainability "]
[null,"BEE","BEE",222,{"$f":"TRIM(C905)&\" \"&TRIM(D905)","v":"BEE 222"},"ECOLOGICAL ENGINEERING COMP","Undergrad","https://secure.oregonstate.edu/ap/cps/documents/view/127108","Course that includes sustainability "]
[null,"MB","BHS",415,"BHS 415","ONE HEALTH IN PRACTICE. (3 Credits)","Undergrad","https://secure.oregonstate.edu/ap/cps/documents/view/133431","Course that includes sustainability "]
[null,"INBI","BI",111,"BI 111","INTRO MARINE LIFE IN THE SEA","Undergrad","https://catalog.oregonstate.edu/search/?P=BI%20111","Course that includes sustainability "]
[null,"INBI","BI",204,"BI 204","*INTRODUCTORY BIOLOGY I","Undergrad","https://secure.oregonstate.edu/ap/cps/documents/view/117990","Course that includes sustainability "]
[null,"INBI","BI",205,"BI 205","*INTRODUCTORY BIOLOGY II","Undergrad","https://secure.oregonstate.edu/ap/cps/documents/view/117992","Course that includes sustainability "]
[null,"INBI","BI",370,"BI 370","ECOLOGY","Undergrad","https://secure.oregonstate.edu/ap/cps/documents/view/116601","Course that includes sustainability "]
[null,"INBI","BI",375,{"$f":"TRIM(C911)&\" \"&TRIM(D911)","v":"BI 375"},"FIELD METHODS IN ECOL RESTOR","Undergrad","https://secure.oregonstate.edu/ap/cps/documents/view/127514","Course that includes sustainability "]
[null,"INBI","BI",427,"BI 427","PALEOBIOLOGY","Undergrad","https://catalog.oregonstate.edu/search/?P=BI%20427","Course that includes sustainability "]
[null,"INBI","BI",481,"BI 481","BIOGEOGRAPHY. (3 Credits)","Undergrad","https://secure.oregonstate.edu/ap/cps/documents/view/126363","Course that includes sustainability "]
[null,"INBI","BI",527,"BI 527","PALEOBIOLOGY","Grad","https://catalog.oregonstate.edu/search/?P=BI%20527","Course that includes sustainability "]
[null,"CBE","BIOE",462,"BIOE 462","BIOSEPARATIONS","Undergrad","https://catalog.oregonstate.edu/search/?P=BIOE%20462","Course that includes sustainability "]
[null,"CBE","BIOE",562,"BIOE 562","BIOSEPARATIONS","Grad","https://catalog.oregonstate.edu/search/?P=BIOE%20562","Course that includes sustainability "]
[null,"BOT","BOT",325,"BOT 325","*INTERSECTIONS BETWEEN PLANTS AND HUMANITY. (3 Credits)","Undergrad","https://secure.oregonstate.edu/ap/cps/documents/view/130511","Course that includes sustainability "]
[null,"CCE","CCE",101,"CCE 101","CCE ORIENTATION","Undergrad","https://secure.oregonstate.edu/ap/cps/documents/view/9818","Course that includes sustainability "]
[null,"CCE","CE",412,"CE 412","HYDROLOGY","Undergrad","https://catalog.oregonstate.edu/search/?P=CE%20412","Course that includes sustainability "]
[null,"CCE","CE",482,"CE 482","MASONRY DESIGN","Undergrad","https://catalog.oregonstate.edu/search/?P=CE%20482","Course that includes sustainability "]
[null,"CCE","CE",484,"CE 484","WOOD DESIGN","Undergrad","https://catalog.oregonstate.edu/search/?P=CE%20484","Course that includes sustainability "]
[null,"CCE","CE",512,"CE 512","HYDROLOGY","Grad","https://catalog.oregonstate.edu/search/?P=CE%20512","Course that includes sustainability "]
[null,"CCE","CE",578,"CE 578","GEOTECHNICAL EARTHQUAKE ENGR","Grad","https://secure.oregonstate.edu/ap/cps/documents/view/122258","Course that includes sustainability "]
[null,"CCE","CE",582,"CE 582","MASONRY DESIGN","Grad","https://catalog.oregonstate.edu/search/?P=CE%20582","Course that includes sustainability "]
[null,"CCE","CE",584,"CE 584","WOOD DESIGN","Grad","https://catalog.oregonstate.edu/search/?P=CE%20584","Course that includes sustainability "]
[null,"CH","CH",101,"CH 101","CHEMISTRY IN YOUR WORLD","Undergrad","https://secure.oregonstate.edu/ap/cps/documents/view/125450\nhttps://secure.oregonstate.edu/ap/cps/documents/view/125451","Course that includes sustainability "]
[null,"CBE","CHE",432,"CHE 432","CHEMICAL PLANT DESIGN II","Undergrad","https://secure.oregonstate.edu/ap/cps/documents/view/5042","Course that includes sustainability "]
[null,"SAC","COMM",325,"COMM 325","COMMUNICATING LEADERSHIP","Undergrad","https://secure.oregonstate.edu/ap/cps/documents/view/113443","Course that includes sustainability "]
[null,"CSS","CROP",414,"CROP 414","PRECISION AGRICULTURE","Undergrad","https://secure.oregonstate.edu/ap/cps/documents/view/118530","Course that includes sustainability "]
[null,"CSS","CROP",514,{"$f":"TRIM(C930)&\" \"&TRIM(D930)","v":"CROP 514"},"PRECISION AGRICULTURE","Grad","https://secure.oregonstate.edu/ap/cps/documents/view/131130","Course that includes sustainability "]
[null,"CSS","CSS",305,"CSS 305","PRINCIPLES OF SOIL SCIENCE","Undergrad","https://secure.oregonstate.edu/ap/cps/documents/view/106253","Course that includes sustainability "]
[null,"CSS","CSS",306,"CSS 306","PROBLEM SOLVING: SOIL SCIENCE","Undergrad","https://secure.oregonstate.edu/ap/cps/documents/view/106254","Course that includes sustainability "]
[null,"BA","DHE",263,"DHE 263","HUMAN-CENTERED DESIGN THEORIES AND STRATEGIES. (4 Credits)","Undergrad","https://secure.oregonstate.edu/ap/cps/documents/view/117205","Course that includes sustainability "]
[null,"BA","DHE",283,"DHE 283","BUILDING CONSTRUCTION AND MATERIALS. (3 Credits)","Undergrad","https://secure.oregonstate.edu/ap/cps/documents/view/4799","Course that includes sustainability "]
[null,"BA","DHE",300,"DHE 300","FIELD EXPERIENCE ORIENTATION AND DEVELOPMENT. (1-2 Credits)","Undergrad","https://secure.oregonstate.edu/ap/cps/documents/view/108368","Course that includes sustainability "]
[null,"BA","DHE",330,"DHE 330","^FASHION FORECASTING AND MARKET ANALYSIS. (4 Credits)","Undergrad","https://secure.oregonstate.edu/ap/cps/documents/view/117653","Course that includes sustainability "]
[null,"BA","DHE",445,"DHE 445","STUDIO VII: ADVANCED COMMERCIAL DESIGN. (4 Credits)","Undergrad","https://secure.oregonstate.edu/ap/cps/documents/view/5444","Course that includes sustainability "]
[null,"BA","DSGN",335,"DSGN 335","APPAREL AND FOOTWEAR VALUE CHAIN. (3 Credits)","Undergrad","https://secure.oregonstate.edu/ap/cps/documents/view/126432","Course that includes sustainability "]
[null,"BA","DSGN",442,"DSGN 442","MATERIALITY AND MAKING FIELD PROJECT. (4 Credits)","Undergrad","https://secure.oregonstate.edu/ap/cps/documents/view/126436","Course that includes sustainability "]
[null,"EECS","ECE",530,"ECE 530","CONTEMP ENERGY APPLICATIONS","Grad","https://secure.oregonstate.edu/ap/cps/documents/view/10205","Course that includes sustainability "]
[null,"EECS","ECE",536,"ECE 536","POWER SYSTEM PROTECTION","Grad","https://secure.oregonstate.edu/ap/cps/documents/view/114869","Course that includes sustainability "]
[null,"ED","ED",518,"ED 518","PROFESSIONAL PRACTICE","Grad","https://secure.oregonstate.edu/ap/cps/documents/view/119928","Course that includes sustainability "]
[null,"ED","ED",533,"ED 533","SCIENCE METHODS III","Grad","https://secure.oregonstate.edu/ap/cps/documents/view/120982","Course that includes sustainability "]
[null,"ED","ED",550,"ED 550","EFFECTIVE TEACHING CYCLE I","Grad","https://secure.oregonstate.edu/ap/cps/documents/view/119931","Course that includes sustainability "]
[null,"ED","ED",586,"ED 586","LANGUAGE ARTS METHODS III","Grad","https://secure.oregonstate.edu/ap/cps/documents/view/120980","Course that includes sustainability "]
[null,"ED","ED",651,"ED 651","RESEARCH BILINGUALISM AND MULTILINGUALISM. (3 Credits)","Grad","https://secure.oregonstate.edu/ap/cps/documents/view/122166","Course that includes sustainability "]
[null,"SWLF","ENG",206,"ENG 206","*VICTORIAN ERA TO 20TH CNTRY","Undergrad","https://secure.oregonstate.edu/ap/cps/documents/view/99802","Course that includes sustainability "]
[null,"SWLF","ENG",208,"ENG 208","*LITERATURE OF WESTERN CIVILIZATION: 18TH CENTURY TO PRESENT. (4 Credits)","Undergrad","https://secure.oregonstate.edu/ap/cps/documents/view/99807","Course that includes sustainability "]
[null,"SWLF","ENG",211,"ENG 211","*LITS OF THE WORLD: AFRICA","Undergrad","https://secure.oregonstate.edu/ap/cps/documents/view/99811","Course that includes sustainability "]
[null,"SWLF","ENG",215,"ENG 215","*CLASSICAL MYTHOLOGY","Undergrad","https://secure.oregonstate.edu/ap/cps/documents/view/99814","Course that includes sustainability "]
[null,"SWLF","ENG",221,"ENG 221","*AFRICAN-AMERICAN LITERATURE","Undergrad","https://secure.oregonstate.edu/ap/cps/documents/view/99817","Course that includes sustainability "]
[null,"SWLF","ENG",440,"ENG 440","STUDIES IN MODERN IRISH LIT","Undergrad","https://catalog.oregonstate.edu/search/?P=ENG%20440","Course that includes sustainability "]
[null,"SWLF","ENG",540,"ENG 540","STUDIES IN MODERN IRISH LIT","Grad","https://catalog.oregonstate.edu/search/?P=ENG%20540","Course that includes sustainability "]
[null,"ENGR","ENGR",352,"ENGR 352","*CREATIVE COLLABORATION","Undergrad","https://catalog.oregonstate.edu/search/?P=ENGR%20352","Course that includes sustainability "]
[null,"ENT","ENT",518,"ENT 518","CURRENT TOPICS IN ENTOMOLOGY. (2 Credits)","Grad","https://secure.oregonstate.edu/ap/cps/documents/view/109468","Course that includes sustainability "]
[null,"ENT","ENT",542,"ENT 542","PRINCIPLES OF INTEGRATED PEST MANAGEMENT: SYSTEMS DESIGN. (4 Credits)","Grad","https://secure.oregonstate.edu/ap/cps/documents/view/10298","Course that includes sustainability "]
[null,"SLCS","ES",212,"ES 212","ETHNIC STUDIES  212 SURVEY OF CHICANO/A STUDIES II ","Undergrad","https://secure.oregonstate.edu/ap/cps/documents/view/2802","Course that includes sustainability "]
[null,"SLCS","ES",213,{"$f":"TRIM(C958)&\" \"&TRIM(D958)","v":"ES 213"},"*LATINO/A IDENTITIES &ACTIVISM","Undergrad","https://secure.oregonstate.edu/ap/cps/documents/view/131920","Course that includes sustainability "]
[null,"SLCS","ES",233,"ES 233","*ASIAN PACIFIC AMERICAN ACTIVISM AND EMPOWERMENT. (4 Credits)","Undergrad","https://secure.oregonstate.edu/ap/cps/documents/view/120602","Course that includes sustainability "]
[null,"SLCS","ES",241,"ES 241","*INTRO NATIVE AMERICAN STUDIES","Undergrad","https://secure.oregonstate.edu/ap/cps/documents/view/112376","Course that includes sustainability "]
[null,"SLCS","ES",355,"ES 355","*RACE, SPACE, AND DIFFERENCE. (4 Credits)","Undergrad","https://secure.oregonstate.edu/ap/cps/documents/view/114771","Course that includes sustainability "]
[null,"SLCS","ES",437,"ES 437","*(EN)GENDERING ASIAN PACIFIC AMERICA. (4 Credits)",{"$f":"IF(D962>499,\"Grad\", \"Undergrad\")","v":"Undergrad"},"https://catalog.oregonstate.edu/search/?P=ES%20537","Course that includes sustainability "]
[null,"SLCS","ES",448,"ES 448","NATIVE AMERICAN PHILOSOPHIES. (4 Credits)","Undergrad","https://catalog.oregonstate.edu/search/?P=ES%20448","Course that includes sustainability "]
[null,"SLCS","ES",464,"ES 464","FOOD AND ETHNIC IDENTITY","Undergrad","https://catalog.oregonstate.edu/search/?P=ES%20464","Course that includes sustainability "]
[null,"SLCS","ES",537,"ES 537","*(EN)GENDERING ASIAN PACIFIC AMERICA. (4 Credits)","Grad","https://catalog.oregonstate.edu/search/?P=ES%20537","Course that includes sustainability "]
[null,"SLCS","ES",548,"ES 548","NATIVE AMERICAN PHILOSOPHIES. (4 Credits)","Grad","https://catalog.oregonstate.edu/search/?P=ES%20548","Course that includes sustainability "]
[null,"SLCS","ES",564,"ES 564","FOOD AND ETHNIC IDENTITY","Grad","https://catalog.oregonstate.edu/search/?P=ES%20564","Course that includes sustainability "]
[null,"MIME","ESE",471,"ESE 471","ENERGY STORAGE SYSTEMS","Undergrad","https://secure.oregonstate.edu/ap/cps/documents/view/112358","Course that includes sustainability "]
[null,"BPHS","EXSS",314,"EXSS 314","Introduction to Adapted Physical Activity ","Undergrad","https://secure.oregonstate.edu/ap/cps/documents/view/115140","Course that includes sustainability "]
[null,"BPHS","EXSS",444,"EXSS 444","Advanced Adapted Physical Activity","Undergrad","https://secure.oregonstate.edu/ap/cps/documents/view/118528","Course that includes sustainability "]
[null,"BPHS","EXSS",544,"EXSS 544","FCSJ 544 NUTRITIONAL ANTHROPOLOGY (4)","Grad","https://catalog.oregonstate.edu/search/?P=EXSS%20544","Course that includes sustainability "]
[null,"SLCS","FCSJ",486,"FCSJ 486","ANTHROPOLOGY OF FOOD","Undergrad","https://catalog.oregonstate.edu/search/?P=FCSJ%20486","Course that includes sustainability "]
[null,"SLCS","FCSJ",547,"FCSJ 547","METHODS IN FOOD IN CULTURE AND SOCIAL JUSTICE. (4 Credits)","Grad","https://secure.oregonstate.edu/ap/cps/documents/view/123483","Course that includes sustainability "]
[null,"SLCS","FCSJ",586,"FCSJ 586","ANTHROPOLOGY OF FOOD","Grad","https://catalog.oregonstate.edu/search/?P=FCSJ%20586","Course that includes sustainability "]
[null,"FERM","FE",307,"FE 307","JUNIOR SEMINAR. (1 Credit)","Undergrad","https://secure.oregonstate.edu/ap/cps/documents/view/112833","Course that includes sustainability "]
[null,"FERM","FE",440,"FE 440","FOREST OPERATIONS ANALYSIS","Undergrad","https://catalog.oregonstate.edu/search/?P=FE%20440","Course that includes sustainability "]
[null,"FERM","FE",459,"FE 459","FOREST MGMT PLAN & DESIGN","Undergrad","https://catalog.oregonstate.edu/search/?P=FE%20459","Course that includes sustainability "]
[null,"FERM","FE",540,"FE 540","FOREST OPERATIONS ANALYSIS","Grad","https://catalog.oregonstate.edu/search/?P=FE%20540","Course that includes sustainability "]
[null,"FES","FES",537,"FES 537","BELOWGROUND ECOSYSTEMS. (3 Credits)","Grad","https://secure.oregonstate.edu/ap/cps/documents/view/102377","Course that includes sustainability "]
[null,"FES","FES",548,{"$f":"TRIM(C980)&\" \"&TRIM(D980)","v":"FES 548"},"INVAS PLANTS: BIO, ECO & MGMT","Grad","https://secure.oregonstate.edu/ap/cps/documents/view/121594","Course that includes sustainability "]
[null,"FES","FES",550,"FES 550","TROPHIC CASCADES. (2-3 Credits)","Grad","https://catalog.oregonstate.edu/search/?P=FES%20550","Course that includes sustainability "]
[null,"FES","FES",565,"FES 565","URBAN FORESTRY LEADERSHIP","Grad","https://secure.oregonstate.edu/ap/cps/documents/view/115454","Course that includes sustainability "]
[null,"FES","FES",585,"FES 585","CONSENSUS & NATURAL RESOURCES","Grad","https://catalog.oregonstate.edu/search/?P=FES%20585","Course that includes sustainability "]
[null,"SWLF","FILM",256,"FILM 256","*WORLD CINEMA II: 1968-PRESENT","Undergrad","https://secure.oregonstate.edu/ap/cps/documents/view/110574","Course that includes sustainability "]
[null,"FERM","FOR",307,"FOR 307","JUNIOR SEMINAR. (1 Credit)","Undergrad","https://secure.oregonstate.edu/ap/cps/documents/view/112834","Course that includes sustainability "]
[null,"FERM","FOR",321,"FOR 321","FOREST MENSURATION","Undergrad","https://secure.oregonstate.edu/ap/cps/documents/view/3942","Course that includes sustainability "]
[null,"FERM","FOR",342,"FOR 342","Forest Types of the Northwest","Undergrad","https://secure.oregonstate.edu/ap/cps/documents/view/7705","Course that includes sustainability "]
[null,"FERM","FOR",448,"FOR 448","Forest Operations Planning and Scheduling ","Undergrad","https://secure.oregonstate.edu/ap/cps/documents/view/8566","Course that includes sustainability "]
[null,"FERM","FOR",459,"FOR 459","FOREST MGMT PLAN & DESIGN","Undergrad","https://catalog.oregonstate.edu/search/?P=FOR%20459","Course that includes sustainability "]
[null,"FERM","FOR",478,"FOR 478","Legal Issues In Tourism and Outdoor Leadership","Undergrad","https://secure.oregonstate.edu/ap/cps/documents/view/100811","Course that includes sustainability "]
[null,"FERM","FOR",548,"FOR 548","ASSESSMENT AND PROGRAMMING FOR SPECIAL POPULATIONS","Grad","https://catalog.oregonstate.edu/search/?P=FOR%20548","Course that includes sustainability "]
[null,"SLCS","FR",366,"FR 366","LANGUAGE AND IDENTITY: FRENCH. (2 Credits)","Undergrad","https://secure.oregonstate.edu/ap/cps/documents/view/123910","Course that includes sustainability "]
[null,"FW","FW",111,"FW 111","Introduction to Marine Life in the Sea ","Undergrad","https://secure.oregonstate.edu/ap/cps/documents/view/7305","Course that includes sustainability "]
[null,"FW","FW",320,"FW 320","INTRO POPULATION DYNAMICS","Undergrad","https://secure.oregonstate.edu/ap/cps/documents/view/8602","Course that includes sustainability "]
[null,"FW","FW",356,"FW 356","*CITIZEN SCIENCE","Undergrad","https://secure.oregonstate.edu/ap/cps/documents/view/123556","Course that includes sustainability "]
[null,"FW","FW",360,"FW 360","*ORIGINS OF F&W MANAGEMENT","Undergrad","https://secure.oregonstate.edu/ap/cps/documents/view/9124","Course that includes sustainability "]
[null,"FW","FW",451,"FW 451","AVIAN CONSERVATION & MANAGEMEN","Undergrad","https://catalog.oregonstate.edu/search/?P=FW%20451","Course that includes sustainability "]
[null,"FW","FW",474,"FW 474","EARLY LIFE HISTORY OF FISHES. (4 Credits)","Undergrad","https://catalog.oregonstate.edu/search/?P=FW%20474","Course that includes sustainability "]
[null,"FW","FW",491,"FW 491","FISH DISEASES","Undergrad","https://catalog.oregonstate.edu/search/?P=FW%20491","Course that includes sustainability "]
[null,"FW","FW",523,"FW 523","MONITORING WILDLIFE POPULATIONS AND THEIR HABITATS. (3 Credits)","Grad","https://secure.oregonstate.edu/ap/cps/documents/view/129859","Course that includes sustainability "]
[null,"FW","FW",538,"FW 538","STRUCTURED DECISION MAKING IN NATURAL RESOURCE MANAGEMENT LAB. (2 Credits)","Grad","https://secure.oregonstate.edu/ap/cps/documents/view/103403","Course that includes sustainability "]
[null,"FW","FW",542,"FW 542","PHYSIOLOGICAL ECOLOGY OF WILDLIFE","Grad","https://secure.oregonstate.edu/ap/cps/documents/view/108782","Course that includes sustainability "]
[null,"FW","FW",544,"FW 544","DECISION ANALYSIS F&W MGMT","Grad","https://secure.oregonstate.edu/ap/cps/documents/view/108768","Course that includes sustainability "]
[null,"FW","FW",549,"FW 549","HISTORY OF FISHERIES SCIENCE","Grad","https://secure.oregonstate.edu/ap/cps/documents/view/115913","Course that includes sustainability "]
[null,"FW","FW",550,"FW 550","TROPHIC CASCADES. (2-3 Credits)","Grad","https://catalog.oregonstate.edu/search/?P=FW%20550","Course that includes sustainability "]
[null,"FW","FW",551,"FW 551","AVIAN CONSERVATION & MANAGEMEN","Grad","https://catalog.oregonstate.edu/search/?P=FW%20551","Course that includes sustainability "]
[null,"FW","FW",573,"FW 573","FISH ECOLOGY AND CONSERVATION","Grad","https://secure.oregonstate.edu/ap/cps/documents/view/115715","Course that includes sustainability "]
[null,"FW","FW",574,"FW 574","EARLY LIFE HISTORY OF FISHES. (4 Credits)","Grad","https://catalog.oregonstate.edu/search/?P=FW%20574","Course that includes sustainability "]
[null,"FW","FW",591,"FW 591","FISH DISEASES","Grad","https://catalog.oregonstate.edu/search/?P=FW%20591","Course that includes sustainability "]
[null,"SAC","GD",269,"GD 269","GRAPHIC DESIGN HISTORY","Undergrad","https://secure.oregonstate.edu/ap/cps/documents/view/120445","Course that includes sustainability "]
[null,"GEO","GEO",495,"GEO 495","ADVANCED FIELD GEOLOGY","Undergrad","https://secure.oregonstate.edu/ap/cps/documents/view/123757","Course that includes sustainability "]
[null,"GEO","GEO",550,"GEO 550","COASTAL HAZARDS","Grad","https://secure.oregonstate.edu/ap/cps/documents/view/116521","Course that includes sustainability "]
[null,"GEO","GEO",684,"GEO 684","GLOBAL BIOGEOCHEMICAL CYCLES","Grad","https://secure.oregonstate.edu/ap/cps/documents/view/115408","Course that includes sustainability "]
[null,"GEO","GEOG",251,"GEOG 251","*GEOG OF DISASTER MANAGEMENT","Undergrad","https://secure.oregonstate.edu/ap/cps/documents/view/122421","Course that includes sustainability "]
[null,"GEO","GEOG",423,"GEOG 423","SNOW HYDROLOGY","Undergrad","https://catalog.oregonstate.edu/search/?P=GEOG%20423","Course that includes sustainability "]
[null,"GEO","GEOG",450,"GEOG 450","LAND USE IN THE AMERICAN WEST","Undergrad","https://catalog.oregonstate.edu/search/?P=GEOG%20450","Course that includes sustainability "]
[null,"GEO","GEOG",523,"GEOG 523","SNOW HYDROLOGY","Grad","https://catalog.oregonstate.edu/search/?P=GEOG%20523","Course that includes sustainability "]
[null,"GEO","GEOG",550,"GEOG 550","LAND USE IN THE AMERICAN WEST","Grad","https://catalog.oregonstate.edu/search/?P=GEOG%20550","Course that includes sustainability "]
[null,"GEO","GEOG",565,"GEOG 565","SPATIO-TEMPORAL VARIATION","Grad","https://secure.oregonstate.edu/ap/cps/documents/view/125798","Course that includes sustainability "]
[null,"GEO","GEOG",596,"GEOG 596","FLD RESEARCH IN GEOMORPHOLOGY","Grad","https://secure.oregonstate.edu/ap/cps/documents/view/122466","Course that includes sustainability "]
[null,"SLCS","GER",362,"GER 362","DIVIDED SCREEN: GERMAN CINEMA BETWEEN 1945 AND 1990. (3 Credits)","Undergrad","https://secure.oregonstate.edu/ap/cps/documents/view/100524","Course that includes sustainability "]
[null,"SLCS","GER",365,"GER 365","MIGRANT NARRATIVES: GERMAN. (2 Credits)","Undergrad","https://secure.oregonstate.edu/ap/cps/documents/view/121711","Course that includes sustainability "]
[null,"SLCS","GER",366,"GER 366","LANGUAGE AND IDENTITY: GERMAN. (2 Credits)","Undergrad","https://secure.oregonstate.edu/ap/cps/documents/view/123403","Course that includes sustainability "]
[null,"SLCS","GER",376,"GER 376","EMPIRES AND GLOBALIZATION: GERMAN. (2 Credits)","Undergrad","https://secure.oregonstate.edu/ap/cps/documents/view/121707","Course that includes sustainability "]
[null,"SBHS","H",250,"H 250","INTRO TO HEALTH CARE MGMT","Undergrad","https://secure.oregonstate.edu/ap/cps/documents/view/100112","Course that includes sustainability "]
[null,"SBHS","H",312,"H 312","*HIV/AIDS & STIS IN MODERN SOC",{"$f":"IF(D1026>499,\"Grad\", \"Undergrad\")","v":"Undergrad"},"https://secure.oregonstate.edu/ap/cps/documents/view/118521","Course that includes sustainability "]
[null,"SBHS","H",425,"H 425","FOUNDATIONS OF EPIDEMIOLOGY","Undergrad","https://secure.oregonstate.edu/ap/cps/documents/view/101462","Course that includes sustainability "]
[null,"SBHS","H",458,"H 458","REIMBURSEMENT MECHANISMS","Undergrad","https://secure.oregonstate.edu/ap/cps/documents/view/101622","Course that includes sustainability "]
[null,"SBHS","H",511,"H 511","COMM, CULTURE, & GLOBAL HLTH","Grad","https://secure.oregonstate.edu/ap/cps/documents/view/114927","Course that includes sustainability "]
[null,"SBHS","H",537,{"$f":"TRIM(C1030)&\" \"&TRIM(D1030)","v":"H 537"},"INJURY EPIDEMIOLOGY","Grad","https://secure.oregonstate.edu/ap/cps/documents/view/130236","Course that includes sustainability "]
[null,"SBHS","H",544,"H 544","ENVIRONMENTAL AND OCCUPATIONAL EPIDEMIOLOGY. (3 Credits)","Grad","https://secure.oregonstate.edu/ap/cps/documents/view/108493","Course that includes sustainability "]
[null,"SBHS","H",560,"H 560","PUBLIC HEALTH SURVEILLANCE","Grad","https://secure.oregonstate.edu/ap/cps/documents/view/120255","Course that includes sustainability "]
[null,"SBHS","H",676,"H 676","ADVANCED TOPICS IN HPHB","Grad","https://secure.oregonstate.edu/ap/cps/documents/view/102008","Course that includes sustainability "]
[null,"SBHS","HDFS",330,"HDFS 330","FOSTER LRNG IN EARLY CHILD DEV","Undergrad","https://secure.oregonstate.edu/ap/cps/documents/view/7486","Course that includes sustainability "]
[null,"SBHS","HDFS",639,"HDFS 639","COMMMUNITY-BASED PARTICIPATORY RESEARCH. (4 Credits)","Grad","https://secure.oregonstate.edu/ap/cps/documents/view/107958","Course that includes sustainability "]
[null,"SLCS","HEBR",213,"HEBR 213","SECOND-YEAR HEBREW III","Undergrad","https://secure.oregonstate.edu/ap/cps/documents/view/114981","Course that includes sustainability "]
[null,"BPHS","HHS",220,"HHS 220","Community Education Programs and Practices: The Extension System","Undergrad","https://secure.oregonstate.edu/ap/cps/documents/view/100287","Course that includes sustainability "]
[null,"BA","HM",230,{"$f":"TRIM(C1038)&\" \"&TRIM(D1038)","v":"HM 230"},"LODGING MANAGEMENT","Undergrad","https://secure.oregonstate.edu/ap/cps/documents/view/125011","Course that includes sustainability "]
[null,"BA","HM",460,"HM 460","HOSPITALITY INVESTMENT AND ASSET MANAGEMENT. (4 Credits)","Undergrad","https://secure.oregonstate.edu/ap/cps/documents/view/127096","Course that includes sustainability "]
[null,"HORT","HORT",361,"HORT 361","PLANT NURSERY SYSTEMS","Undergrad","https://secure.oregonstate.edu/ap/cps/documents/view/10730","Course that includes sustainability "]
[null,"HORT","HORT",380,"HORT 380","SUSTAINABLE LANDSCAPE DESIGN","Undergrad","https://secure.oregonstate.edu/ap/cps/documents/view/106672","Course that includes sustainability "]
[null,"HORT","HORT",385,"HORT 385","Permaculture Design and Theory Introduction","Undergrad","https://secure.oregonstate.edu/ap/cps/documents/view/7135","Course that includes sustainability "]
[null,"HORT","HORT",414,"HORT 414","PRECISION AGRICULTURE","Undergrad","https://secure.oregonstate.edu/ap/cps/documents/view/120781","Course that includes sustainability "]
[null,"HORT","HORT",421,"HORT 421","HERBS, SPICES, AND MEDICINAL PLANTS. (3 Credits)","Undergrad","https://secure.oregonstate.edu/ap/cps/documents/view/129556","Course that includes sustainability "]
[null,"HORT","HORT",518,"HORT 518","CURRENT TOPICS IN ENTOMOLOGY. (2 Credits)","Grad","https://secure.oregonstate.edu/ap/cps/documents/view/109465","Course that includes sustainability "]
[null,"HORT","HORT",521,"HORT 521","HERBS, SPICES, AND MEDICINAL PLANTS. (3 Credits)","Grad","https://secure.oregonstate.edu/ap/cps/documents/view/129556","Course that includes sustainability "]
[null,"SHPR","HST",106,"HST 106","*WORLD HIST III: MODERN & CONT","Undergrad","https://secure.oregonstate.edu/ap/cps/documents/view/8694","Course that includes sustainability "]
[null,"SHPR","HST",364,{"$f":"TRIM(C1048)&\" \"&TRIM(D1048)","v":"HST 364"},"*U.S. RELIGION & SOCIAL REFORM","Undergrad","https://secure.oregonstate.edu/ap/cps/documents/view/128390","Course that includes sustainability "]
[null,"SHPR","HST",365,"HST 365","*CIVIL RIGHTS IN MODERN U.S.","Undergrad","https://secure.oregonstate.edu/ap/cps/documents/view/115188","Course that includes sustainability "]
[null,"SHPR","HST",396,"HST 396","*GENDER, FAMILY AND POLITICS IN TRADITIONAL CHINA. (4 Credits)","Undergrad","https://secure.oregonstate.edu/ap/cps/documents/view/107397","Course that includes sustainability "]
[null,"SHPR","HST",397,"HST 397","*GENDER, FAMILY AND POLITICS IN MODERN CHINA. (4 Credits)","Undergrad","https://secure.oregonstate.edu/ap/cps/documents/view/107519","Course that includes sustainability "]
[null,"SHPR","HST",416,"HST 416","*FOOD IN WORLD HISTORY","Undergrad","https://catalog.oregonstate.edu/search/?P=HST%20416","Course that includes sustainability "]
[null,"SHPR","HST",470,"HST 470","RELIGION IN THE AMERICAN WEST","Undergrad","https://catalog.oregonstate.edu/search/?P=HST%20470","Course that includes sustainability "]
[null,"SHPR","HST",516,"HST 516","FOOD IN WORLD HISTORY. (4 Credits)","Grad","https://catalog.oregonstate.edu/search/?P=HST%20516","Course that includes sustainability "]
[null,"SHPR","HST",570,"HST 570","RELIGION IN THE AMERICAN WEST","Grad","https://catalog.oregonstate.edu/search/?P=HST%20570","Course that includes sustainability "]
[null,"SHPR","HSTS",451,"HSTS 451","*THE HISTORY OF OUTER SPACE","Undergrad","https://secure.oregonstate.edu/ap/cps/documents/view/118929","Course that includes sustainability "]
[null,"INBI","IB",511,"IB 511","INTEGRATIVE BIOLOGY GRADUATE STUDENT ORIENTATION. (2 Credits)","Grad","https://secure.oregonstate.edu/ap/cps/documents/view/133205","Course that includes sustainability "]
[null,"MIME","IE",584,"IE 584","SYSTEMS ENGINEERING","Grad","https://secure.oregonstate.edu/ap/cps/documents/view/123253","Course that includes sustainability "]
[null,"MIME","IE",585,"IE 585","LEGAL ASPECT OF ENGR MGMT","Grad","https://secure.oregonstate.edu/ap/cps/documents/view/123790","Course that includes sustainability "]
[null,"MB","MB",311,"MB 311","^MOLECULAR MICROBIOLOGY LAB","Undergrad","https://secure.oregonstate.edu/ap/cps/documents/view/3607","Course that includes sustainability "]
[null,"MB","MB",385,"MB 385","^EMERGING INFECTIOUS DISEASES","Undergrad","https://secure.oregonstate.edu/ap/cps/documents/view/110578","Course that includes sustainability "]
[null,"MB","MB",491,"MB 491","FISH DISEASES","Undergrad","https://catalog.oregonstate.edu/search/?P=MB%20491","Course that includes sustainability "]
[null,"MB","MB",555,"MB 555","BIOLOGY OF THE PROKARYOTES","Grad","https://secure.oregonstate.edu/ap/cps/documents/view/101247","Course that includes sustainability "]
[null,"MB","MB",591,"MB 591","FISH DISEASES","Grad","https://catalog.oregonstate.edu/search/?P=MB%20591","Course that includes sustainability "]
[null,"BA","MGMT",453,{"$f":"TRIM(C1065)&\" \"&TRIM(D1065)","v":"MGMT 453"},"HUMAN RESOURCES MANAGEMENT","Undergrad","https://secure.oregonstate.edu/ap/cps/documents/view/134075","Course that includes sustainability "]
[null,"BA","MGMT",553,{"$f":"TRIM(C1066)&\" \"&TRIM(D1066)","v":"MGMT 553"},"HUMAN RESOURCES MANAGEMENT","Grad","https://secure.oregonstate.edu/ap/cps/documents/view/134075","Course that includes sustainability "]
[null,"BA","MGMT",559,"MGMT 559","MNG ETHICS & CORP SOCIAL RESP","Grad","https://secure.oregonstate.edu/ap/cps/documents/view/117395","Course that includes sustainability "]
[null,"OC","MRM",520,"MRM 520","MRM 520 COASTAL LAW (3)","Grad","https://secure.oregonstate.edu/ap/cps/documents/view/8928","Course that includes sustainability "]
[null,"SAC","NMC",279,"NMC 279","MEDIA LITERACY. (3 Credits)","Undergrad","https://secure.oregonstate.edu/ap/cps/documents/view/120252","Course that includes sustainability "]
[null,"SNSE","NSE",452,"NSE 452","NEUTRONIC ANALYSIS II","Undergrad","https://catalog.oregonstate.edu/search/?P=NSE%20452","Course that includes sustainability "]
[null,"SNSE","NSE",552,"NSE 552","NEUTRONIC ANALYSIS II","Grad","https://catalog.oregonstate.edu/search/?P=NSE%20552","Course that includes sustainability "]
[null,"BPHS","NUR",417,"NUR 417","POPULATION-FOCUSED AND COMMUNITY-BASED NURSING PRACTICE II. (5 Credits)","Undergrad","https://secure.oregonstate.edu/ap/cps/documents/view/133815","Course that includes sustainability "]
[null,"BPHS","NUR",418,"NUR 418","HEALTH CARE SYSTEM ISSUES IN NURSING PRACTICE. (3 Credits)","Undergrad","https://secure.oregonstate.edu/ap/cps/documents/view/133816","Course that includes sustainability "]
[null,"BPHS","NUR",422,"NUR 422","HEALTH PROMOTION IN NURSING PRACTICE. (3 Credits)","Undergrad","https://secure.oregonstate.edu/ap/cps/documents/view/133821","Course that includes sustainability "]
[null,"BPHS","NUTR",235,"NUTR 235","SCIENCE OF FOODS","Undergrad","https://secure.oregonstate.edu/ap/cps/documents/view/4244","Course that includes sustainability "]
[null,"BPHS","NUTR",430,"NUTR 430","MEDICAL NUTRITION THERAPY I","Undergrad","https://catalog.oregonstate.edu/search/?P=NUTR%20430","Course that includes sustainability "]
[null,"BPHS","NUTR",431,"NUTR 431","MEDICAL NUTRITION THERAPY 2","Undergrad","https://catalog.oregonstate.edu/search/?P=NUTR%20431","Course that includes sustainability "]
[null,"BPHS","NUTR",446,"NUTR 446","MANAGING FOOD & NUTRITION SVCS","Undergrad","https://secure.oregonstate.edu/ap/cps/documents/view/9683","Course that includes sustainability "]
[null,"BPHS","NUTR",530,"NUTR 530","MEDICAL NUTRITION THERAPY I","Grad","https://catalog.oregonstate.edu/search/?P=NUTR%20530","Course that includes sustainability "]
[null,"BPHS","NUTR",531,"NUTR 531","MEDICAL NUTRITION THERAPY 2","Grad","https://catalog.oregonstate.edu/search/?P=NUTR%20531","Course that includes sustainability "]
[null,"OC","OC",295,"OC 295","INTRO TO FIELD OCEANOGRAPHY","Undergrad","https://secure.oregonstate.edu/ap/cps/documents/view/116527","Course that includes sustainability "]
[null,"OC","OC",449,{"$f":"TRIM(C1082)&\" \"&TRIM(D1082)","v":"OC 449"},"DATA FISHERIES OCEANOGRAPHY","Undergrad","https://secure.oregonstate.edu/ap/cps/documents/view/131166","Course that includes sustainability "]
[null,"OC","OC",521,"OC 521","APPS IN ECOLOGY & BIOGEOCHEM","Grad","https://secure.oregonstate.edu/ap/cps/documents/view/114295","Course that includes sustainability "]
[null,"OC","OC",549,{"$f":"TRIM(C1084)&\" \"&TRIM(D1084)","v":"OC 549"},"DATA FISHERIES OCEANOGRAPHY","Grad","https://secure.oregonstate.edu/ap/cps/documents/view/131166","Course that includes sustainability "]
[null,"OC","OC",562,"OC 562","SEDIMENTARY PROCESSES IN THE OCEAN BASINS. (3 Credits)","Grad","https://secure.oregonstate.edu/ap/cps/documents/view/4721","Course that includes sustainability "]
[null,"OC","OC",574,"OC 574","EARLY LIFE HISTORY OF FISHES. (4 Credits)","Grad","https://catalog.oregonstate.edu/search/?P=OC%20574","Course that includes sustainability "]
[null,"BPHS","PAC",304,"PAC 304","ALI: BACKPACKING","Undergrad","https://secure.oregonstate.edu/ap/cps/documents/view/109175","Course that includes sustainability "]
[null,"BPHS","PAC",331,"PAC 331","THE ART OF FLY FISHING. (1 Credit)","Undergrad","https://secure.oregonstate.edu/ap/cps/documents/view/117689","Course that includes sustainability "]
[null,"PH","PH",699,"PH 699","SPECIAL TOPICS: BIOLOGICAL PHYSICS. (3 Credits)","Grad","https://secure.oregonstate.edu/ap/cps/documents/view/113149","Course that includes sustainability "]
[null,"PHAR","PHAR",729,"PHAR 729","INFORMATION SCIENCE",{"$f":"IF(D1090>499,\"Grad\", \"Undergrad\")","v":"Grad"},"https://secure.oregonstate.edu/ap/cps/documents/view/108468","Course that includes sustainability "]
[null,"PHAR","PHAR",739,"PHAR 739","HEALTHCARE SYSTEMS II","Grad","https://secure.oregonstate.edu/ap/cps/documents/view/8529","Course that includes sustainability "]
[null,"PHAR","PHAR",778,"PHAR 778","ADVANCED ADULT MEDICINE","Grad","https://secure.oregonstate.edu/ap/cps/documents/view/101980","Course that includes sustainability "]
[null,"SHPR","PHL",345,"PHL 345","*FIRST FREEDOM: RELIGIOUS LIBERTY AND INTOLERANCE. (4 Credits)","Undergrad","https://catalog.oregonstate.edu/search/?P=PHL%20345","Course that includes sustainability "]
[null,"SHPR","PHL",448,"PHL 448","NATIVE AMERICAN PHILOSOPHIES. (4 Credits)","Undergrad","https://catalog.oregonstate.edu/search/?P=PHL%20448","Course that includes sustainability "]
[null,"SHPR","PHL",461,"PHL 461","ART AND MORALITY. (4 Credits)","Undergrad","https://catalog.oregonstate.edu/search/?P=PHL%20461","Course that includes sustainability "]
[null,"SHPR","PHL",534,"PHL 534","SPIRITUALITY AND ECOLOGY: GREEN YOGA. (4 Credits)","Grad","https://catalog.oregonstate.edu/search/?P=PHL%20534","Course that includes sustainability "]
[null,"SHPR","PHL",544,{"$f":"TRIM(C1097)&\" \"&TRIM(D1097)","v":"PHL 544"},"BIOMEDICAL ETHICS","Grad","https://secure.oregonstate.edu/ap/cps/documents/view/123311","Course that includes sustainability "]
[null,"SHPR","PHL",548,"PHL 548","NATIVE AMERICAN PHILOSOPHIES. (4 Credits)","Grad","https://catalog.oregonstate.edu/search/?P=PHL%20548","Course that includes sustainability "]
[null,"SHPR","PHL",561,"PHL 561","ART AND MORALITY. (4 Credits)","Grad","https://catalog.oregonstate.edu/search/?P=PHL%20561","Course that includes sustainability "]
[null,"SPP","PPOL",512,"PPOL 512","PUBLIC POLICY THEORY. (4 Credits)","Grad","https://secure.oregonstate.edu/ap/cps/documents/view/130913","Course that includes sustainability "]
[null,"SPP","PPOL",531,{"$f":"TRIM(C1101)&\" \"&TRIM(D1101)","v":"PPOL 531"},"INFLUENCING PUBLIC POLICY","Grad","https://secure.oregonstate.edu/ap/cps/documents/view/127141 ","Course that includes sustainability "]
[null,"SPP","PPOL",545,"PPOL 545","INTERNATIONAL MARINE POLICY. (4 Credits)","Grad","https://secure.oregonstate.edu/ap/cps/documents/view/122401","Course that includes sustainability "]
[null,"SPP","PPOL",552,{"$f":"TRIM(C1103)&\" \"&TRIM(D1103)","v":"PPOL 552"},"INTL COMPARATIVE RURAL POLICY","Grad","https://secure.oregonstate.edu/ap/cps/documents/view/127394","Course that includes sustainability "]
[null,"SPP","PPOL",614,"PPOL 614","ADVANCED POLICY THEORY II","Grad","https://secure.oregonstate.edu/ap/cps/documents/view/110933","Course that includes sustainability "]
[null,"SPP","PS",126,"PS 126","PS 126 INTRODUCTION TO LAW AND POLITICS (3) ","Undergrad","https://secure.oregonstate.edu/ap/cps/documents/view/102311","Course that includes sustainability "]
[null,"SPP","PS",325,"PS 325","*GENDER AND THE LAW","Undergrad","https://secure.oregonstate.edu/ap/cps/documents/view/121988","Course that includes sustainability "]
[null,"SPP","PS",331,"PS 331","*STATE AND LOCAL POLITICS","Undergrad","https://secure.oregonstate.edu/ap/cps/documents/view/119102","Course that includes sustainability "]
[null,"SPP","PS",348,"PS 348","*CHINESE POLITICS. (4 Credits)","Undergrad","https://secure.oregonstate.edu/ap/cps/documents/view/120493","Course that includes sustainability "]
[null,"SPP","PS",350,"PS 350","*JAPANESE POLITICS","Undergrad","https://secure.oregonstate.edu/ap/cps/documents/view/119626","Course that includes sustainability "]
[null,"SPP","PS",380,"PS 380","PS 380 CELEBRITY POLITICS (4)","Undergrad","https://secure.oregonstate.edu/ap/cps/documents/view/118154","Course that includes sustainability "]
[null,"SPP","PS",425,"PS 425","*GENDER AND THE LAW. (4 Credits)","Undergrad","https://secure.oregonstate.edu/ap/cps/documents/view/99100","Course that includes sustainability "]
[null,"SPS","PSY",433,"PSY 433","PSYCHOPHARMACOLOGY","Undergrad","https://catalog.oregonstate.edu/search/?P=PSY%20433","Course that includes sustainability "]
[null,"SPS","PSY",468,"PSY 468","PSYCH OF CLOSE RELATIONSHIPS","Undergrad","https://secure.oregonstate.edu/ap/cps/documents/view/113177","Course that includes sustainability "]
[null,"SPS","PSY",533,"PSY 533","PSYCHOPHARMACOLOGY","Grad","https://catalog.oregonstate.edu/search/?P=PSY%20533","Course that includes sustainability "]
[null,"SLCS","QS",364,"QS 364","*TRANSGENDER POLITICS","Undergrad","https://secure.oregonstate.edu/ap/cps/documents/view/111459","Course that includes sustainability "]
[null,"SHPR","REL",345,"REL 345","*FIRST FREEDOM: RELIGIOUS LIBERTY AND INTOLERANCE. (4 Credits)","Undergrad","https://catalog.oregonstate.edu/search/?P=REL%20345","Course that includes sustainability "]
[null,"SHPR","REL",364,{"$f":"TRIM(C1117)&\" \"&TRIM(D1117)","v":"REL 364"},"*U.S. RELIGION & SOCIAL REFORM","Undergrad","https://secure.oregonstate.edu/ap/cps/documents/view/128391","Course that includes sustainability "]
[null,"SHPR","REL",448,"REL 448","NATIVE AMERICAN PHILOSOPHIES. (4 Credits)","Undergrad","https://catalog.oregonstate.edu/search/?P=REL%20448","Course that includes sustainability "]
[null,"SHPR","REL",461,"REL 461","ART AND MORALITY. (4 Credits)","Undergrad","https://catalog.oregonstate.edu/search/?P=REL%20461","Course that includes sustainability "]
[null,"SHPR","REL",534,"REL 534","SPIRITUALITY AND ECOLOGY: GREEN YOGA. (4 Credits)","Grad","https://catalog.oregonstate.edu/search/?P=REL%20534","Course that includes sustainability "]
[null,"SHPR","REL",544,"REL 544","BIOMEDICAL ETHICS","Grad","https://secure.oregonstate.edu/ap/cps/documents/view/123311","Course that includes sustainability "]
[null,"SHPR","REL",548,"REL 548","NATIVE AMERICAN PHILOSOPHIES. (4 Credits)","Grad","https://catalog.oregonstate.edu/search/?P=REL%20548","Course that includes sustainability "]
[null,"SHPR","REL",561,"REL 561","ART AND MORALITY. (4 Credits)","Grad","https://catalog.oregonstate.edu/search/?P=REL%20561","Course that includes sustainability "]
[null,"MIME","ROB",567,"ROB 567","HUMAN ROBOT INTERACTION. (4 Credits)","Grad","https://secure.oregonstate.edu/ap/cps/documents/view/123900","Course that includes sustainability "]
[null,"FES","SNR",530,"SNR 530","ECOL PRIN OF SUS NAT RESOURCE","Grad","https://secure.oregonstate.edu/ap/cps/documents/view/9159","Course that includes sustainability "]
[null,"SPP","SOC",241,"SOC 241","INTRO TO CRIME AND JUSTICE","Undergrad","https://secure.oregonstate.edu/ap/cps/documents/view/100293","Course that includes sustainability "]
[null,"SPP","SOC",312,{"$f":"TRIM(C1127)&\" \"&TRIM(D1127)","v":"SOC 312"},"*SOCIOLOGY OF THE FAMILY","Undergrad","https://secure.oregonstate.edu/ap/cps/documents/view/131018","Course that includes sustainability "]
[null,"SPP","SOC",412,"SOC 412","SOCIOLOGY OF WORK AND FAMILY","Undergrad","https://catalog.oregonstate.edu/search/?P=SOC%20412","Course that includes sustainability "]
[null,"SPP","SOC",448,"SOC 448","LAW AND SOCIETY. (4 Credits)","Undergrad","https://catalog.oregonstate.edu/search/?P=SOC%20448","Course that includes sustainability "]
[null,"SPP","SOC",471,"SOC 471","SOCIAL MOVEMENTS","Undergrad","https://catalog.oregonstate.edu/search/?P=SOC%20471","Course that includes sustainability "]
[null,"SPP","SOC",475,"SOC 475","RURAL SOCIOLOGY","Undergrad","https://catalog.oregonstate.edu/search/?P=SOC%20475","Course that includes sustainability "]
[null,"SPP","SOC",512,"SOC 512","SOCIOLOGY OF WORK AND FAMILY","Grad","https://catalog.oregonstate.edu/search/?P=SOC%20512","Course that includes sustainability "]
[null,"SPP","SOC",548,"SOC 548","LAW AND SOCIETY. (4 Credits)","Grad","https://catalog.oregonstate.edu/search/?P=SOC%20548","Course that includes sustainability "]
[null,"SPP","SOC",571,"SOC 571","SOCIAL MOVEMENTS","Grad","https://catalog.oregonstate.edu/search/?P=SOC%20571","Course that includes sustainability "]
[null,"SPP","SOC",575,"SOC 575","RURAL SOCIOLOGY. (4 Credits)","Grad","https://catalog.oregonstate.edu/search/?P=SOC%20575","Course that includes sustainability "]
[null,"SPP","SOC",585,"SOC 585","CONSENSUS & NATURAL RESOURCES","Grad","https://catalog.oregonstate.edu/search/?P=SOC%20585","Course that includes sustainability "]
[null,"SLCS","SPAN",318,"SPAN 318","INTRO TO SPANISH LANGUAGE LIT","Undergrad","https://secure.oregonstate.edu/ap/cps/documents/view/100510","Course that includes sustainability "]
[null,"SLCS","SPAN",361,"SPAN 361","*MODERN SPAIN SPANISH CINEMA","Undergrad","https://secure.oregonstate.edu/ap/cps/documents/view/121958","Course that includes sustainability "]
[null,"SLCS","SPAN",375,"SPAN 375","LITERATURES OF POWER AND RESISTANCE: SPANISH. (2 Credits)","Undergrad","https://secure.oregonstate.edu/ap/cps/documents/view/121720","Course that includes sustainability "]
[null,"SLCS","SPAN",376,"SPAN 376","EMPIRES AND GLOBALIZATION: SPANISH. (2 Credits)","Undergrad","https://secure.oregonstate.edu/ap/cps/documents/view/123843","Course that includes sustainability "]
[null,"TCE","TCE",483,"TCE 483","Developmental Reading","Undergrad","https://secure.oregonstate.edu/ap/cps/documents/view/108785","Course that includes sustainability "]
[null,"TCE","TCE",595,"TCE 595","GROUP COUNSELING II ","Grad","https://secure.oregonstate.edu/ap/cps/documents/view/100246","Course that includes sustainability "]
[null,"EMT","TOX",429,"TOX 429","TOXIC SUBSTANCES IN FOOD","Undergrad","https://catalog.oregonstate.edu/search/?P=TOX%20429","Course that includes sustainability "]
[null,"EMT","TOX",529,"TOX 529","TOXIC SUBSTANCES IN FOOD","Grad","https://catalog.oregonstate.edu/search/?P=TOX%20529","Course that includes sustainability "]
[null,"FES","TRAL",351,{"$f":"TRIM(C1145)&\" \"&TRIM(D1145)","v":"TRAL 351"},"OUTDOOR REC MGMT PUBLIC LANDS","Undergrad","https://secure.oregonstate.edu/ap/cps/documents/view/123171","Course that includes sustainability "]
[null,"FES","TRAL",457,{"$f":"TRIM(C1146)&\" \"&TRIM(D1146)","v":"TRAL 457"},"PLANNING SUSTAINABLE TOURISM","Undergrad","https://secure.oregonstate.edu/ap/cps/documents/view/121468 ","Course that includes sustainability "]
[null,"ALS","UEXP",290,{"$f":"TRIM(C1147)&\" \"&TRIM(D1147)","v":"UEXP 290"},"INFORMATION AND SOC JUSTICE","Undergrad","https://secure.oregonstate.edu/ap/cps/documents/view/126673","Course that includes sustainability "]
[null,"BMS","VMB",415,"VMB 415","ONE HEALTH IN PRACTICE. (3 Credits)","Undergrad","https://secure.oregonstate.edu/ap/cps/documents/view/133719","Course that includes sustainability "]
[null,"BMS","VMB",521,"VMB 521","ANIMAL MODELS. (3 Credits)","Grad","https://secure.oregonstate.edu/ap/cps/documents/view/5570","Course that includes sustainability "]
[null,"VCS","VMC",769,"VMC 769","GENERAL MEDICINE","Grad","https://secure.oregonstate.edu/ap/cps/documents/view/5895","Course that includes sustainability "]
[null,"SLCS","WGSS",240,"WGSS 240","*GENDER AND SPORT","Undergrad","https://secure.oregonstate.edu/ap/cps/documents/view/118212","Course that includes sustainability "]
[null,"SLCS","WGSS",364,"WGSS 364","*TRANSGENDER POLITICS","Undergrad","https://secure.oregonstate.edu/ap/cps/documents/view/112235","Course that includes sustainability "]
[null,"SLCS","WGSS",414,"WGSS 414","*SYS OF OPPRESS WOMEN'S LIVES","Undergrad","https://secure.oregonstate.edu/ap/cps/documents/view/116458","Course that includes sustainability "]
[null,"SLCS","WGSS",480,{"$f":"TRIM(C1154)&\" \"&TRIM(D1154)","v":"WGSS 480"},"*GENDER & TRANSNATL ACTIVISMS",{"$f":"IF(D1154>499,\"Grad\", \"Undergrad\")","v":"Undergrad"},"https://secure.oregonstate.edu/ap/cps/documents/view/132122 Ecampus https://secure.oregonstate.edu/ap/cps/documents/view/132123","Course that includes sustainability "]
[null,"SLCS","WGSS",514,"WGSS 514","SYSTEMS OF OPPRESSION","Grad","https://secure.oregonstate.edu/ap/cps/documents/view/115158","Course that includes sustainability "]
[null,"SLCS","WGSS",535,"WGSS 535","FEMINIST TEACHING AND LEARNING","Grad","https://secure.oregonstate.edu/ap/cps/documents/view/114191","Course that includes sustainability "]
[null,"SLCS","WGSS",618,"WGSS 618","FEMINIST PARTICIPATORY ACTION RESEARCH. (4 Credits)","Grad","https://secure.oregonstate.edu/ap/cps/documents/view/126700","Course that includes sustainability "]
[null,"SLCS","WGSS",620,"WGSS 620","SOCIAL JUSTICE THEORY","Grad","https://secure.oregonstate.edu/ap/cps/documents/view/116848","Course that includes sustainability "]
[null,"SLCS","WLC",159,"WLC 159","WLC 159 LANGUAGE, RACE AND RACISM IN THE US: AN INTRODUCTION (4)","Undergrad","https://secure.oregonstate.edu/ap/cps/documents/view/123755","Course that includes sustainability "]
[null,"SLCS","WLC",332,{"$f":"TRIM(C1160)&\" \"&TRIM(D1160)","v":"WLC 332"},"*CHINESE CULTURE II","Undergrad","https://secure.oregonstate.edu/ap/cps/documents/view/123376","Course that includes sustainability "]
[null,"SLCS","WLC",365,"WLC 365","WLC 365 MIGRANT NARRATIVES (2)","Undergrad","https://secure.oregonstate.edu/ap/cps/documents/view/122839","Course that includes sustainability "]
[null,"SLCS","WLC",366,"WLC 366","WLC 366 LANGUAGE AND IDENTITY (2)","Undergrad","https://secure.oregonstate.edu/ap/cps/documents/view/121713","Course that includes sustainability "]
[null,"WSE","WSE",210,"WSE 210","*RENEW MATLS TECH & UTILIZATIO","Undergrad","https://secure.oregonstate.edu/ap/cps/documents/view/113870","Course that includes sustainability "]
[null,"WSE","WSE",451,{"$f":"TRIM(C1164)&\" \"&TRIM(D1164)","v":"WSE 451"},"ENTREPR PRODUCT DEVELOPMENT II","Undergrad","https://secure.oregonstate.edu/ap/cps/documents/view/129967","Course that includes sustainability "]
[null,"INBI","Z",477,"Z 477","AQUATIC ENTOMOLOGY","Undergrad","https://catalog.oregonstate.edu/search/?P=Z%20477","Course that includes sustainability "]
[null,"INBI","Z",577,"Z 577","AQUATIC ENTOMOLOGY","Grad","https://catalog.oregonstate.edu/search/?P=Z%20577","Course that includes sustainability "]
[null,"MIME","AAE",412,"AAE 412","SPACE SYSTEMS ENGINEERING","Undergrad","https://secure.oregonstate.edu/ap/cps/documents/view/126273","No Sustainability Content"]
[null,"MIME","AAE",512,"AAE 512","SPACE SYSTEMS ENGINEERING. (4 Credits)","Grad","https://secure.oregonstate.edu/ap/cps/documents/view/130520","No Sustainability Content"]
[null,"BA","ACTG",317,"ACTG 317","EXTERNAL REPORTING I","Undergrad","https://secure.oregonstate.edu/ap/cps/documents/view/100127","No Sustainability Content"]
[null,"BA","ACTG",318,"ACTG 318","EXTERNAL REPORTING II","Undergrad","https://secure.oregonstate.edu/ap/cps/documents/view/100128","No Sustainability Content"]
[null,"BA","ACTG",319,"ACTG 319","EXTERNAL REPORTING III","Undergrad","https://secure.oregonstate.edu/ap/cps/documents/view/100129","No Sustainability Content"]
[null,"BA","ACTG",326,"ACTG 326","ACCOUNTING RESEARCH METHODS AND TOPICS. (2 Credits)","Undergrad","https://secure.oregonstate.edu/ap/cps/documents/view/129363 ","No Sustainability Content"]
[null,"BA","ACTG",378,"ACTG 378","ACTG INFORMATION MANAGEMENT","Undergrad","https://secure.oregonstate.edu/ap/cps/documents/view/106551","No Sustainability Content"]
[null,"BA","ACTG",379,"ACTG 379","ACCOUNTING ANALYTICS. (4 Credits)","Undergrad","https://secure.oregonstate.edu/ap/cps/documents/view/126632","No Sustainability Content"]
[null,"BA","ACTG",414,"ACTG 414","FORENSIC ACCOUNTING. (2 Credits)","Undergrad","https://secure.oregonstate.edu/ap/cps/documents/view/129274 ","No Sustainability Content"]
[null,"BA","ACTG",415,"ACTG 415","GOVERNMENTAL AND NOT-FOR-PROFIT. (2 Credits)","Undergrad","https://secure.oregonstate.edu/ap/cps/documents/view/129275 ","No Sustainability Content"]
[null,"BA","ACTG",416,"ACTG 416","ACCOUNTING RESEARCH AND ANALYSIS. (2 Credits)","Undergrad","https://secure.oregonstate.edu/ap/cps/documents/view/129287 ","No Sustainability Content"]
[null,"BA","ACTG",417,"ACTG 417","ADVANCED ACCOUNTING","Undergrad","https://secure.oregonstate.edu/ap/cps/documents/view/100134","No Sustainability Content"]
[null,"BA","ACTG",418,"ACTG 418","ACCOUNTING CODES OF PROFESSIONAL CONDUCT AND ETHICAL BEHAVIOR. (2 Credits)","Undergrad","https://secure.oregonstate.edu/ap/cps/documents/view/129357 ","No Sustainability Content"]
[null,"BA","ACTG",419,"ACTG 419","MULTINATIONAL ACCOUNTING AND ANALYSIS. (2 Credits)","Undergrad","https://secure.oregonstate.edu/ap/cps/documents/view/129360 ","No Sustainability Content"]
[null,"BA","ACTG",420,"ACTG 420","IT AUDITING","Undergrad","https://catalog.oregonstate.edu/search/?P=ACTG%20420","No Sustainability Content"]
[null,"BA","ACTG",422,"ACTG 422","STRATEGIC COST MANAGEMENT","Undergrad","https://catalog.oregonstate.edu/search/?P=ACTG%20422","No Sustainability Content"]
[null,"BA","ACTG",424,"ACTG 424","TAXATION I","Undergrad","https://secure.oregonstate.edu/ap/cps/documents/view/115370","No Sustainability Content"]
[null,"BA","ACTG",425,"ACTG 425","ADVANCED TAXATION","Undergrad","https://catalog.oregonstate.edu/search/?P=ACTG%20425","No Sustainability Content"]
[null,"BA","ACTG",427,"ACTG 427","ASSURANCE & ATTESTATION SVCS","Undergrad","https://secure.oregonstate.edu/ap/cps/documents/view/101863","No Sustainability Content"]
[null,"BA","ACTG",428,"ACTG 428","ADVANCED AUDIT ANALYTICS. (4 Credits)","Undergrad","https://secure.oregonstate.edu/ap/cps/documents/view/126503","No Sustainability Content"]
[null,"BA","ACTG",516,"ACTG 516","ACCOUNTING RESEARCH AND ANALYSIS. (3 Credits)","Grad","https://secure.oregonstate.edu/ap/cps/documents/view/101969","No Sustainability Content"]
[null,"BA","ACTG",518,"ACTG 518","ACCOUNTING THEORY AND PRACTICE I. (3 Credits)","Grad","https://secure.oregonstate.edu/ap/cps/documents/view/112207","No Sustainability Content"]
[null,"BA","ACTG",519,"ACTG 519","ACCOUNTING THEORY AND PRACTICE II. (3 Credits)","Grad","https://secure.oregonstate.edu/ap/cps/documents/view/112253","No Sustainability Content"]
[null,"BA","ACTG",520,"ACTG 520","IT AUDITING","Grad","https://catalog.oregonstate.edu/search/?P=ACTG%20520","No Sustainability Content"]
[null,"BA","ACTG",522,"ACTG 522","STRATEGIC COST MANAGEMENT","Grad","https://catalog.oregonstate.edu/search/?P=ACTG%20522","No Sustainability Content"]
[null,"BA","ACTG",524,{"$f":"TRIM(C1192)&\" \"&TRIM(D1192)","v":"ACTG 524"},"INTRODUCTION TO TAXATION","Grad","https://secure.oregonstate.edu/ap/cps/documents/view/127145","No Sustainability Content"]
[null,"BA","ACTG",525,"ACTG 525","ADVANCED TAXATION","Grad","https://catalog.oregonstate.edu/search/?P=ACTG%20525","No Sustainability Content"]
[null,"BA","ACTG",620,"ACTG 620","FOUNDATIONS OF ACCOUNTING RESEARCH. (3 Credits)","Grad","https://secure.oregonstate.edu/ap/cps/documents/view/113633","No Sustainability Content"]
[null,"BA","ACTG",621,"ACTG 621","FINANCIAL ACCOUNTING RESEARCH. (3 Credits)","Grad","https://secure.oregonstate.edu/ap/cps/documents/view/114948","No Sustainability Content"]
[null,"BA","ACTG",622,"ACTG 622","ACTG, JUDGMENT & ACCNTABILITY","Grad","https://secure.oregonstate.edu/ap/cps/documents/view/120273","No Sustainability Content"]
[null,"BA","ACTG",623,"ACTG 623","TAX RESEARCH","Grad","https://secure.oregonstate.edu/ap/cps/documents/view/114951","No Sustainability Content"]
[null,"APEC","AEC",447,"AEC ","Agricultural Price and Market Analysis","Undergrad","https://secure.oregonstate.edu/ap/cps/documents/view/129179","No Sustainability Content"]
[null,"APEC","AEC",211,"AEC 211","AGRICULTURAL & FOOD MANAGEMENT","Undergrad","https://secure.oregonstate.edu/ap/cps/documents/view/125979","No Sustainability Content"]
[null,"APEC","AEC",251,"AEC 251","*INTRO TO AG & FOOD ECONOMICS","Undergrad","https://secure.oregonstate.edu/ap/cps/documents/view/120668","No Sustainability Content"]
[null,"APEC","AEC",310,"AEC 310","EXPLORING EXP LEARNING OPP","Undergrad","https://secure.oregonstate.edu/ap/cps/documents/view/119956","No Sustainability Content"]
[null,"APEC","AEC",311,"AEC 311","INTERMED APP ECON I: PROD/CONS","Undergrad","https://secure.oregonstate.edu/ap/cps/documents/view/119800","No Sustainability Content"]
[null,"APEC","AEC",313,"AEC 313","INTERMEDAPPECON II:MRKS,WEL,PO","Undergrad","https://secure.oregonstate.edu/ap/cps/documents/view/120696","No Sustainability Content"]
[null,"APEC","AEC",372,"AEC 372","AGRICULTURAL COOPERATIVES","Undergrad","https://catalog.oregonstate.edu/search/?P=AEC%20372","No Sustainability Content"]
[null,"APEC","AEC",434,{"$f":"TRIM(C1205)&\" \"&TRIM(D1205)","v":"AEC 434"},"^MEASURING RES & ENVIRO IMPACT","Undergrad","https://secure.oregonstate.edu/ap/cps/documents/view/116818","Unavailable syllabus"]
[null,"APEC","AEC",442,"AEC 442","AGRICULTURAL BUSINESS MGMT","Undergrad","https://catalog.oregonstate.edu/search/?P=AEC%20442","No Sustainability Content"]
[null,"APEC","AEC",444,"AEC 444","COMM FUTURES & OPTIONS MARKETS","Undergrad","https://catalog.oregonstate.edu/search/?P=AEC%20444","No Sustainability Content"]
[null,"APEC","AEC",447,"AEC 447","AGRI PRICE & MARKET ANALYSIS","Undergrad","https://catalog.oregonstate.edu/search/?P=AEC%20447","No Sustainability Content"]
[null,"APEC","AEC",454,{"$f":"TRIM(C1209)&\" \"&TRIM(D1209)","v":"AEC 454"},"RURAL DEVELOP ECON AND POLICY","Undergrad","https://secure.oregonstate.edu/ap/cps/documents/view/129031","No Sustainability Content"]
[null,"APEC","AEC",461,"AEC 461","^AGRI & FOOD POLICY ISSUES","Undergrad","https://catalog.oregonstate.edu/search/?P=AEC%20461","No Sustainability Content"]
[null,"APEC","AEC",465,"AEC 465","AGRI & FOOD FINANCIAL MGMT","Undergrad","https://catalog.oregonstate.edu/search/?P=AEC%20465","No Sustainability Content"]
[null,"APEC","AEC",466,"AEC 466","AGRICULTURAL AND FOOD MARKETING MANAGEMENT. (4 Credits)","Undergrad","https://secure.oregonstate.edu/ap/cps/documents/view/126279","No Sustainability Content"]
[null,"APEC","AEC",475,"AEC 475","WRITING BUSINESS PLANS: AGRICULTURE/FOOD-RELATED ENTERPRISES. (2 Credits)","Undergrad","https://secure.oregonstate.edu/ap/cps/documents/view/125823","No Sustainability Content"]
[null,"APEC","AEC",512,"AEC 512","MICROECONOMIC THEORY I","Grad","https://secure.oregonstate.edu/ap/cps/documents/view/100861","No Sustainability Content"]
[null,"APEC","AEC",513,"AEC 513","MICROECONOMIC THEORY II","Grad","https://secure.oregonstate.edu/ap/cps/documents/view/100566","No Sustainability Content"]
[null,"APEC","AEC",515,"AEC 515","Macroeconomic Theory","Grad","https://secure.oregonstate.edu/ap/cps/documents/view/100785","No Sustainability Content"]
[null,"APEC","AEC",523,"AEC 523","Statistics and Optimization for Economics","Grad","https://secure.oregonstate.edu/ap/cps/documents/view/100658","No Sustainability Content"]
[null,"APEC","AEC",525,"AEC 525","APPLIED ECONOMETRICS",{"$f":"IF(D1218>499,\"Grad\", \"Undergrad\")","v":"Grad"},"https://secure.oregonstate.edu/ap/cps/documents/view/112738","No Sustainability Content"]
[null,"APEC","AEC",543,"AEC 543","INTERNATIONAL TRADE","Grad","https://catalog.oregonstate.edu/search/?P=AEC%20543","No Sustainability Content"]
[null,"APEC","AEC",544,"AEC 544","COMM FUTURES & OPTIONS MARKETS","Grad","https://catalog.oregonstate.edu/search/?P=AEC%20544","No Sustainability Content"]
[null,"APEC","AEC",554,{"$f":"TRIM(C1221)&\" \"&TRIM(D1221)","v":"AEC 554"},"RURAL DEVELOPMT ECON & POLICY","Grad","https://secure.oregonstate.edu/ap/cps/documents/view/129031","No Sustainability Content"]
[null,"APEC","AEC",565,"AEC 565","AGRI & FOOD FINANCIAL MGMT","Grad","https://catalog.oregonstate.edu/search/?P=AEC%20565","No Sustainability Content"]
[null,"APEC","AEC",566,"AEC 566","AGRICULTURAL AND FOOD MARKETING MANAGEMENT. (4 Credits)","Grad","https://secure.oregonstate.edu/ap/cps/documents/view/126279","No Sustainability Content"]
[null,"APEC","AEC",611,"AEC 611","ADV MICROECONOMIC THEORY I","Grad","https://secure.oregonstate.edu/ap/cps/documents/view/100788","No Sustainability Content"]
[null,"APEC","AEC",613,"AEC 613","ADV MICROECONOMIC THEORY III","Grad","https://secure.oregonstate.edu/ap/cps/documents/view/100711","No Sustainability Content"]
[null,"APEC","AEC",615,"AEC 615"," Advanced Macroeconomic Theory","Grad","https://secure.oregonstate.edu/ap/cps/documents/view/100860","No Sustainability Content"]
[null,"APEC","AEC",625,"AEC 625","ADVANCED ECONOMETRICS I","Grad","https://secure.oregonstate.edu/ap/cps/documents/view/100679","No Sustainability Content"]
[null,"APEC","AEC",626,"AEC 626","ADVANCED ECONOMETRICS II","Grad","https://secure.oregonstate.edu/ap/cps/documents/view/100680","No Sustainability Content"]
[null,"APEC","AEC",627,"AEC 627","COMPUTATIONAL ECONOMICS","Grad","https://secure.oregonstate.edu/ap/cps/documents/view/126017","No Sustainability Content"]
[null,"AED","AED",555,"AED 555","LABORATORY PEDAGOGY","Grad","https://secure.oregonstate.edu/ap/cps/documents/view/120195","No Sustainability Content"]
[null,"AED","AED",558,"AED 558","IMPROVING AST PROGRAMS","Grad","https://secure.oregonstate.edu/ap/cps/documents/view/112547","No Sustainability Content"]
[null,"AED","AED",640,"AED 640","INSTRUMENTATION AND DATA COLL","Grad","https://secure.oregonstate.edu/ap/cps/documents/view/122163","No Sustainability Content"]
[null,"MIME","AEE",210,"AEE 210","Introduction to Aerospace Engineering","Undergrad","https://secure.oregonstate.edu/ap/cps/documents/view/126152","No Sustainability Content"]
[null,"AED","AG",111,{"$f":"TRIM(C1234)&\" \"&TRIM(D1234)","v":"AG 111"},"INFO TECHNOLOGY IN AGRICULTURE","Undergrad","https://secure.oregonstate.edu/ap/cps/documents/view/127991","No Sustainability Content"]
[null,"AED","AG",230,"AG 230","INTRO EXTENSION & ENGAGEMENT","Undergrad","https://secure.oregonstate.edu/ap/cps/documents/view/123353","No Sustainability Content"]
[null,"AED","AG",342,"AG 342","Team and Organizational Leadership","Undergrad","https://secure.oregonstate.edu/ap/cps/documents/view/118325","No Sustainability Content"]
[null,"AED","AG",435,"AG 435","PROFESSIONAL PRESENTATIONS IN AGRICULTURE. (3 Credits)","Undergrad","https://secure.oregonstate.edu/ap/cps/documents/view/125763","No Sustainability Content"]
[null,"AHE","AHE",522,"AHE 522","INSTRUCTIONAL TECHNOLOGY I","Grad","https://secure.oregonstate.edu/ap/cps/documents/view/120883","No Sustainability Content"]
[null,"AHE","AHE",523,"AHE 523","INSTRUCTIONAL TECHNOLOGY II","Grad","https://secure.oregonstate.edu/ap/cps/documents/view/120920","No Sustainability Content"]
[null,"AHE","AHE",524,"AHE 524","INSTRUCTIONAL TECHNOLOGY III","Grad","https://secure.oregonstate.edu/ap/cps/documents/view/120870","No Sustainability Content"]
[null,"AHE","AHE",525,"AHE 525","INSTRUCTIONAL TECHNOLOGY IV","Grad","https://secure.oregonstate.edu/ap/cps/documents/view/120871","No Sustainability Content"]
[null,"AHE","AHE",531,"AHE 531","INSTRUCTIONAL DESIGN","Grad","https://secure.oregonstate.edu/ap/cps/documents/view/122114","No Sustainability Content"]
[null,"AHE","AHE",532,"AHE 532","PROGRAM EVALUATION","Grad","https://secure.oregonstate.edu/ap/cps/documents/view/122116","No Sustainability Content"]
[null,"AHE","AHE",533,"AHE 533","NEEDS ASSESSMENT & RESEARCH","Grad","https://secure.oregonstate.edu/ap/cps/documents/view/103065","No Sustainability Content"]
[null,"AHE","AHE",547,"AHE 547","INSTRUCT STRAT FOR ADULT LEARN","Grad","https://secure.oregonstate.edu/ap/cps/documents/view/100696","No Sustainability Content"]
[null,"AHE","AHE",549,"AHE 549","ETHICAL & PROFESSIONAL ISSUES","Grad","https://secure.oregonstate.edu/ap/cps/documents/view/123270","No Sustainability Content"]
[null,"AHE","AHE",553,"AHE 553","ADULT LEARNING & DEVELOPMENT","Grad","https://secure.oregonstate.edu/ap/cps/documents/view/100095","No Sustainability Content"]
[null,"AHE","AHE",567,"AHE 567","LEADERSHIP DEVEL & HUMAN RELAT","Grad","https://secure.oregonstate.edu/ap/cps/documents/view/104330","No Sustainability Content"]
[null,"AHE","AHE",611,"AHE 611","QUANT ANALYSIS IN ED RES I","Grad","https://secure.oregonstate.edu/ap/cps/documents/view/118652","No Sustainability Content"]
[null,"AHE","AHE",615,"AHE 615","RESEARCH ISSUES","Grad","https://secure.oregonstate.edu/ap/cps/documents/view/98330","No Sustainability Content"]
[null,"AHE","AHE",616,"AHE 616","QUANTITATIVE ANALYSIS IN ED II","Grad","https://secure.oregonstate.edu/ap/cps/documents/view/122112","No Sustainability Content"]
[null,"AHE","AHE",618,{"$f":"TRIM(C1252)&\" \"&TRIM(D1252)","v":"AHE 618"},"QUALITATIVE ANALYSIS IN ED RES","Grad","https://secure.oregonstate.edu/ap/cps/documents/view/127022","No Sustainability Content"]
[null,"AHE","AHE",621,"AHE 621","LEADERSHIP IN STUDENT SERVICES","Grad","https://secure.oregonstate.edu/ap/cps/documents/view/122562","No Sustainability Content"]
[null,"AHE","AHE",640,"AHE 640","HIGHER ED ADMINISTRATION","Grad","https://secure.oregonstate.edu/ap/cps/documents/view/122276","No Sustainability Content"]
[null,"AHE","AHE",643,"AHE 643","ORGANIZATION THEORY-HIGHER ED","Grad","https://secure.oregonstate.edu/ap/cps/documents/view/9289","No Sustainability Content"]
[null,"AHE","AHE",654,"AHE 654","Instructional Leader II ","Grad","https://secure.oregonstate.edu/ap/cps/documents/view/9298","No Sustainability Content"]
[null,"AHE","AHE",672,"AHE 672","RESEARCH PERSP IN HIGHER ED","Grad","https://secure.oregonstate.edu/ap/cps/documents/view/122182","No Sustainability Content"]
[null,"AHE","AHE",674,"AHE 674","ADVANCED RESEARCH METHODS IN FOUR-YEAR HIGHER EDUCATION. (3 Credits)","Grad","https://secure.oregonstate.edu/ap/cps/documents/view/122190","No Sustainability Content"]
[null,"AHE","AHE",675,"AHE 675","FOUR-YEAR HIGHER EDUCATION RESEARCH ISSUES. (3 Credits)","Grad","https://secure.oregonstate.edu/ap/cps/documents/view/122189","No Sustainability Content"]
[null,"SWLF","AJ",311,"AJ 311","MEDIA STORYTELLING. (3 Credits)","Undergrad","https://secure.oregonstate.edu/ap/cps/documents/view/129584","No Sustainability Content"]
[null,"SWLF","AJ",312,"AJ 312","ADVANCED MEDIA STORYTELLING. (3 Credits)","Undergrad","https://secure.oregonstate.edu/ap/cps/documents/view/129585","No Sustainability Content"]
[null,"SWLF","AJ",313,"AJ 313","PROFESSIONAL PRACTICES IN APPLIED JOURNALISM. (3 Credits)","Undergrad","https://secure.oregonstate.edu/ap/cps/documents/view/130578","No Sustainability Content"]
[null,"SWLF","AJ",490,"AJ 490","MEDIA LAW AND ETHICS. (3 Credits)","Undergrad","https://secure.oregonstate.edu/ap/cps/documents/view/129589","No Sustainability Content"]
[null,"ALS","ALS",108,"ALS 108","ONLINE LEARNING SUCCESS","Undergrad","https://secure.oregonstate.edu/ap/cps/documents/view/112543","No Sustainability Content"]
[null,"ALS","ALS",109,"ALS 109","TRIO-SSS FY STUDENT SUCCESS","Undergrad","https://secure.oregonstate.edu/ap/cps/documents/view/120164","No Sustainability Content"]
[null,"ALS","ALS",140,"ALS 140","INTRO TO UNIV READ & WRITING","Undergrad","https://secure.oregonstate.edu/ap/cps/documents/view/126203","No Sustainability Content"]
[null,"ALS","ALS",143,{"$f":"TRIM(C1267)&\" \"&TRIM(D1267)","v":"ALS 143"},"INTO OSU BUS GRAD STU SUCCESS","Undergrad","https://secure.oregonstate.edu/ap/cps/documents/view/129409","No Sustainability Content"]
[null,"ALS","ALS",145,{"$f":"TRIM(C1268)&\" \"&TRIM(D1268)","v":"ALS 145"},"INTO OSU STEM GRAD STU SUCCESS","Undergrad","https://secure.oregonstate.edu/ap/cps/documents/view/129410","No Sustainability Content"]
[null,"ALS","ALS",150,"ALS 150","ACADEMIC READING & WRITING 5","Undergrad","https://secure.oregonstate.edu/ap/cps/documents/view/100587","No Sustainability Content"]
[null,"ALS","ALS",151,"ALS 151","ACADEMIC LISTENING & SPEAK 5","Undergrad","https://secure.oregonstate.edu/ap/cps/documents/view/100586","No Sustainability Content"]
[null,"ALS","ALS",161,"ALS 161","ACAD LISTENING & SPEAKING 6","Undergrad","https://secure.oregonstate.edu/ap/cps/documents/view/101181","No Sustainability Content"]
[null,"ALS","ALS",162,"ALS 162","INTO OSU READING & WRITING","Undergrad","https://secure.oregonstate.edu/ap/cps/documents/view/100588","No Sustainability Content"]
[null,"ALS","ALS",165,{"$f":"TRIM(C1273)&\" \"&TRIM(D1273)","v":"ALS 165"},"INTO OSU ACAD STEM LISTEN/SPK","Undergrad","https://secure.oregonstate.edu/ap/cps/documents/view/129471","No Sustainability Content"]
[null,"ALS","ALS",166,"ALS 166","INTO OSU ACADEMIC STEM READING AND WRITING. (3 Credits)","Undergrad","https://secure.oregonstate.edu/ap/cps/documents/view/129576","No Sustainability Content"]
[null,"ALS","ALS",173,{"$f":"TRIM(C1275)&\" \"&TRIM(D1275)","v":"ALS 173"},"INTO OSU ADV BUS LISTEN/SPEAK","Undergrad","https://secure.oregonstate.edu/ap/cps/documents/view/129573","No Sustainability Content"]
[null,"ALS","ALS",174,{"$f":"TRIM(C1276)&\" \"&TRIM(D1276)","v":"ALS 174"},"INTO OSU ADV BUS READ/WRITE","Undergrad","https://secure.oregonstate.edu/ap/cps/documents/view/129470","No Sustainability Content"]
[null,"ALS","ALS",176,{"$f":"TRIM(C1277)&\" \"&TRIM(D1277)","v":"ALS 176"},"INTO OSU ADV STEM READ/WRITE","Undergrad","https://secure.oregonstate.edu/ap/cps/documents/view/129457","No Sustainability Content"]
[null,"ALS","ALS",181,"ALS 181","INTO OSU ESL BRIDGE","Undergrad","https://secure.oregonstate.edu/ap/cps/documents/view/121020","No Sustainability Content"]
[null,"ALS","ALS",190,{"$f":"TRIM(C1279)&\" \"&TRIM(D1279)","v":"ALS 190"},"BEST ORIENTATION","Undergrad","https://secure.oregonstate.edu/ap/cps/documents/view/128708","No Sustainability Content"]
[null,"ALS","ALS",199,{"$f":"TRIM(C1280)&\" \"&TRIM(D1280)","v":"ALS 199"},"SPECIAL TOPICS","Undergrad","https://secure.oregonstate.edu/ap/cps/documents/view/114962","No Sustainability Content"]
[null,"ALS","ALS",277,{"$f":"TRIM(C1281)&\" \"&TRIM(D1281)","v":"ALS 277"},"SUPPLEMENTAL INSTRUCT PEDAGOGY","Undergrad","https://secure.oregonstate.edu/ap/cps/documents/view/126987","No Sustainability Content"]
[null,"ALS","ALS",298,"ALS 298","AVOIDING PLAGIARISM",{"$f":"IF(D1282>499,\"Grad\", \"Undergrad\")","v":"Undergrad"},"https://secure.oregonstate.edu/ap/cps/documents/view/125999","No Sustainability Content"]
[null,"ALS","ALS",299,"ALS 299","SPECIAL TOPICS","Undergrad","https://secure.oregonstate.edu/ap/cps/documents/view/114962","No Sustainability Content"]
[null,"AMS","AMS",311,"AMS 311","TOPICS IN AMERICAN STUDIES. (4 Credits)","Undergrad","https://secure.oregonstate.edu/ap/cps/documents/view/101005","No Sustainability Content"]
[null,"AMS","AMS",350,"AMS 350","*VIETNAM EXPERIENCE","Undergrad","https://secure.oregonstate.edu/ap/cps/documents/view/108250","No Sustainability Content"]
[null,"AMS","AMS",406,"AMS 406","PROJECTS. (1-16 Credits)","Undergrad","https://secure.oregonstate.edu/ap/cps/documents/view/116623","Unavailable syllabus"]
[null,"ANRS","ANS",207,"ANS 207","SOPHOMORE SEMINAR","Undergrad","https://secure.oregonstate.edu/ap/cps/documents/view/124447","No Sustainability Content"]
[null,"ANRS","ANS",231,"ANS 231","LIVESTOCK EVALUATION","Undergrad","https://secure.oregonstate.edu/ap/cps/documents/view/123413","No Sustainability Content"]
[null,"ANRS","ANS",280,{"$f":"TRIM(C1289)&\" \"&TRIM(D1289)","v":"ANS 280"},"COMPANION ANIMAL MANAGEMENT","Undergrad","https://secure.oregonstate.edu/ap/cps/documents/view/129029","No Sustainability Content"]
[null,"ANRS","ANS",302,"ANS 302","COMMON DISEASES COMP ANIMALS","Undergrad","https://secure.oregonstate.edu/ap/cps/documents/view/116673","No Sustainability Content"]
[null,"ANRS","ANS",320,"ANS 320","PRIN OF COMPANION ANIMAL NUTR","Undergrad","https://secure.oregonstate.edu/ap/cps/documents/view/110931","No Sustainability Content"]
[null,"ANRS","ANS",335,"ANS 335","EQUINE HEALTH AND DISEASE","Undergrad","https://secure.oregonstate.edu/ap/cps/documents/view/109218","No Sustainability Content"]
[null,"ANRS","ANS",341,"ANS 341","ANIMAL BEHAVIOR AND COGNITION","Undergrad","https://secure.oregonstate.edu/ap/cps/documents/view/123294","No Sustainability Content"]
[null,"ANRS","ANS",380,{"$f":"TRIM(C1294)&\" \"&TRIM(D1294)","v":"ANS 380"},"PRIN ANIMAL ANATOMY & PHYSIOL","Undergrad","https://secure.oregonstate.edu/ap/cps/documents/view/127275","No Sustainability Content"]
[null,"ANRS","ANS",385,"ANS 385","FOUND OF MAMMALIAN HISTOLOGY","Undergrad","https://secure.oregonstate.edu/ap/cps/documents/view/123529","No Sustainability Content"]
[null,"ANRS","ANS",390,"ANS 390","GROSS ANATOMY OF DOM. ANIMAL","Undergrad","https://secure.oregonstate.edu/ap/cps/documents/view/121221","No Sustainability Content"]
[null,"ANRS","ANS",430,"ANS 430","EQUINE SYS I: EXERCISE SCIENCE","Undergrad","https://catalog.oregonstate.edu/search/?P=ANS%20430","No Sustainability Content"]
[null,"ANRS","ANS",441,"ANS 441","TOPICS IN ANIMAL LEARNING","Undergrad","https://catalog.oregonstate.edu/search/?P=ANS%20441","No Sustainability Content"]
[null,"ANRS","ANS",443,"ANS 443","BEEF PRODUCTION SYSTEMS: COW/CALF. (4 Credits)","Undergrad","https://secure.oregonstate.edu/ap/cps/documents/view/131974","No Sustainability Content"]
[null,"ANRS","ANS",444,"ANS 444","BEEF PRODUCTION SYSTEMS: STOCKER/FEEDLOT. (4 Credits)","Undergrad","https://secure.oregonstate.edu/ap/cps/documents/view/132852","No Sustainability Content"]
[null,"ANRS","ANS",445,"ANS 445","BEEF PRODUCTION SYSTEMS","Undergrad","https://catalog.oregonstate.edu/search/?P=ANS%20445","No Sustainability Content"]
[null,"ANRS","ANS",446,"ANS 446","GRAZING LIVESTOCK PRODUCTION","Undergrad","https://secure.oregonstate.edu/ap/cps/documents/view/125855","No Sustainability Content"]
[null,"ANRS","ANS",456,"ANS 456","COMPANION ANIMAL PROD SYSTEMS","Undergrad","https://catalog.oregonstate.edu/search/?P=ANS%20456","No Sustainability Content"]
[null,"ANRS","ANS",495,"ANS 495","Physiological Chemistry","Undergrad","https://secure.oregonstate.edu/ap/cps/documents/view/109069","No Sustainability Content"]
[null,"ANRS","ANS",530,"ANS 530","EQUINE SYS I: EXERCISE SCIENCE","Grad","https://catalog.oregonstate.edu/search/?P=ANS%20530","No Sustainability Content"]
[null,"ANRS","ANS",541,"ANS 541","TOPICS IN ANIMAL LEARNING","Grad","https://catalog.oregonstate.edu/search/?P=ANS%20541","No Sustainability Content"]
[null,"ANRS","ANS",545,"ANS 545","BEEF PRODUCTION SYSTEMS","Grad","https://catalog.oregonstate.edu/search/?P=ANS%20545","No Sustainability Content"]
[null,"ANRS","ANS",556,"ANS 556","COMPANION ANIMAL PROD SYSTEMS","Grad","https://catalog.oregonstate.edu/search/?P=ANS%20556","No Sustainability Content"]
[null,"SLCS","ANTH",101,"ANTH 101","*INTRODUCTION TO ANTHROPOLOGY","Undergrad","https://secure.oregonstate.edu/ap/cps/documents/view/125026","No Sustainability Content"]
[null,"SLCS","ANTH",159,"ANTH 159","*LANGUAGE, RACE AND RACISM IN THE US: AN INTRODUCTION. (4 Credits)","Undergrad","https://secure.oregonstate.edu/ap/cps/documents/view/123546","No Sustainability Content"]
[null,"SLCS","ANTH",240,"ANTH 240","INTRO TO BIOLOGICAL ANTHRO","Undergrad","https://secure.oregonstate.edu/ap/cps/documents/view/7621","No Sustainability Content"]
[null,"SLCS","ANTH",284,"ANTH 284","*PRIMATE ADAPTATION & EVOLUTIO","Undergrad","https://secure.oregonstate.edu/ap/cps/documents/view/123326","No Sustainability Content"]
[null,"SLCS","ANTH",331,"ANTH 331","MESOAMERICAN PREHISTORY. (3 Credits)","Undergrad","https://secure.oregonstate.edu/ap/cps/documents/view/101419","No Sustainability Content"]
[null,"SLCS","ANTH",332,"ANTH 332","ARCHAEOLOGICAL INFERENCE","Undergrad","https://secure.oregonstate.edu/ap/cps/documents/view/119090","No Sustainability Content"]
[null,"SLCS","ANTH",350,"ANTH 350","LANGUAGE, CULTURE AND SOCIETY","Undergrad","https://secure.oregonstate.edu/ap/cps/documents/view/6469","No Sustainability Content"]
[null,"SLCS","ANTH",370,"ANTH 370","^ANTHROPOLOGICAL THEORIES","Undergrad","https://secure.oregonstate.edu/ap/cps/documents/view/113146","No Sustainability Content"]
[null,"SLCS","ANTH",383,"ANTH 383","*INTRO TO MEDICAL ANTHROPOLOGY","Undergrad","https://secure.oregonstate.edu/ap/cps/documents/view/8403","No Sustainability Content"]
[null,"SLCS","ANTH",421,"ANTH 421","ANALYSIS OF LITHIC TECHNOLOGIES. (4 Credits)","Undergrad","https://catalog.oregonstate.edu/search/?P=ANTH%20421","No Sustainability Content"]
[null,"SLCS","ANTH",422,"ANTH 422","HISTORIC MATERIALS ANALYSIS","Undergrad","https://catalog.oregonstate.edu/search/?P=ANTH%20422","No Sustainability Content"]
[null,"SLCS","ANTH",423,"ANTH 423","METHOD AND THEORY IN HISTORICAL ARCHAEOLOGY. (4 Credits)","Undergrad","https://secure.oregonstate.edu/ap/cps/documents/view/94360","No Sustainability Content"]
[null,"SLCS","ANTH",424,"ANTH 424","SETTLEMENT ARCHAEOLOGY. (4 Credits)","Undergrad","https://secure.oregonstate.edu/ap/cps/documents/view/9070","No Sustainability Content"]
[null,"SLCS","ANTH",425,"ANTH 425","CERAMIC ANALYSIS IN ARCHAEOLOGY. (4 Credits)","Undergrad","https://secure.oregonstate.edu/ap/cps/documents/view/101344","No Sustainability Content"]
[null,"SLCS","ANTH",432,{"$f":"TRIM(C1323)&\" \"&TRIM(D1323)","v":"ANTH 432"},"*DOMESTICATION & URBANIZATION","Undergrad","https://secure.oregonstate.edu/ap/cps/documents/view/126696","No Sustainability Content"]
[null,"SLCS","ANTH",433,{"$f":"TRIM(C1324)&\" \"&TRIM(D1324)","v":"ANTH 433"},"FIRST AMERICANS/LAST FRONTIERS","Undergrad","https://secure.oregonstate.edu/ap/cps/documents/view/127178","No Sustainability Content"]
[null,"SLCS","ANTH",435,"ANTH 435","CULT RESOURCES: POLICY & PROCS","Undergrad","https://catalog.oregonstate.edu/search/?P=ANTH%20435","No Sustainability Content"]
[null,"SLCS","ANTH",437,"ANTH 437","GEOARCHAEOLOGY","Undergrad","https://catalog.oregonstate.edu/search/?P=ANTH%20437","No Sustainability Content"]
[null,"SLCS","ANTH",439,"ANTH 439","ARCHAEOLOGY OF FORAGERS. (4 Credits)","Undergrad","https://catalog.oregonstate.edu/search/?P=ANTH%20439","No Sustainability Content"]
[null,"SLCS","ANTH",441,"ANTH 441","HUMAN EVOLUTION","Undergrad","https://secure.oregonstate.edu/ap/cps/documents/view/8355","No Sustainability Content"]
[null,"SLCS","ANTH",443,"ANTH 443","HUMAN OSTEOLOGY LAB","Undergrad","https://catalog.oregonstate.edu/search/?P=ANTH%20443","No Sustainability Content"]
[null,"SLCS","ANTH",446,"ANTH 446","FORENSIC ANTHROPOLOGY. (4 Credits)","Undergrad","https://catalog.oregonstate.edu/search/?P=ANTH%20446","No Sustainability Content"]
[null,"SLCS","ANTH",452,"ANTH 452","FOLKLORE & EXPRESSIVE CULTURE","Undergrad","https://catalog.oregonstate.edu/search/?P=ANTH%20452","No Sustainability Content"]
[null,"SLCS","ANTH",459,"ANTH 459","ADV STUDY LANG/RACE/RACISM IN","Undergrad","https://catalog.oregonstate.edu/search/?P=ANTH%20459","No Sustainability Content"]
[null,"SLCS","ANTH",463,"ANTH 463","ANTHROPOLOGICAL RESEARCH: PROFESSIONAL AND ETHICAL CONDUCT. (4 Credits)","Undergrad","https://catalog.oregonstate.edu/search/?P=ANTH%20463","No Sustainability Content"]
[null,"SLCS","ANTH",465,"ANTH 465","POPULAR CULTURE: AN ANTHROPOLOGICAL PERSPECTIVE. (4 Credits)","Undergrad","https://catalog.oregonstate.edu/search/?P=ANTH%20465","No Sustainability Content"]
[null,"SLCS","ANTH",473,"ANTH 473","*GENDER, ETHNICITY, & CULTURE","Undergrad","https://secure.oregonstate.edu/ap/cps/documents/view/112308","No Sustainability Content"]
[null,"SLCS","ANTH",474,"ANTH 474","CROSS-CULTURAL HEALTH AND HEALING. (4 Credits)","Undergrad","https://catalog.oregonstate.edu/search/?P=ANTH%20474","No Sustainability Content"]
[null,"SLCS","ANTH",475,"ANTH 475","ANTHROPOLOGY IN PRACTICE","Undergrad","https://secure.oregonstate.edu/ap/cps/documents/view/118377","No Sustainability Content"]
[null,"SLCS","ANTH",479,"ANTH 479","ANTHROPOLOGY OF MIGRATION. (4 Credits)","Undergrad","https://catalog.oregonstate.edu/search/?P=ANTH%20479","No Sustainability Content"]
[null,"SLCS","ANTH",483,"ANTH 483","ADVANCED MEDICAL ANTHROPOLOGY. (4 Credits)","Undergrad","https://catalog.oregonstate.edu/search/?P=ANTH%20483","No Sustainability Content"]
[null,"SLCS","ANTH",494,"ANTH 494","LINGUISTIC ANTHROPOLOGY LAB","Undergrad","https://secure.oregonstate.edu/ap/cps/documents/view/7780","No Sustainability Content"]
[null,"SLCS","ANTH",498,{"$f":"TRIM(C1341)&\" \"&TRIM(D1341)","v":"ANTH 498"},"ORAL NARRATIVE","Undergrad","https://secure.oregonstate.edu/ap/cps/documents/view/130986","No Sustainability Content"]
[null,"SLCS","ANTH",515,{"$f":"TRIM(C1342)&\" \"&TRIM(D1342)","v":"ANTH 515"},"ADV RESEARCH LITERATURE REVIEW","Grad","https://secure.oregonstate.edu/ap/cps/documents/view/130000","No Sustainability Content"]
[null,"SLCS","ANTH",521,"ANTH 521","ANALYSIS OF LITHIC TECHNOLOGIES. (4 Credits)","Grad","https://catalog.oregonstate.edu/search/?P=ANTH%20521","No Sustainability Content"]
[null,"SLCS","ANTH",522,"ANTH 522","HISTORIC MATERIALS ANALYSIS","Grad","https://catalog.oregonstate.edu/search/?P=ANTH%20522","No Sustainability Content"]
[null,"SLCS","ANTH",523,"ANTH 523","METHOD AND THEORY IN HISTORICAL ARCHAEOLOGY. (4 Credits)","Grad","https://secure.oregonstate.edu/ap/cps/documents/view/126839","No Sustainability Content"]
[null,"SLCS","ANTH",525,"ANTH 525","CERAMIC ANALYSIS IN ARCHAEOLOGY. (4 Credits)",{"$f":"IF(D1346>499,\"Grad\", \"Undergrad\")","v":"Grad"},"https://secure.oregonstate.edu/ap/cps/documents/view/126877","No Sustainability Content"]
[null,"SLCS","ANTH",531,"ANTH 531","ARCHAEOLOGICAL THEORY. (4 Credits)","Grad","https://secure.oregonstate.edu/ap/cps/documents/view/122936","No Sustainability Content"]
[null,"SLCS","ANTH",533,"ANTH 533","FIRST AMERICANS, LAST FRONTIERS. (4 Credits)","Grad","https://secure.oregonstate.edu/ap/cps/documents/view/127178","No Sustainability Content"]
[null,"SLCS","ANTH",535,"ANTH 535","CULT RESOURCES: POLICY & PROCS","Grad","https://catalog.oregonstate.edu/search/?P=ANTH%20535","No Sustainability Content"]
[null,"SLCS","ANTH",537,"ANTH 537","GEOARCHAEOLOGY","Grad","https://catalog.oregonstate.edu/search/?P=ANTH%20537","No Sustainability Content"]
[null,"SLCS","ANTH",539,"ANTH 539","ARCHAEOLOGY OF FORAGERS. (4 Credits)","Grad","https://catalog.oregonstate.edu/search/?P=ANTH%20539","No Sustainability Content"]
[null,"SLCS","ANTH",543,"ANTH 543","HUMAN OSTEOLOGY LAB","Grad","https://catalog.oregonstate.edu/search/?P=ANTH%20543","No Sustainability Content"]
[null,"SLCS","ANTH",546,"ANTH 546","FORENSIC ANTHROPOLOGY. (4 Credits)","Grad","https://catalog.oregonstate.edu/search/?P=ANTH%20546","No Sustainability Content"]
[null,"SLCS","ANTH",551,"ANTH 551","LINGUISTIC ANTHROPOLOGY. (4 Credits)","Grad","https://secure.oregonstate.edu/ap/cps/documents/view/6472","No Sustainability Content"]
[null,"SLCS","ANTH",552,"ANTH 552","FOLKLORE AND EXPRESSIVE CULTURE. (4 Credits)","Grad","https://catalog.oregonstate.edu/search/?P=ANTH%20552","No Sustainability Content"]
[null,"SLCS","ANTH",556,"ANTH 556","SOCIAL NETWORK ANALYSIS: METHODS AND THEORY. (4 Credits)","Grad","https://secure.oregonstate.edu/ap/cps/documents/view/123978","No Sustainability Content"]
[null,"SLCS","ANTH",559,"ANTH 559","ADV STUDY LANG/RACE/RACISM IN","Grad","https://catalog.oregonstate.edu/search/?P=ANTH%20559","No Sustainability Content"]
[null,"SLCS","ANTH",563,"ANTH 563","ANTHROPOLOGICAL RESEARCH: PROFESSIONAL AND ETHICAL CONDUCT. (4 Credits)","Grad","https://catalog.oregonstate.edu/search/?P=ANTH%20563","No Sustainability Content"]
[null,"SLCS","ANTH",565,"ANTH 565","POPULAR CULTURE: AN ANTHROPOLOGICAL PERSPECTIVE. (4 Credits)","Grad","https://catalog.oregonstate.edu/search/?P=ANTH%20565","No Sustainability Content"]
[null,"SLCS","ANTH",573,"ANTH 573","GENDER, ETHNICITY, AND CULTURE. (4 Credits)","Grad","https://secure.oregonstate.edu/ap/cps/documents/view/125312","No Sustainability Content"]
[null,"SLCS","ANTH",574,"ANTH 574","CROSS-CULTURAL HEALTH AND HEALING. (4 Credits)","Grad","https://catalog.oregonstate.edu/search/?P=ANTH%20574","No Sustainability Content"]
[null,"SLCS","ANTH",579,"ANTH 579","ANTHROPOLOGY OF MIGRATION. (4 Credits)","Grad","https://catalog.oregonstate.edu/search/?P=ANTH%20579","No Sustainability Content"]
[null,"SLCS","ANTH",583,"ANTH 583","ADVANCED MEDICAL ANTHROPOLOGY","Grad","https://catalog.oregonstate.edu/search/?P=ANTH%20583","No Sustainability Content"]
[null,"SLCS","ANTH",593,"ANTH 593","STATISTIC APPLICATIONS IN ANTH","Grad","https://secure.oregonstate.edu/ap/cps/documents/view/116210","No Sustainability Content"]
[null,"SLCS","ANTH",594,"ANTH 594","LINGUISTIC ANTHROPOLOGY LAB. (1-3 Credits)","Grad","https://catalog.oregonstate.edu/search/?P=ANTH%20594","No Sustainability Content"]
[null,"SLCS","ANTH",595,"ANTH 595","ANTHROPOLOGIC RESEARCH DESIGN","Grad","https://secure.oregonstate.edu/ap/cps/documents/view/6710","No Sustainability Content"]
[null,"SLCS","ANTH",598,{"$f":"TRIM(C1367)&\" \"&TRIM(D1367)","v":"ANTH 598"},"ORAL TRADITIONS","Grad","https://secure.oregonstate.edu/ap/cps/documents/view/130986","No Sustainability Content"]
[null,"SLCS","ANTH",695,"ANTH 695","ANTHROPOLOGIC RESEARCH DESIGN","Grad","https://secure.oregonstate.edu/ap/cps/documents/view/124165","No Sustainability Content"]
[null,"AG","ARE",352,"ARE 352","Design of Electrical and Illumination Systems for Buildings","Undergrad","https://secure.oregonstate.edu/ap/cps/documents/view/130022","No Sustainability Content"]
[null,"AG","ARE",353,"ARE 353","Design of HVAC Systems for Buildings","Undergrad","https://secure.oregonstate.edu/ap/cps/documents/view/129073","No Sustainability Content"]
[null,"AG","ARE",451,"ARE 451","Advanced Building Construction Methods","Undergrad","https://secure.oregonstate.edu/ap/cps/documents/view/129774","No Sustainability Content"]
[null,"SAC","ART",101,{"$f":"TRIM(C1372)&\" \"&TRIM(D1372)","v":"ART 101"},"*INTRO TO THE VISUAL ARTS","Undergrad","https://secure.oregonstate.edu/ap/cps/documents/view/133072","No Sustainability Content"]
[null,"SAC","ART",115,{"$f":"TRIM(C1373)&\" \"&TRIM(D1373)","v":"ART 115"},"2-D CORE STUDIO","Undergrad","https://secure.oregonstate.edu/ap/cps/documents/view/131358","No Sustainability Content"]
[null,"SAC","ART",117,{"$f":"TRIM(C1374)&\" \"&TRIM(D1374)","v":"ART 117"},"3-D CORE STUDIO","Undergrad","https://secure.oregonstate.edu/ap/cps/documents/view/133928","No Sustainability Content"]
[null,"SAC","ART",121,"ART 121","DIGITAL CORE STUDIO","Undergrad","https://secure.oregonstate.edu/ap/cps/documents/view/125005","No Sustainability Content"]
[null,"SAC","ART",131,"ART 131","DRAWING CORE STUDIO","Undergrad","https://secure.oregonstate.edu/ap/cps/documents/view/4634","No Sustainability Content"]
[null,"SAC","ART",204,{"$f":"TRIM(C1377)&\" \"&TRIM(D1377)","v":"ART 204"},"*WSTRN ART: PREHISTRY-11TH CEN","Undergrad","https://secure.oregonstate.edu/ap/cps/documents/view/128974 ","No Sustainability Content"]
[null,"SAC","ART",205,{"$f":"TRIM(C1378)&\" \"&TRIM(D1378)","v":"ART 205"},"*WESTERN ART: 12TH-17TH CENT","Undergrad","https://secure.oregonstate.edu/ap/cps/documents/view/130441","No Sustainability Content"]
[null,"SAC","ART",206,{"$f":"TRIM(C1379)&\" \"&TRIM(D1379)","v":"ART 206"},"*WSTRN ART: 18TH-21ST CEN","Undergrad","https://secure.oregonstate.edu/ap/cps/documents/view/128970 Ecampus https://secure.oregonstate.edu/ap/cps/documents/view/128980","Unavailable syllabus"]
[null,"SAC","ART",208,"ART 208","*INTRODUCTION TO ASIAN ART","Undergrad","https://secure.oregonstate.edu/ap/cps/documents/view/106178","No Sustainability Content"]
[null,"SAC","ART",210,"ART 210","*HISTORY WESTERN ARCHITECTURE","Undergrad","https://secure.oregonstate.edu/ap/cps/documents/view/122807","No Sustainability Content"]
[null,"SAC","ART",211,"ART 211","WOODTURNING WITH SCIENCE I. (4 Credits)","Undergrad","https://secure.oregonstate.edu/ap/cps/documents/view/128240","No Sustainability Content"]
[null,"SAC","ART",215,"ART 215","COLOR IN THE VISUAL ARTS","Undergrad","https://secure.oregonstate.edu/ap/cps/documents/view/6613","No Sustainability Content"]
[null,"SAC","ART",222,"ART 222","INTRODUCTION TO TIME-BASED ART","Undergrad","https://secure.oregonstate.edu/ap/cps/documents/view/125008","No Sustainability Content"]
[null,"SAC","ART",263,"ART 263","DIGITAL PHOTOGRAPHY","Undergrad","https://secure.oregonstate.edu/ap/cps/documents/view/7463","No Sustainability Content"]
[null,"SAC","ART",271,"ART 271","PRINTMAKING I","Undergrad","https://secure.oregonstate.edu/ap/cps/documents/view/104083","No Sustainability Content"]
[null,"SAC","ART",291,"ART 291","SCULPTURE I","Undergrad","https://secure.oregonstate.edu/ap/cps/documents/view/6004","No Sustainability Content"]
[null,"SAC","ART",311,"ART 311","*LATE CHINESE ART AND CULTURE","Undergrad","https://secure.oregonstate.edu/ap/cps/documents/view/115821","No Sustainability Content"]
[null,"SAC","ART",312,"ART 312","*CONTEMPORARY CHINESE ART","Undergrad","https://secure.oregonstate.edu/ap/cps/documents/view/118940","No Sustainability Content"]
[null,"SAC","ART",320,"ART 320","*ANCIENT GREEK ART. (3 Credits)","Undergrad","https://secure.oregonstate.edu/ap/cps/documents/view/121905","No Sustainability Content"]
[null,"SAC","ART",321,"ART 321","*ANCIENT ROMAN ART","Undergrad","https://secure.oregonstate.edu/ap/cps/documents/view/122748","No Sustainability Content"]
[null,"SAC","ART",322,"ART 322","*MEDIEVAL ART AND ARCHITECTURE","Undergrad","https://secure.oregonstate.edu/ap/cps/documents/view/123131","No Sustainability Content"]
[null,"SAC","ART",323,"ART 323","*ITALIAN RENAISSANCE ART","Undergrad","https://secure.oregonstate.edu/ap/cps/documents/view/122761","No Sustainability Content"]
[null,"SAC","ART",331,{"$f":"TRIM(C1394)&\" \"&TRIM(D1394)","v":"ART 331"},"DRAWING CONCEPTS","Undergrad","https://secure.oregonstate.edu/ap/cps/documents/view/131901","No Sustainability Content"]
[null,"SAC","ART",339,"ART 339","PROFESSIONAL PRACTICES FOR ARTISTS. (3 Credits)","Undergrad","https://secure.oregonstate.edu/ap/cps/documents/view/114083","No Sustainability Content"]
[null,"SAC","ART",340,"ART 340","DARKROOM PHOTOGRAPHY I","Undergrad","https://secure.oregonstate.edu/ap/cps/documents/view/111045","No Sustainability Content"]
[null,"SAC","ART",341,"ART 341","DARKROOM PHOTOGRAPHY II","Undergrad","https://secure.oregonstate.edu/ap/cps/documents/view/113984","No Sustainability Content"]
[null,"SAC","ART",345,"ART 345","INTERMEDIATE PHOTOGRAPHY","Undergrad","https://secure.oregonstate.edu/ap/cps/documents/view/111605","No Sustainability Content"]
[null,"SAC","ART",347,"ART 347","PHOTOGRAPH: STUDIO LIGHTING","Undergrad","https://secure.oregonstate.edu/ap/cps/documents/view/113038","No Sustainability Content"]
[null,"SAC","ART",348,"ART 348","CONCEPTS IN DIGITAL IMAGING","Undergrad","https://secure.oregonstate.edu/ap/cps/documents/view/113073","No Sustainability Content"]
[null,"SAC","ART",349,"ART 349","VIDEO ART","Undergrad","https://secure.oregonstate.edu/ap/cps/documents/view/118472","No Sustainability Content"]
[null,"SAC","ART",350,"ART 350","PHOTOGRAPHY ON ASSIGNMENT","Undergrad","https://secure.oregonstate.edu/ap/cps/documents/view/121692","No Sustainability Content"]
[null,"SAC","ART",354,"ART 354","ALTERNATIVE PROCESSES IN PHOTOGRAPHY. (4 Credits)","Undergrad","https://secure.oregonstate.edu/ap/cps/documents/view/114313","No Sustainability Content"]
[null,"SAC","ART",364,"ART 364","*NINETEENTH-CENTURY ART","Undergrad","https://secure.oregonstate.edu/ap/cps/documents/view/112364","No Sustainability Content"]
[null,"SAC","ART",365,"ART 365","*HIST OF MODERN ART 1900-1945","Undergrad","https://secure.oregonstate.edu/ap/cps/documents/view/112873","No Sustainability Content"]
[null,"SAC","ART",375,{"$f":"TRIM(C1406)&\" \"&TRIM(D1406)","v":"ART 375"},"PRINTMAKING: RELIEF","Undergrad","https://secure.oregonstate.edu/ap/cps/documents/view/130727","No Sustainability Content"]
[null,"SAC","ART",376,{"$f":"TRIM(C1407)&\" \"&TRIM(D1407)","v":"ART 376"},"PRINTMAKING: INTAGLIO","Undergrad","https://secure.oregonstate.edu/ap/cps/documents/view/130728","No Sustainability Content"]
[null,"SAC","ART",377,{"$f":"TRIM(C1408)&\" \"&TRIM(D1408)","v":"ART 377"},"PRINTMAKING: LITHOGRAPHY","Undergrad","https://secure.oregonstate.edu/ap/cps/documents/view/130726","No Sustainability Content"]
[null,"SAC","ART",378,{"$f":"TRIM(C1409)&\" \"&TRIM(D1409)","v":"ART 378"},"PRINTMAKING: MONOTYPE","Undergrad","https://secure.oregonstate.edu/ap/cps/documents/view/130723","No Sustainability Content"]
[null,"SAC","ART",379,"ART 379","PRINTMAKING: SCREEN PRINTING",{"$f":"IF(D1410>499,\"Grad\", \"Undergrad\")","v":"Undergrad"},"https://secure.oregonstate.edu/ap/cps/documents/view/4666","No Sustainability Content"]
[null,"SAC","ART",383,{"$f":"TRIM(C1411)&\" \"&TRIM(D1411)","v":"ART 383"},"PAINTING II: ABSTRACT & MULTIM","Undergrad","https://secure.oregonstate.edu/ap/cps/documents/view/133877","No Sustainability Content"]
[null,"SAC","ART",385,"ART 385","PAINTING II: ENCAUSTICS","Undergrad","https://secure.oregonstate.edu/ap/cps/documents/view/107396","No Sustainability Content"]
[null,"SAC","ART",386,"ART 386","A CULTURAL HISTORY OF AMERICAN ART AND LITERATURE: PART I. (4 Credits)","Undergrad","https://secure.oregonstate.edu/ap/cps/documents/view/8729","No Sustainability Content"]
[null,"SAC","ART",387,"ART 387","A CULTURAL HISTORY OF AMERICAN ART AND LITERATURE: PART II. (4 Credits)","Undergrad","https://secure.oregonstate.edu/ap/cps/documents/view/8730","No Sustainability Content"]
[null,"SAC","ART",388,"ART 388","A CULTURAL HISTORY OF AMERICAN ART AND LITERATURE: PART III. (4 Credits)","Undergrad","https://secure.oregonstate.edu/ap/cps/documents/view/8731","No Sustainability Content"]
[null,"SAC","ART",391,{"$f":"TRIM(C1416)&\" \"&TRIM(D1416)","v":"ART 391"},"SCULPTURE II","Undergrad","https://secure.oregonstate.edu/ap/cps/documents/view/133966","No Sustainability Content"]
[null,"SAC","ART",400,"ART 400","THE DISCERNING PEN: ART CRITICISM. (3 Credits)","Undergrad","https://secure.oregonstate.edu/ap/cps/documents/view/100884","No Sustainability Content"]
[null,"SAC","ART",409,"ART 409","PRACTICUM STUDENT MEDIA","Undergrad","https://secure.oregonstate.edu/ap/cps/documents/view/110893","No Sustainability Content"]
[null,"SAC","ART",411,{"$f":"TRIM(C1419)&\" \"&TRIM(D1419)","v":"ART 411"},"^ART IN CONTEXT","Undergrad","https://secure.oregonstate.edu/ap/cps/documents/view/132363","No Sustainability Content"]
[null,"SAC","ART",413,{"$f":"TRIM(C1420)&\" \"&TRIM(D1420)","v":"ART 413"},"WOODTURNING WITH SCIENCE II","Undergrad","https://secure.oregonstate.edu/ap/cps/documents/view/128343","No Sustainability Content"]
[null,"SAC","ART",441,"ART 441","PHOTOGRAPHY III","Undergrad","https://secure.oregonstate.edu/ap/cps/documents/view/113607","No Sustainability Content"]
[null,"SAC","ART",443,"ART 443","COMBINED MEDIA: PHOTO INSTALL","Undergrad","https://secure.oregonstate.edu/ap/cps/documents/view/122544","No Sustainability Content"]
[null,"SAC","ART",444,"ART 444","THE CONSTRUCTED IMAGE. (4 Credits)","Undergrad","https://secure.oregonstate.edu/ap/cps/documents/view/120254","No Sustainability Content"]
[null,"SAC","ART",446,"ART 446","DOCUMENTARY PHOTOGRAPHY","Undergrad","https://secure.oregonstate.edu/ap/cps/documents/view/120664","No Sustainability Content"]
[null,"SAC","ART",447,"ART 447","ADVANCED STUDIO LIGHTING","Undergrad","https://secure.oregonstate.edu/ap/cps/documents/view/122762","No Sustainability Content"]
[null,"SAC","ART",451,"ART 451","INTRO TO ARTS ENTREPRENEURSHIP","Undergrad","https://secure.oregonstate.edu/ap/cps/documents/view/119585","No Sustainability Content"]
[null,"SAC","ART",454,"ART 454","ALTERNATIVE PROCESSES IN PHOTOGRAPHY II. (4 Credits)","Undergrad","https://secure.oregonstate.edu/ap/cps/documents/view/121689","No Sustainability Content"]
[null,"SAC","ART",456,"ART 456","PORTFOLIO-PHOTO/VIDEO ART","Undergrad","https://catalog.oregonstate.edu/search/?P=ART%20456","No Sustainability Content"]
[null,"SAC","ART",464,"ART 464","CULTURAL STUDIES OF THE MUSEUM. (3 Credits)","Undergrad","https://catalog.oregonstate.edu/search/?P=ART%20464","No Sustainability Content"]
[null,"SAC","ART",468,"ART 468","HISTORY OF PRINTMAKING","Undergrad","https://secure.oregonstate.edu/ap/cps/documents/view/123726","No Sustainability Content"]
[null,"SAC","ART",475,{"$f":"TRIM(C1431)&\" \"&TRIM(D1431)","v":"ART 475"},"PRINTMAKING STUDIO","Undergrad","https://secure.oregonstate.edu/ap/cps/documents/view/130259","No Sustainability Content"]
[null,"SAC","ART",479,"ART 479","PRINTMAKING: ADV SCREEN PRINT","Undergrad","https://secure.oregonstate.edu/ap/cps/documents/view/7536","No Sustainability Content"]
[null,"SAC","ART",481,{"$f":"TRIM(C1433)&\" \"&TRIM(D1433)","v":"ART 481"},"PAINTING III","Undergrad","https://secure.oregonstate.edu/ap/cps/documents/view/131128","No Sustainability Content"]
[null,"SAC","ART",556,"ART 556","PORTFOLIO-PHOTO/VIDEO ART","Grad","https://catalog.oregonstate.edu/search/?P=ART%20556","No Sustainability Content"]
[null,"SAC","ART",564,"ART 564","CULTURAL STUDIES OF THE MUSEUM. (3 Credits)","Grad","https://catalog.oregonstate.edu/search/?P=ART%20564","No Sustainability Content"]
[null,"AERO","AS",111,"AS 111","FOUNDATIONS OF THE AIR FORCE I","Undergrad","https://secure.oregonstate.edu/ap/cps/documents/view/8517","No Sustainability Content"]
[null,"AERO","AS",112,"AS 112","FOUNDATIONS OF AIR FORCE II","Undergrad","https://secure.oregonstate.edu/ap/cps/documents/view/8518","No Sustainability Content"]
[null,"AERO","AS",211,"AS 211","EVOLUTION OF AIR & SPACE POWER","Undergrad","https://secure.oregonstate.edu/ap/cps/documents/view/8504","No Sustainability Content"]
[null,"AERO","AS",212,"AS 212","EVOLUTION OF AIR & SPACE POWER","Undergrad","https://secure.oregonstate.edu/ap/cps/documents/view/8503","No Sustainability Content"]
[null,"AERO","AS",213,"AS 213","EVOLUTION OF AIR & SPACE POWER","Undergrad","https://secure.oregonstate.edu/ap/cps/documents/view/8507","No Sustainability Content"]
[null,"AERO","AS",311,"AS 311","LEADERSHIP FUNDAMENTALS","Undergrad","https://secure.oregonstate.edu/ap/cps/documents/view/94480","No Sustainability Content"]
[null,"AERO","AS",312,"AS 312","SUPERVISION/GROUP CONFLICT MGT","Undergrad","https://secure.oregonstate.edu/ap/cps/documents/view/8509","No Sustainability Content"]
[null,"AERO","AS",411,"AS 411","NATIONAL SECURITY AFFAIRS","Undergrad","https://secure.oregonstate.edu/ap/cps/documents/view/8511","No Sustainability Content"]
[null,"AERO","AS",412,"AS 412","WORLD REGION CULTURAL STUDIES","Undergrad","https://secure.oregonstate.edu/ap/cps/documents/view/8513","No Sustainability Content"]
[null,"AERO","AS",413,"AS 413","PREPARATION FOR ACTIVE DUTY","Undergrad","https://secure.oregonstate.edu/ap/cps/documents/view/8519","No Sustainability Content"]
[null,"SLCS","ASL",111,"ASL 111","FIRST-YEAR AMERICAN SIGN LANG","Undergrad","https://secure.oregonstate.edu/ap/cps/documents/view/106719","No Sustainability Content"]
[null,"SLCS","ASL",112,"ASL 112","FIRST-YEAR AMERICAN SIGN LANG","Undergrad","https://secure.oregonstate.edu/ap/cps/documents/view/108359","No Sustainability Content"]
[null,"SLCS","ASL",113,"ASL 113","FIRST-YEAR AMERICAN SIGN LANG","Undergrad","https://secure.oregonstate.edu/ap/cps/documents/view/109169","No Sustainability Content"]
[null,"SLCS","ASL",211,"ASL 211","2ND YR AMERICAN SIGN LANGUAGE","Undergrad","https://secure.oregonstate.edu/ap/cps/documents/view/111877","No Sustainability Content"]
[null,"SLCS","ASL",212,"ASL 212","SECOND-YEAR AMERICAN SIGN LANG","Undergrad","https://secure.oregonstate.edu/ap/cps/documents/view/112418","No Sustainability Content"]
[null,"SLCS","ASL",213,"ASL 213","SECOND-YEAR AMERICAN SIGN LANG","Undergrad","https://secure.oregonstate.edu/ap/cps/documents/view/112415","No Sustainability Content"]
[null,"OC","ATS",310,"ATS 310","METEOROLOGY","Undergrad","https://secure.oregonstate.edu/ap/cps/documents/view/121523","No Sustainability Content"]
[null,"OC","ATS",417,{"$f":"TRIM(C1453)&\" \"&TRIM(D1453)","v":"ATS 417"},"WEATHER DYNAMICS & FORECASTING","Undergrad","https://secure.oregonstate.edu/ap/cps/documents/view/130058","No Sustainability Content"]
[null,"OC","ATS",464,"ATS 464","Vegetation and the Atmosphere","Undergrad","https://secure.oregonstate.edu/ap/cps/documents/view/6687","No Sustainability Content"]
[null,"OC","ATS",517,{"$f":"TRIM(C1455)&\" \"&TRIM(D1455)","v":"ATS 517"},"WEATHER DYNAMICS & FORECASTING","Grad","https://secure.oregonstate.edu/ap/cps/documents/view/130058","No Sustainability Content"]
[null,"BA","BA",101,"BA 101","BUSINESS NOW","Undergrad","https://secure.oregonstate.edu/ap/cps/documents/view/5600","No Sustainability Content"]
[null,"BA","BA",150,"BA 150","EXPLORING ENTREPRENEURSHIP","Undergrad","https://secure.oregonstate.edu/ap/cps/documents/view/10014","No Sustainability Content"]
[null,"BA","BA",160,"BA 160","B-ENGAGED","Undergrad","https://secure.oregonstate.edu/ap/cps/documents/view/122395","No Sustainability Content"]
[null,"BA","BA",161,"BA 161","AWARENESS TO ACTION","Undergrad","https://secure.oregonstate.edu/ap/cps/documents/view/123752","No Sustainability Content"]
[null,"BA","BA",162,"BA 162","INNOV NATION--IDEAS TO REALITY","Undergrad","https://secure.oregonstate.edu/ap/cps/documents/view/122399","No Sustainability Content"]
[null,"BA","BA",167,"BA 167","LAUNCH PAD I. (3 Credits)","Undergrad","https://secure.oregonstate.edu/ap/cps/documents/view/133667","No Sustainability Content"]
[null,"BA","BA",168,"BA 168","LAUNCH PAD II. (3 Credits)","Undergrad","https://secure.oregonstate.edu/ap/cps/documents/view/133668","No Sustainability Content"]
[null,"BA","BA",170,"BA 170","BUSINESS INSIGHTS. (2 Credits)","Undergrad","https://secure.oregonstate.edu/ap/cps/documents/view/124228","No Sustainability Content"]
[null,"BA","BA",182,"BA 182","FIRST-YEAR PERSONAL PROFESSIONAL LEADERSHIP DEVELOPMENT I. (1 Credit)","Undergrad","https://secure.oregonstate.edu/ap/cps/documents/view/130864 ","No Sustainability Content"]
[null,"BA","BA",183,"BA 183","FIRST YEAR PERSONAL PROFESSIONAL LEADERSHIP DEVELOPMENT II. (1 Credit)","Undergrad","https://secure.oregonstate.edu/ap/cps/documents/view/130865","No Sustainability Content"]
[null,"BA","BA",184,"BA 184","FIRST-YEAR PERSONAL PROFESSIONAL LEADERSHIP DEVELOPMENT III. (1 Credit)","Undergrad","https://secure.oregonstate.edu/ap/cps/documents/view/130535","No Sustainability Content"]
[null,"BA","BA",213,"BA 213","MANAGERIAL ACCOUNTING","Undergrad","https://secure.oregonstate.edu/ap/cps/documents/view/7775","No Sustainability Content"]
[null,"BA","BA",215,"BA 215","FUNDAMENTALS OF ACCOUNTING","Undergrad","https://secure.oregonstate.edu/ap/cps/documents/view/4580","No Sustainability Content"]
[null,"BA","BA",223,"BA 223","PRINCIPLES OF MARKETING. (4 Credits)","Undergrad","https://secure.oregonstate.edu/ap/cps/documents/view/132208","No Sustainability Content"]
[null,"BA","BA",240,"BA 240","FINANCE. (4 Credits)","Undergrad","https://secure.oregonstate.edu/ap/cps/documents/view/132209","No Sustainability Content"]
[null,"BA","BA",253,"BA 253","PROFESSIONAL DEVELOPMENT","Undergrad","https://secure.oregonstate.edu/ap/cps/documents/view/123695","No Sustainability Content"]
[null,"BA","BA",272,"BA 272","BUS APPLICATION DEVELOPMENT","Undergrad","https://secure.oregonstate.edu/ap/cps/documents/view/100624","No Sustainability Content"]
[null,"BA","BA",275,{"$f":"TRIM(C1473)&\" \"&TRIM(D1473)","v":"BA 275"},"FNDS OF STATISTICAL INFERENCE","Undergrad","https://secure.oregonstate.edu/ap/cps/documents/view/123699","No Sustainability Content"]
[null,"BA","BA",276,"BA 276","INTRO TO STATISTICAL INFERENCE",{"$f":"IF(D1474>499,\"Grad\", \"Undergrad\")","v":"Undergrad"},"https://secure.oregonstate.edu/ap/cps/documents/view/7595","No Sustainability Content"]
[null,"BA","BA",280,{"$f":"TRIM(C1475)&\" \"&TRIM(D1475)","v":"BA 280"},"BUSINESS INSIGHTS","Undergrad","https://secure.oregonstate.edu/ap/cps/documents/view/128229","No Sustainability Content"]
[null,"BA","BA",281,{"$f":"TRIM(C1476)&\" \"&TRIM(D1476)","v":"BA 281"},"PROFESSIONAL DEVELOPMENT","Undergrad","https://secure.oregonstate.edu/ap/cps/documents/view/128277","No Sustainability Content"]
[null,"BA","BA",282,{"$f":"TRIM(C1477)&\" \"&TRIM(D1477)","v":"BA 282"},"PPL DEVELOPMENT I","Undergrad","https://secure.oregonstate.edu/ap/cps/documents/view/128713","No Sustainability Content"]
[null,"BA","BA",283,{"$f":"TRIM(C1478)&\" \"&TRIM(D1478)","v":"BA 283"},"PPL DEVELOPMENT II","Undergrad","https://secure.oregonstate.edu/ap/cps/documents/view/128715","No Sustainability Content"]
[null,"BA","BA",290,{"$f":"TRIM(C1479)&\" \"&TRIM(D1479)","v":"BA 290"},"INTRO TO CAREERS IN MARKETING","Undergrad","https://secure.oregonstate.edu/ap/cps/documents/view/127521","No Sustainability Content"]
[null,"BA","BA",311,"BA 311","THIRD-YEAR PERSONAL PROFESSIONAL LEADERSHIP DEVELOPMENT I. (1 Credit)","Undergrad","https://secure.oregonstate.edu/ap/cps/documents/view/133741","No Sustainability Content"]
[null,"BA","BA",312,"BA 312","THIRD YEAR PERSONAL PROFESSIONAL LEADERSHIP DEVELOPMENT II. (1 Credit)","Undergrad","https://secure.oregonstate.edu/ap/cps/documents/view/133742","No Sustainability Content"]
[null,"BA","BA",313,"BA 313","THIRD YEAR PERSONAL PROFESSIONAL LEADERSHIP DEVELOPMENT III. (1 Credit)","Undergrad","https://secure.oregonstate.edu/ap/cps/documents/view/133743","No Sustainability Content"]
[null,"BA","BA",315,"BA 315","ACCOUNTING FOR DECISION MAKING. (4 Credits)","Undergrad","https://secure.oregonstate.edu/ap/cps/documents/view/132803","No Sustainability Content"]
[null,"BA","BA",325,"BA 325","Introduction to Taxation","Undergrad","https://secure.oregonstate.edu/ap/cps/documents/view/6496","No Sustainability Content"]
[null,"BA","BA",333,"BA 333","LEGAL/ETHIC BUSINESS SOLUTIONS","Undergrad","https://secure.oregonstate.edu/ap/cps/documents/view/7238","No Sustainability Content"]
[null,"BA","BA",347,"BA 347","INTERNATIONAL BUSINESS","Undergrad","https://secure.oregonstate.edu/ap/cps/documents/view/7340","No Sustainability Content"]
[null,"BA","BA",351,"BA 351","MANAGING ORGANIZATIONS","Undergrad","https://secure.oregonstate.edu/ap/cps/documents/view/6138","No Sustainability Content"]
[null,"BA","BA",353,"BA 353","^PROFESSIONAL DEVELOPMENT","Undergrad","https://secure.oregonstate.edu/ap/cps/documents/view/8289","No Sustainability Content"]
[null,"BA","BA",357,"BA 357","OPERATIONS MANAGEMENT","Undergrad","https://secure.oregonstate.edu/ap/cps/documents/view/7240","No Sustainability Content"]
[null,"BA","BA",360,"BA 360","INTRO TO FINANCIAL MANAGEMENT","Undergrad","https://secure.oregonstate.edu/ap/cps/documents/view/101506","No Sustainability Content"]
[null,"BA","BA",363,"BA 363","TECHNOLOGY AND INNOVATION MGMT","Undergrad","https://secure.oregonstate.edu/ap/cps/documents/view/7924","No Sustainability Content"]
[null,"BA","BA",365,"BA 365","FAMILY BUSINESS MANAGEMENT","Undergrad","https://secure.oregonstate.edu/ap/cps/documents/view/10083","No Sustainability Content"]
[null,"BA","BA",367,"BA 367","LAUNCH ACADEMY. (3 Credits)","Undergrad","https://secure.oregonstate.edu/ap/cps/documents/view/133669","No Sustainability Content"]
[null,"BA","BA",368,"BA 368","ADVANCED LAUNCH ACADEMY. (1-3 Credits)","Undergrad","https://secure.oregonstate.edu/ap/cps/documents/view/133670","No Sustainability Content"]
[null,"BA","BA",370,"BA 370","BUSINESS INFO SYSTEMS OVERVIEW","Undergrad","https://secure.oregonstate.edu/ap/cps/documents/view/8479","No Sustainability Content"]
[null,"BA","BA",371,"BA 371","BUSINESS DATA MANAGEMENT","Undergrad","https://secure.oregonstate.edu/ap/cps/documents/view/116550","No Sustainability Content"]
[null,"BA","BA",372,"BA 372","BUS INFO SYSTEM DESIGN & DEVEL","Undergrad","https://secure.oregonstate.edu/ap/cps/documents/view/116557","No Sustainability Content"]
[null,"BA","BA",375,"BA 375","APPLIED QUANTITATIVE METHODS","Undergrad","https://secure.oregonstate.edu/ap/cps/documents/view/122427","No Sustainability Content"]
[null,"BA","BA",376,"BA 376","APPLIED QUANTITATIVE METHODS","Undergrad","https://secure.oregonstate.edu/ap/cps/documents/view/6318","No Sustainability Content"]
[null,"BA","BA",381,{"$f":"TRIM(C1500)&\" \"&TRIM(D1500)","v":"BA 381"},"PERSONAL & PROFESSIONAL DEVEL","Undergrad","https://secure.oregonstate.edu/ap/cps/documents/view/128228","No Sustainability Content"]
[null,"BA","BA",411,"BA 411","FOURTH YEAR PERSONAL PROFESSIONAL LEADERSHIP DEVELOPMENT I. (1 Credit)","Undergrad","https://secure.oregonstate.edu/ap/cps/documents/view/133744","No Sustainability Content"]
[null,"BA","BA",412,"BA 412","FOURTH YEAR PERSONAL PROFESSIONAL LEADERSHIP DEVELOPMENT II. (1 Credit)","Undergrad","https://secure.oregonstate.edu/ap/cps/documents/view/133747","No Sustainability Content"]
[null,"BA","BA",413,"BA 413","FOURTH YEAR PERSONAL PROFESSIONAL LEADERSHIP DEVELOPMENT III. (1 Credit)","Undergrad","https://secure.oregonstate.edu/ap/cps/documents/view/133746","No Sustainability Content"]
[null,"BA","BA",440,"BA 440","Corporate Finance","Undergrad","https://secure.oregonstate.edu/ap/cps/documents/view/7243","No Sustainability Content"]
[null,"BA","BA",454,"BA 454","LEAN ENTERPRISE MANAGEMENT AND CAPSTONE. (3 Credits)","Undergrad","https://secure.oregonstate.edu/ap/cps/documents/view/125316","No Sustainability Content"]
[null,"BA","BA",458,"BA 458","INNOVATION & NEW PRODUCT DEV","Undergrad","https://secure.oregonstate.edu/ap/cps/documents/view/10477","No Sustainability Content"]
[null,"BA","BA",459,"BA 459","SERVICE OPERATIONS MANAGEMENT. (3 Credits)","Undergrad","https://secure.oregonstate.edu/ap/cps/documents/view/125826","No Sustainability Content"]
[null,"BA","BA",460,"BA 460","VENTURE MANAGEMENT","Undergrad","https://secure.oregonstate.edu/ap/cps/documents/view/7915","No Sustainability Content"]
[null,"BA","BA",463,{"$f":"TRIM(C1509)&\" \"&TRIM(D1509)","v":"BA 463"},"FAMILY ENTERPRISE GOVERNANCE","Undergrad","https://secure.oregonstate.edu/ap/cps/documents/view/131035","No Sustainability Content"]
[null,"BA","BA",464,{"$f":"TRIM(C1510)&\" \"&TRIM(D1510)","v":"BA 464"},"NEW VENTURE FINANCING","Undergrad","https://secure.oregonstate.edu/ap/cps/documents/view/133086","No Sustainability Content"]
[null,"BA","BA",466,"BA 466","INTEGRATIVE STRATEGIC EXP","Undergrad","https://secure.oregonstate.edu/ap/cps/documents/view/8115","No Sustainability Content"]
[null,"BA","BA",478,"BA 478","SUPPLY CHAIN ANALYTICS. (3 Credits)","Undergrad","https://secure.oregonstate.edu/ap/cps/documents/view/125318","No Sustainability Content"]
[null,"BA","BA",479,"BA 479","BUSINE TELECOMM AND NETWORKING","Undergrad","https://secure.oregonstate.edu/ap/cps/documents/view/7283","No Sustainability Content"]
[null,"BA","BA",480,"BA 480","INFORMATION SYSTEMS SECURITY","Undergrad","https://secure.oregonstate.edu/ap/cps/documents/view/123926","No Sustainability Content"]
[null,"BA","BA",481,{"$f":"TRIM(C1515)&\" \"&TRIM(D1515)","v":"BA 481"},"INTRO TO BUSINESS ANALYTICS","Undergrad","https://secure.oregonstate.edu/ap/cps/documents/view/129190","No Sustainability Content"]
[null,"BA","BA",483,"BA 483","BUSINESS ANALYTICS","Undergrad","https://secure.oregonstate.edu/ap/cps/documents/view/113998","No Sustainability Content"]
[null,"BA","BA",487,"BA 487","HOSPITALITY FINANCIAL MGMT","Undergrad","https://secure.oregonstate.edu/ap/cps/documents/view/106564","No Sustainability Content"]
[null,"BA","BA",488,"BA 488","ADVANCED HOSPITALITY MANAGEMENT. (4 Credits)","Undergrad","https://secure.oregonstate.edu/ap/cps/documents/view/103818","No Sustainability Content"]
[null,"BA","BA",512,"BA 512","BUSINESS ANALYSIS AND COMM","Grad","https://secure.oregonstate.edu/ap/cps/documents/view/108980","No Sustainability Content"]
[null,"BA","BA",514,"BA 514","OPERATIONS MANAGEMENT","Grad","https://secure.oregonstate.edu/ap/cps/documents/view/125588","No Sustainability Content"]
[null,"BA","BA",515,"BA 515","MANAGERIAL DECISION TOOLS","Grad","https://secure.oregonstate.edu/ap/cps/documents/view/125368","No Sustainability Content"]
[null,"BA","BA",516,"BA 516","CREATING VALUE IN EXCHANGE","Grad","https://secure.oregonstate.edu/ap/cps/documents/view/125589","No Sustainability Content"]
[null,"BA","BA",517,"BA 517","MARKETS AND VALUATION","Grad","https://secure.oregonstate.edu/ap/cps/documents/view/125586","No Sustainability Content"]
[null,"BA","BA",518,"BA 518","ADOPTING THE ENTREPRENEURIAL MINDSET. (3 Credits)","Grad","https://secure.oregonstate.edu/ap/cps/documents/view/129721","No Sustainability Content"]
[null,"BA","BA",533,"BA 533","BUSINESS LAW FOR MANAGERS","Grad","https://secure.oregonstate.edu/ap/cps/documents/view/110990","No Sustainability Content"]
[null,"BA","BA",550,"BA 550","ORGANIZATION LEADERSHIP & MGMT","Grad","https://secure.oregonstate.edu/ap/cps/documents/view/113619","No Sustainability Content"]
[null,"BA","BA",554,"BA 554","LEAN ENTERPRISE MGT & CAPSTONE","Grad","https://secure.oregonstate.edu/ap/cps/documents/view/125809","No Sustainability Content"]
[null,"BA","BA",557,"BA 557","GLOBAL LOGISTICS MANAGEMENT","Grad","https://secure.oregonstate.edu/ap/cps/documents/view/117869","No Sustainability Content"]
[null,"BA","BA",559,"BA 559","SERVICE OPERATIONS MANAGEMENT. (3 Credits)","Grad","https://secure.oregonstate.edu/ap/cps/documents/view/130450","No Sustainability Content"]
[null,"BA","BA",560,"BA 560","VENTURE PLANNING","Grad","https://secure.oregonstate.edu/ap/cps/documents/view/102274","No Sustainability Content"]
[null,"BA","BA",563,{"$f":"TRIM(C1531)&\" \"&TRIM(D1531)","v":"BA 563"},"FAMILY ENTERPRISE GOVERNANCE","Grad","https://secure.oregonstate.edu/ap/cps/documents/view/131035","No Sustainability Content"]
[null,"BA","BA",570,"BA 570","INNOVATION STRATEGY, IP, & NPD","Grad","https://secure.oregonstate.edu/ap/cps/documents/view/125320","No Sustainability Content"]
[null,"BA","BA",573,"BA 573","DATA ANALYTICS FOR COMP ADV","Grad","https://secure.oregonstate.edu/ap/cps/documents/view/115070","No Sustainability Content"]
[null,"BA","BA",574,"BA 574","DATA MANAGEMENT","Grad","https://secure.oregonstate.edu/ap/cps/documents/view/115156","No Sustainability Content"]
[null,"BA","BA",575,"BA 575","DATA EXPLORATION AND VISUAL","Grad","https://secure.oregonstate.edu/ap/cps/documents/view/115078","No Sustainability Content"]
[null,"BA","BA",576,"BA 576","DATA AND TEXT MINING","Grad","https://secure.oregonstate.edu/ap/cps/documents/view/115073","No Sustainability Content"]
[null,"BA","BA",577,"BA 577","INTEGRATED BUS ANALYTICS PROJ","Grad","https://secure.oregonstate.edu/ap/cps/documents/view/115320","No Sustainability Content"]
[null,"BA","BA",578,"BA 578","SUPPLY CHAIN ANALYTICS",{"$f":"IF(D1538>499,\"Grad\", \"Undergrad\")","v":"Grad"},"https://secure.oregonstate.edu/ap/cps/documents/view/125595","No Sustainability Content"]
[null,"BA","BA",611,"BA 611","TEACHING EFFECTIVENESS. (1-6 Credits)","Grad","https://secure.oregonstate.edu/ap/cps/documents/view/114863","No Sustainability Content"]
[null,"BA","BA",612,"BA 612","FOUNDATIONS OF BUSINESS RESEARCH. (3 Credits)","Grad","https://secure.oregonstate.edu/ap/cps/documents/view/116015","No Sustainability Content"]
[null,"BA","BA",613,"BA 613","SEMINAR IN BUSINESS RESEARCH METHODS. (3 Credits)","Grad","https://secure.oregonstate.edu/ap/cps/documents/view/114864","No Sustainability Content"]
[null,"BA","BA",660,"BA 660","FOUNDATIONS OF ENTREPRENEURSHIP RESEARCH. (3 Credits)","Grad","https://secure.oregonstate.edu/ap/cps/documents/view/113535","No Sustainability Content"]
[null,"BA","BA",661,"BA 661","DOCTORAL SEMINAR IN ORGANIZATIONAL THEORY. (3 Credits)","Grad","https://secure.oregonstate.edu/ap/cps/documents/view/113536","No Sustainability Content"]
[null,"BA","BA",662,"BA 662","CORP ENTREPRENEUR NEW VENTURES","Grad","https://secure.oregonstate.edu/ap/cps/documents/view/113806","No Sustainability Content"]
[null,"BA","BA",663,"BA 663","STRATEGIC MANAGEMENT. (3 Credits)","Grad","https://secure.oregonstate.edu/ap/cps/documents/view/115166","No Sustainability Content"]
[null,"BA","BA",664,"BA 664","TECHNOLOGY & INNOVATION MGMT","Grad","https://secure.oregonstate.edu/ap/cps/documents/view/113484","No Sustainability Content"]
[null,"BB","BB",314,"BB 314","CELL AND MOLECULAR BIOLOGY","Undergrad","https://secure.oregonstate.edu/ap/cps/documents/view/117639","No Sustainability Content"]
[null,"BB","BB",315,"BB 315","MOLECULAR BIOLOGY LABORATORY","Undergrad","https://secure.oregonstate.edu/ap/cps/documents/view/118615","No Sustainability Content"]
[null,"BB","BB",360,{"$f":"TRIM(C1549)&\" \"&TRIM(D1549)","v":"BB 360"},"INTRODUCTION TO NEUROSCIENCE","Undergrad","https://secure.oregonstate.edu/ap/cps/documents/view/129096","No Sustainability Content"]
[null,"BB","BB",460,{"$f":"TRIM(C1550)&\" \"&TRIM(D1550)","v":"BB 460"},"ADVANCED CELL BIOLOGY","Undergrad","https://secure.oregonstate.edu/ap/cps/documents/view/126916 ","No Sustainability Content"]
[null,"BB","BB",481,"BB 481","MACROMOLECULAR STRUCTURE","Undergrad","https://catalog.oregonstate.edu/search/?P=BB%20481","No Sustainability Content"]
[null,"BB","BB",483,"BB 483","BIOCHEM & BIOPHYSICS CAPSTONE","Undergrad","https://catalog.oregonstate.edu/search/?P=BB%20483","No Sustainability Content"]
[null,"BB","BB",484,"BB 484","CHROMATIN AND EPIGENETICS. (3 Credits)","Undergrad","https://catalog.oregonstate.edu/search/?P=BB%20484","No Sustainability Content"]
[null,"BB","BB",485,"BB 485","APPLIED BIOINFORMATICS","Undergrad","https://catalog.oregonstate.edu/search/?P=BB%20485","No Sustainability Content"]
[null,"BB","BB",486,"BB 486","ADVANCED MOLECULAR GENETICS","Undergrad","https://catalog.oregonstate.edu/search/?P=BB%20486","No Sustainability Content"]
[null,"BB","BB",490,"BB 490","BIOCHEM 1: STRUCTURE & FUNCTIO","Undergrad","https://catalog.oregonstate.edu/search/?P=BB%20490","No Sustainability Content"]
[null,"BB","BB",491,"BB 491","BIOCHEMISTRY 2: METABOLISM","Undergrad","https://catalog.oregonstate.edu/search/?P=BB%20491","No Sustainability Content"]
[null,"BB","BB",492,"BB 492","BIOCHEM 3: GENETIC BIOCHEM","Undergrad","https://catalog.oregonstate.edu/search/?P=BB%20492","No Sustainability Content"]
[null,"BB","BB",493,"BB 493","BIOCHEMISTRY LABORATORY 1","Undergrad","https://catalog.oregonstate.edu/search/?P=BB%20493","No Sustainability Content"]
[null,"BB","BB",494,"BB 494","BIOCHEMISTRY LABORATORY 2","Undergrad","https://catalog.oregonstate.edu/search/?P=BB%20494","No Sustainability Content"]
[null,"BB","BB",496,"BB 496","BIOCHEM LAB MOLECULAR MODELING","Undergrad","https://catalog.oregonstate.edu/search/?P=BB%20496","No Sustainability Content"]
[null,"BB","BB",497,"BB 497","BASIC SEQUENCE ANALYSIS","Undergrad","https://catalog.oregonstate.edu/search/?P=BB%20497","No Sustainability Content"]
[null,"BB","BB",498,"BB 498","ASBMB CERTIFICATION EXAM","Undergrad","https://secure.oregonstate.edu/ap/cps/documents/view/125764","No Sustainability Content"]
[null,"BB","BB",560,{"$f":"TRIM(C1564)&\" \"&TRIM(D1564)","v":"BB 560"},"ADVANCED CELL BIOLOGY","Grad","https://secure.oregonstate.edu/ap/cps/documents/view/126916 ","No Sustainability Content"]
[null,"BB","BB",581,"BB 581","MACROMOLECULAR STRUCTURE","Grad","https://catalog.oregonstate.edu/search/?P=BB%20581","No Sustainability Content"]
[null,"BB","BB",583,"BB 583","BIOCHEM & BIOPHYSICS CAPSTONE","Grad","https://catalog.oregonstate.edu/search/?P=BB%20583","No Sustainability Content"]
[null,"BB","BB",584,"BB 584","CHROMATIN AND EPIGENETICS. (3 Credits)","Grad","https://catalog.oregonstate.edu/search/?P=BB%20584","No Sustainability Content"]
[null,"BB","BB",585,"BB 585","APPLIED BIOINFORMATICS","Grad","https://catalog.oregonstate.edu/search/?P=BB%20585","No Sustainability Content"]
[null,"BB","BB",586,"BB 586","ADVANCED MOLECULAR GENETICS","Grad","https://catalog.oregonstate.edu/search/?P=BB%20586","No Sustainability Content"]
[null,"BB","BB",590,"BB 590","BIOCHEM 1: STRUCTURE & FUNCTIO","Grad","https://catalog.oregonstate.edu/search/?P=BB%20590","No Sustainability Content"]
[null,"BB","BB",591,"BB 591","BIOCHEMISTRY 2: METABOLISM","Grad","https://catalog.oregonstate.edu/search/?P=BB%20591","No Sustainability Content"]
[null,"BB","BB",592,"BB 592","BIOCHEM 3: GENETIC BIOCHEM","Grad","https://catalog.oregonstate.edu/search/?P=BB%20592","No Sustainability Content"]
[null,"BB","BB",593,"BB 593","BIOCHEMISTRY LABORATORY 1","Grad","https://catalog.oregonstate.edu/search/?P=BB%20593","No Sustainability Content"]
[null,"BB","BB",594,"BB 594","BIOCHEMISTRY LABORATORY 2","Grad","https://catalog.oregonstate.edu/search/?P=BB%20594","No Sustainability Content"]
[null,"BB","BB",596,"BB 596","Biochemistry Laboratory: Molecular Modeling","Grad","https://secure.oregonstate.edu/ap/cps/documents/view/124833\nhttps://secure.oregonstate.edu/ap/cps/documents/view/124834","No Sustainability Content"]
[null,"BB","BB",597,"BB 597","Basic Nucleic Acid and Protein Sequence Analysis ","Grad","https://secure.oregonstate.edu/ap/cps/documents/view/124775","No Sustainability Content"]
[null,"BEE","BEE",311,"BEE 311","ECOLOGICAL FLUID MECHANICS","Undergrad","https://secure.oregonstate.edu/ap/cps/documents/view/106799","No Sustainability Content"]
[null,"BEE","BEE",320,"BEE 320","BIOSYSTEMS ANALYSIS & MODELING","Undergrad","https://secure.oregonstate.edu/ap/cps/documents/view/106798","No Sustainability Content"]
[null,"BEE","BEE",322,"BEE 322","ECO ENGR THERMO-TRANSFER PROC","Undergrad","https://secure.oregonstate.edu/ap/cps/documents/view/97880","No Sustainability Content"]
[null,"BEE","BEE",361,"BEE 361","ECOLOGICAL ENGINEERING LAB","Undergrad","https://secure.oregonstate.edu/ap/cps/documents/view/116933","No Sustainability Content"]
[null,"BEE","BEE",410,"BEE 410","ECOLOGICAL ENG INTERNSHIP","Undergrad","https://secure.oregonstate.edu/ap/cps/documents/view/105959","No Sustainability Content"]
[null,"BEE","BEE",415,"BEE 415","PROFESSIONAL DEVELOPMENT","Undergrad","https://secure.oregonstate.edu/ap/cps/documents/view/113184","No Sustainability Content"]
[null,"BEE","BEE",439,"BEE 439","IRRIGATION PRINCIPLES AND PRACTICES. (4 Credits)","Undergrad","https://secure.oregonstate.edu/ap/cps/documents/view/98220","No Sustainability Content"]
[null,"BEE","BEE",452,"BEE 452","Introduction to Process Engineering","Undergrad","https://secure.oregonstate.edu/ap/cps/documents/view/5808","No Sustainability Content"]
[null,"BEE","BEE",472,"BEE 472","INTRO TO FOOD ENGR PRIN","Undergrad","https://catalog.oregonstate.edu/search/?P=BEE%20472","No Sustainability Content"]
[null,"BEE","BEE",473,"BEE 473","INTRO TO FOOD ENGR PROC DESIGN","Undergrad","https://catalog.oregonstate.edu/search/?P=BEE%20473","No Sustainability Content"]
[null,"BEE","BEE",529,"BEE 529","BIOSYS MODELING TECHNIQUES","Grad","https://secure.oregonstate.edu/ap/cps/documents/view/98170","No Sustainability Content"]
[null,"BEE","BEE",545,"BEE 545","SEDIMENT TRANSPORT","Grad","https://secure.oregonstate.edu/ap/cps/documents/view/121956","No Sustainability Content"]
[null,"BEE","BEE",552,"BEE 552","Introduction to Process Engineering","Grad","https://secure.oregonstate.edu/ap/cps/documents/view/5808","No Sustainability Content"]
[null,"BEE","BEE",572,"BEE 572","INTRO TO FOOD ENGR PRIN","Grad","https://catalog.oregonstate.edu/search/?P=BEE%20572","No Sustainability Content"]
[null,"BEE","BEE",573,"BEE 573","INTRO TO PROCESS ENGR DESIGN","Grad","https://catalog.oregonstate.edu/search/?P=BEE%20573","No Sustainability Content"]
[null,"BEE","BEE",585,"BEE 585","METABOLIC SYSTEMS ENGINEERING. (3 Credits)","Grad","https://secure.oregonstate.edu/ap/cps/documents/view/112787","No Sustainability Content"]
[null,"BEE","BEE",586,"BEE 586","PROBLEM SOLVING FOR METABOLIC SYSTEMS ENGINEERING. (1 Credit)","Grad","https://secure.oregonstate.edu/ap/cps/documents/view/115478","No Sustainability Content"]
[null,"BEE","BEE",590,"BEE 590","Bioprocess Control Systems","Grad","https://secure.oregonstate.edu/ap/cps/documents/view/98160","No Sustainability Content"]
[null,"BEE","BEE",691,"BEE 691","Microbial Fuel Cell ","Grad","https://secure.oregonstate.edu/ap/cps/documents/view/8377","No Sustainability Content"]
[null,"MB","BHS",107,{"$f":"TRIM(C1596)&\" \"&TRIM(D1596)","v":"BHS 107"},"HEALTH PROFESSIONS: DENTAL","Undergrad","https://secure.oregonstate.edu/ap/cps/documents/view/128203","No Sustainability Content"]
[null,"MB","BHS",110,"BHS 110","BIOHEALTH SCIENCES ORIENTATION. (1 Credit)","Undergrad","https://secure.oregonstate.edu/ap/cps/documents/view/129178 ","No Sustainability Content"]
[null,"MB","BHS",255,"BHS 255","*ALLIED HEALTH MICROBIOLOGY. (4 Credits)","Undergrad","https://secure.oregonstate.edu/ap/cps/documents/view/131204","No Sustainability Content"]
[null,"MB","BHS",316,"BHS 316","PRINCIPLES OF IMMUNOLOGY","Undergrad","https://secure.oregonstate.edu/ap/cps/documents/view/122294","No Sustainability Content"]
[null,"MB","BHS",323,"BHS 323","^MICRO INFL ON HUMAN HEALTH","Undergrad","https://secure.oregonstate.edu/ap/cps/documents/view/123349","No Sustainability Content"]
[null,"MB","BHS",329,"BHS 329","MECHANISMS OF DISEASE","Undergrad","https://secure.oregonstate.edu/ap/cps/documents/view/123435","No Sustainability Content"]
[null,"MB","BHS",340,"BHS 340","HUMAN VIROLOGY. (4 Credits)",{"$f":"IF(D1602>499,\"Grad\", \"Undergrad\")","v":"Undergrad"},"https://secure.oregonstate.edu/ap/cps/documents/view/131099 ","No Sustainability Content"]
[null,"INBI","BI",102,{"$f":"TRIM(C1603)&\" \"&TRIM(D1603)","v":"BI 102"},"*GENES, BEHAVIOR & EVOLUTION","Undergrad","https://secure.oregonstate.edu/ap/cps/documents/view/133712","No Sustainability Content"]
[null,"INBI","BI",103,{"$f":"TRIM(C1604)&\" \"&TRIM(D1604)","v":"BI 103"},"*HUMAN ANATOMY, PHYS & DISEASE","Undergrad","https://secure.oregonstate.edu/ap/cps/documents/view/133696","No Sustainability Content"]
[null,"INBI","BI",175,"BI 175","*GENOMES, IDENTITIES AND SOCIETIES. (3 Credits)","Undergrad","https://secure.oregonstate.edu/ap/cps/documents/view/133570","No Sustainability Content"]
[null,"INBI","BI",197,{"$f":"TRIM(C1606)&\" \"&TRIM(D1606)","v":"BI 197"},"PROF DEVELOP I: HEALTH PRO","Undergrad","https://secure.oregonstate.edu/ap/cps/documents/view/132731","No Sustainability Content"]
[null,"INBI","BI",198,{"$f":"TRIM(C1607)&\" \"&TRIM(D1607)","v":"BI 198"},"PROF DEVELOP I: BIOL & ZOOLOGY","Undergrad","https://secure.oregonstate.edu/ap/cps/documents/view/24700","No Sustainability Content"]
[null,"INBI","BI",206,"BI 206","*INTRODUCTORY BIOLOGY III","Undergrad","https://secure.oregonstate.edu/ap/cps/documents/view/118241","No Sustainability Content"]
[null,"INBI","BI",231,"BI 231","INTRO TO HUMAN ANATOMY & PHYS","Undergrad","https://secure.oregonstate.edu/ap/cps/documents/view/115745","No Sustainability Content"]
[null,"INBI","BI",232,"BI 232","INTRO HUMAN ANATOMY & PHYS","Undergrad","https://secure.oregonstate.edu/ap/cps/documents/view/124254","No Sustainability Content"]
[null,"INBI","BI",233,"BI 233","INTRO HUMAN ANATOMY & PHYS","Undergrad","https://secure.oregonstate.edu/ap/cps/documents/view/124253","No Sustainability Content"]
[null,"INBI","BI",241,"BI 241","INTRO HUMAN ANATOMY & PHYS LAB","Undergrad","https://secure.oregonstate.edu/ap/cps/documents/view/115562","No Sustainability Content"]
[null,"INBI","BI",242,"BI 242","INTRO HUMAN ANATOMY & PHYS LAB","Undergrad","https://secure.oregonstate.edu/ap/cps/documents/view/124251","No Sustainability Content"]
[null,"INBI","BI",243,"BI 243","INTRO HUMAN ANATOMY & PHYS LAB","Undergrad","https://secure.oregonstate.edu/ap/cps/documents/view/124252","No Sustainability Content"]
[null,"INBI","BI",298,{"$f":"TRIM(C1615)&\" \"&TRIM(D1615)","v":"BI 298"},"PROF DEVELOP BIOLOGISTS II","Undergrad","https://secure.oregonstate.edu/ap/cps/documents/view/132850","No Sustainability Content"]
[null,"INBI","BI",311,"BI 311","GENETICS","Undergrad","https://secure.oregonstate.edu/ap/cps/documents/view/116611","No Sustainability Content"]
[null,"INBI","BI",314,"BI 314","CELL AND MOLECULAR BIOLOGY","Undergrad","https://secure.oregonstate.edu/ap/cps/documents/view/116614","No Sustainability Content"]
[null,"INBI","BI",315,"BI 315","MOLECULAR BIOLOGY LABORATORY","Undergrad","https://secure.oregonstate.edu/ap/cps/documents/view/115211","No Sustainability Content"]
[null,"INBI","BI",319,{"$f":"TRIM(C1619)&\" \"&TRIM(D1619)","v":"BI 319"},"^THINKING & COMM LIFE SCIENCE","Undergrad","https://secure.oregonstate.edu/ap/cps/documents/view/126009","No Sustainability Content"]
[null,"INBI","BI",331,"BI 331","ADV HUMAN ANATOMY & PHYSIOLOGY","Undergrad","https://secure.oregonstate.edu/ap/cps/documents/view/116600","No Sustainability Content"]
[null,"INBI","BI",332,"BI 332","ADV HUMAN ANATOMY & PHYSIOLOGY","Undergrad","https://secure.oregonstate.edu/ap/cps/documents/view/115763","No Sustainability Content"]
[null,"INBI","BI",333,"BI 333","ADV HUMAN ANATOMY & PHYSIOLOGY","Undergrad","https://secure.oregonstate.edu/ap/cps/documents/view/115762","No Sustainability Content"]
[null,"INBI","BI",341,"BI 341","ADV HUMAN ANATOMY & PHYSIO LAB","Undergrad","https://secure.oregonstate.edu/ap/cps/documents/view/115554","No Sustainability Content"]
[null,"INBI","BI",342,"BI 342","ADV HUMAN ANATOMY & PHYSIO LAB","Undergrad","https://secure.oregonstate.edu/ap/cps/documents/view/115552","No Sustainability Content"]
[null,"INBI","BI",343,"BI 343","ADV HUMAN ANATOMY & PHYSIO LAB","Undergrad","https://secure.oregonstate.edu/ap/cps/documents/view/115496","No Sustainability Content"]
[null,"INBI","BI",358,"BI 358","SYMBIOSES AND THE ENVIRONMENT","Undergrad","https://secure.oregonstate.edu/ap/cps/documents/view/116745","No Sustainability Content"]
[null,"INBI","BI",373,"BI 373","^FIELD METHODS IN MARINE ECOLO","Undergrad","https://secure.oregonstate.edu/ap/cps/documents/view/123407","No Sustainability Content"]
[null,"INBI","BI",414,"BI 414","Writing for the Biological Sciences","Undergrad","https://secure.oregonstate.edu/ap/cps/documents/view/116822","No Sustainability Content"]
[null,"INBI","BI",450,"BI 450","^MARINE BIOLOGY AND ECOLOGY","Undergrad","https://secure.oregonstate.edu/ap/cps/documents/view/119955","No Sustainability Content"]
[null,"INBI","BI",456,"BI 456","PHYLOGENETICS. (4 Credits)","Undergrad","https://catalog.oregonstate.edu/search/?P=BI%20456","No Sustainability Content"]
[null,"INBI","BI",485,"BI 485","MONSTER BIOLOGY. (3 Credits)","Undergrad","https://secure.oregonstate.edu/ap/cps/documents/view/132842","No Sustainability Content"]
[null,"INBI","BI",556,"BI 556","Phylogenetics","Grad","https://secure.oregonstate.edu/ap/cps/documents/view/126007","No Sustainability Content"]
[null,"INBI","BI",592,"BI 592","THEORETICAL ECOLOGY","Grad","https://secure.oregonstate.edu/ap/cps/documents/view/120124","No Sustainability Content"]
[null,"CBE","BIOE",340,"BIOE 340","BIOMEDICAL ENGR PRINCIPLES","Undergrad","https://secure.oregonstate.edu/ap/cps/documents/view/117596","No Sustainability Content"]
[null,"CBE","BIOE",351,"BIOE 351","BIOMATERIALS AND BIOINTERFACES","Undergrad","https://secure.oregonstate.edu/ap/cps/documents/view/124438","No Sustainability Content"]
[null,"CBE","BIOE",415,"BIOE 415","BIOENGINEERING LABORATORY","Undergrad","https://secure.oregonstate.edu/ap/cps/documents/view/122903","No Sustainability Content"]
[null,"CBE","BIOE",440,{"$f":"TRIM(C1637)&\" \"&TRIM(D1637)","v":"BIOE 440"},"BIOCONJUGATION","Undergrad","https://secure.oregonstate.edu/ap/cps/documents/view/122570","No Sustainability Content"]
[null,"CBE","BIOE",445,"BIOE 445","SURFACE ANALYSIS. (3 Credits)","Undergrad","https://secure.oregonstate.edu/ap/cps/documents/view/126364","No Sustainability Content"]
[null,"CBE","BIOE",457,"BIOE 457","BIOREACTORS","Undergrad","https://catalog.oregonstate.edu/search/?P=BIOE%20457","No Sustainability Content"]
[null,"CBE","BIOE",459,"BIOE 459","CELL ENGINEERING","Undergrad","https://catalog.oregonstate.edu/search/?P=BIOE%20459","No Sustainability Content"]
[null,"CBE","BIOE",470,"BIOE 470","REGULATION OF DRUGS AND MEDICAL DEVICES. (2 Credits)","Undergrad","https://catalog.oregonstate.edu/search/?P=BIOE%20470","No Sustainability Content"]
[null,"CBE","BIOE",491,"BIOE 491","BIOENGINEERING PRODUCT DESIGN","Undergrad","https://secure.oregonstate.edu/ap/cps/documents/view/123313","No Sustainability Content"]
[null,"CBE","BIOE",503,{"$f":"TRIM(C1643)&\" \"&TRIM(D1643)","v":"BIOE 503"},"THESIS","Grad","https://secure.oregonstate.edu/ap/cps/documents/view/130515","Unavailable syllabus"]
[null,"CBE","BIOE",511,"BIOE 511","CELLULAR AND MOLECULAR BIOENGINEERING. (3 Credits)","Grad","https://secure.oregonstate.edu/ap/cps/documents/view/133226","No Sustainability Content"]
[null,"CBE","BIOE",513,"BIOE 513","DRUG AND MEDICAL DEVICE REGULATIONS IN TECHNOLOGY DEVELOPMENT. (2 Credits)","Grad","https://secure.oregonstate.edu/ap/cps/documents/view/133199","No Sustainability Content"]
[null,"CBE","BIOE",540,{"$f":"TRIM(C1646)&\" \"&TRIM(D1646)","v":"BIOE 540"},"BIOCONJUGATION","Grad","https://secure.oregonstate.edu/ap/cps/documents/view/122570","No Sustainability Content"]
[null,"CBE","BIOE",545,"BIOE 545","SURFACE ANALYSIS. (3 Credits)","Grad","https://secure.oregonstate.edu/ap/cps/documents/view/126364","No Sustainability Content"]
[null,"CBE","BIOE",557,"BIOE 557","BIOREACTORS","Grad","https://catalog.oregonstate.edu/search/?P=BIOE%20557","No Sustainability Content"]
[null,"CBE","BIOE",559,"BIOE 559","CELL ENGINEERING","Grad","https://catalog.oregonstate.edu/search/?P=BIOE%20559","No Sustainability Content"]
[null,"CBE","BIOE",570,"BIOE 570","Regulation of Drugs and Medical Devices","Grad","https://secure.oregonstate.edu/ap/cps/documents/view/5812","No Sustainability Content"]
[null,"CBE","BIOE",603,{"$f":"TRIM(C1651)&\" \"&TRIM(D1651)","v":"BIOE 603"},"THESIS","Grad","https://secure.oregonstate.edu/ap/cps/documents/view/130516","Unavailable syllabus"]
[null,"BOT","BOT",220,"BOT 220","*INTRODUCTION TO PLANT BIOLOGY","Undergrad","https://secure.oregonstate.edu/ap/cps/documents/view/121051","No Sustainability Content"]
[null,"BOT","BOT",323,"BOT 323","^FLOWERING PLANTS OF THE WORLD. (3 Credits)","Undergrad","https://secure.oregonstate.edu/ap/cps/documents/view/8485","No Sustainability Content"]
[null,"BOT","BOT",324,"BOT 324","*FUNGI IN SOCIETY","Undergrad","https://secure.oregonstate.edu/ap/cps/documents/view/116507","No Sustainability Content"]
[null,"BOT","BOT",332,"BOT 332","LAB TECHNIQUES IN PLANT BIO","Undergrad","https://secure.oregonstate.edu/ap/cps/documents/view/7530","No Sustainability Content"]
[null,"BOT","BOT",413,{"$f":"TRIM(C1656)&\" \"&TRIM(D1656)","v":"BOT 413"},"FOREST PATHOLOGY","Undergrad","https://secure.oregonstate.edu/ap/cps/documents/view/126531","No Sustainability Content"]
[null,"BOT","BOT",440,"BOT 440","FIELD METHODS IN PLANT ECOLOGY","Undergrad","https://catalog.oregonstate.edu/search/?P=BOT%20440","No Sustainability Content"]
[null,"BOT","BOT",458,{"$f":"TRIM(C1658)&\" \"&TRIM(D1658)","v":"BOT 458"},"ECOSYSTEMS GENOMICS","Undergrad","https://secure.oregonstate.edu/ap/cps/documents/view/129464","No Sustainability Content"]
[null,"BOT","BOT",460,"BOT 460","FUNCTIONAL GENOMICS","Undergrad","https://catalog.oregonstate.edu/search/?P=BOT%20460","No Sustainability Content"]
[null,"BOT","BOT",461,"BOT 461","MYCOLOGY","Undergrad","https://catalog.oregonstate.edu/search/?P=BOT%20461","No Sustainability Content"]
[null,"BOT","BOT",475,"BOT 475","COMPARATIVE GENOMICS","Undergrad","https://secure.oregonstate.edu/ap/cps/documents/view/106029","No Sustainability Content"]
[null,"BOT","BOT",476,"BOT 476","COMPUTING IN LIFE SCIENCES","Undergrad","https://secure.oregonstate.edu/ap/cps/documents/view/114308","No Sustainability Content"]
[null,"BOT","BOT",480,"BOT 480","PHOTOSYNTHESIS & PHOTOBIOLOGY","Undergrad","https://catalog.oregonstate.edu/search/?P=BOT%20480","No Sustainability Content"]
[null,"BOT","BOT",513,{"$f":"TRIM(C1664)&\" \"&TRIM(D1664)","v":"BOT 513"},"FOREST PATHOLOGY","Grad","https://secure.oregonstate.edu/ap/cps/documents/view/126531","No Sustainability Content"]
[null,"BOT","BOT",540,"BOT 540","FIELD METHODS IN PLANT ECOLOGY","Grad","https://catalog.oregonstate.edu/search/?P=BOT%20540","No Sustainability Content"]
[null,"BOT","BOT",554,"BOT 554","BIOLOGY OF NEMATODES. (4 Credits)",{"$f":"IF(D1666>499,\"Grad\", \"Undergrad\")","v":"Grad"},"https://secure.oregonstate.edu/ap/cps/documents/view/130253","No Sustainability Content"]
[null,"BOT","BOT",556,"BOT 556","PHYLOGENETICS. (4 Credits)","Grad","https://catalog.oregonstate.edu/search/?P=BOT%20556","No Sustainability Content"]
[null,"BOT","BOT",558,{"$f":"TRIM(C1668)&\" \"&TRIM(D1668)","v":"BOT 558"},"ECOSYSTEMS GENOMICS","Grad","https://secure.oregonstate.edu/ap/cps/documents/view/129464","No Sustainability Content"]
[null,"BOT","BOT",560,"BOT 560","FUNCTIONAL GENOMICS","Grad","https://catalog.oregonstate.edu/search/?P=BOT%20560","No Sustainability Content"]
[null,"BOT","BOT",561,"BOT 561","MYCOLOGY","Grad","https://catalog.oregonstate.edu/search/?P=BOT%20561","No Sustainability Content"]
[null,"BOT","BOT",570,"BOT 570","COMMUNITY STRUCTURE & ANALYSIS","Grad","https://secure.oregonstate.edu/ap/cps/documents/view/121501","No Sustainability Content"]
[null,"BOT","BOT",575,"BOT 575","COMPARATIVE GENOMICS","Grad","https://secure.oregonstate.edu/ap/cps/documents/view/106029","No Sustainability Content"]
[null,"BOT","BOT",576,"BOT 576","COMPUTING IN LIFE SCIENCES","Grad","https://secure.oregonstate.edu/ap/cps/documents/view/114308","No Sustainability Content"]
[null,"BOT","BOT",580,"BOT 580","PHOTOSYNTHESIS & PHOTOBIOLOGY","Grad","https://catalog.oregonstate.edu/search/?P=BOT%20580","No Sustainability Content"]
[null,"BRR","BRR",100,"BRR 100","GREAT EXPER IN BIORESOURCE SCI","Undergrad","https://secure.oregonstate.edu/ap/cps/documents/view/102042","No Sustainability Content"]
[null,"BRR","BRR",200,"BRR 200","SCIENCE AND RESEARCH","Undergrad","https://secure.oregonstate.edu/ap/cps/documents/view/101638","No Sustainability Content"]
[null,"BRR","BRR",403,"BRR 403","^THESIS","Undergrad","https://secure.oregonstate.edu/ap/cps/documents/view/102051","No Sustainability Content"]
[null,"BRR","BRR",406,"BRR 406","PROJECTS-DATA PRESENTATIONS","Undergrad","https://secure.oregonstate.edu/ap/cps/documents/view/102039","No Sustainability Content"]
[null,"BRR","BRR",409,"BRR 409","PRACTICUM","Undergrad","https://secure.oregonstate.edu/ap/cps/documents/view/102040","No Sustainability Content"]
[null,"CBE","CBEE",101,"CBEE 101","CHE, BIOE, ENVE ORIENTATION","Undergrad","https://secure.oregonstate.edu/ap/cps/documents/view/100670","No Sustainability Content"]
[null,"CBE","CBEE",102,"CBEE 102","ENGR PROB SOLV & COMPUTATIONS","Undergrad","https://secure.oregonstate.edu/ap/cps/documents/view/120329","No Sustainability Content"]
[null,"CBE","CBEE",211,"CBEE 211","MATERIAL BALANCE/STOICHIOMETRY","Undergrad","https://secure.oregonstate.edu/ap/cps/documents/view/100671","No Sustainability Content"]
[null,"CBE","CBEE",212,"CBEE 212","ENERGY BALANCES","Undergrad","https://secure.oregonstate.edu/ap/cps/documents/view/116214","No Sustainability Content"]
[null,"CBE","CBEE",213,"CBEE 213","PROCESS DATA ANALYSIS","Undergrad","https://secure.oregonstate.edu/ap/cps/documents/view/100673","No Sustainability Content"]
[null,"CBE","CBEE",280,"CBEE 280","MATERIAL AND ENERGY BALANCES","Undergrad","https://secure.oregonstate.edu/ap/cps/documents/view/120513   ","No Sustainability Content"]
[null,"CBE","CBEE",414,"CBEE 414","^PROCESS ENGINEERING LAB","Undergrad","https://secure.oregonstate.edu/ap/cps/documents/view/122943","No Sustainability Content"]
[null,"CBE","CBEE",416,"CBEE 416","CBEE LABORATORY II","Undergrad","https://secure.oregonstate.edu/ap/cps/documents/view/100675","No Sustainability Content"]
[null,"CCE","CCE",102,"CCE 102","CCE: PROBLEM-SOLVING & TECH","Undergrad","https://secure.oregonstate.edu/ap/cps/documents/view/9941","No Sustainability Content"]
[null,"CCE","CCE",201,"CCE 201","CCE ENGR GRAPHICS & DESIGN","Undergrad","https://secure.oregonstate.edu/ap/cps/documents/view/9813","No Sustainability Content"]
[null,"CCE","CCE",203,"CCE 203","INTRO TO VIRTUAL DSGN & CONSTR","Undergrad","https://secure.oregonstate.edu/ap/cps/documents/view/116667","No Sustainability Content"]
[null,"CCE","CCE",321,"CCE 321","CCE MATERIALS","Undergrad","https://secure.oregonstate.edu/ap/cps/documents/view/9916","No Sustainability Content"]
[null,"CCE","CCE",421,"CCE 421","ADVANCED CONCRETE PROPERTIES AND PERFORMANCE. (4 Credits)","Undergrad","https://secure.oregonstate.edu/ap/cps/documents/view/113810","No Sustainability Content"]
[null,"CCE","CCE",525,"CCE 525","CONSTRUCTION SITE SYSTEMS ENGR","Grad","https://secure.oregonstate.edu/ap/cps/documents/view/111921","No Sustainability Content"]
[null,"CCE","CCE",526,"CCE 526","DESIGN FOR SAFETY","Grad","https://secure.oregonstate.edu/ap/cps/documents/view/115604","No Sustainability Content"]
[null,"CCE","CCE",529,"CCE 529","LEAN CONSTRUCTION","Grad","https://secure.oregonstate.edu/ap/cps/documents/view/115449","No Sustainability Content"]
[null,"CCE","CCE",552,"CCE 552","PROJECT RISK MANAGEMENT","Grad","https://secure.oregonstate.edu/ap/cps/documents/view/119451","No Sustainability Content"]
[null,"CCE","CCE",621,"CCE 621","DURABILITY AND CONDITION ASSESSMENT OF REINFORCED CONCRETE. (4 Credits)","Grad","https://secure.oregonstate.edu/ap/cps/documents/view/132755","No Sustainability Content"]
[null,"CCE","CCE",623,"CCE 623","CORROSION OF METALS AND CORROSION CONTROL. (4 Credits)","Grad","https://secure.oregonstate.edu/ap/cps/documents/view/130952","No Sustainability Content"]
[null,"CCE","CE",102,"CE 102","Intro to Materials Science","Undergrad","https://secure.oregonstate.edu/ap/cps/documents/view/9849","No Sustainability Content"]
[null,"CCE","CE",202,"CE 202","CE: GEOSPATIAL INFO & GIS","Undergrad","https://secure.oregonstate.edu/ap/cps/documents/view/9702","No Sustainability Content"]
[null,"CCE","CE",301,"CE 301","CE JUNIOR SEMINAR","Undergrad","https://secure.oregonstate.edu/ap/cps/documents/view/122910","No Sustainability Content"]
[null,"CCE","CE",313,"CE 313","HYDRAULIC ENGINEERING","Undergrad","https://secure.oregonstate.edu/ap/cps/documents/view/9850","No Sustainability Content"]
[null,"CCE","CE",372,"CE 372","GEOTECHNICAL ENGINEERING I","Undergrad","https://secure.oregonstate.edu/ap/cps/documents/view/100401","No Sustainability Content"]
[null,"CCE","CE",403,{"$f":"TRIM(C1704)&\" \"&TRIM(D1704)","v":"CE 403"},"THESIS","Undergrad","https://secure.oregonstate.edu/ap/cps/documents/view/108150","Unavailable syllabus"]
[null,"CCE","CE",413,{"$f":"TRIM(C1705)&\" \"&TRIM(D1705)","v":"CE 413"},"GIS IN WATER RESOURCES","Undergrad","https://secure.oregonstate.edu/ap/cps/documents/view/9735","Unavailable syllabus"]
[null,"CCE","CE",418,"CE 418","^CE PROFESSIONAL PRACTICE","Undergrad","https://secure.oregonstate.edu/ap/cps/documents/view/5790","No Sustainability Content"]
[null,"CCE","CE",419,{"$f":"TRIM(C1707)&\" \"&TRIM(D1707)","v":"CE 419"},"^CIVIL INFRASTRUCTURE DESIGN","Undergrad","https://secure.oregonstate.edu/ap/cps/documents/view/126092","No Sustainability Content"]
[null,"CCE","CE",427,"CE 427","TEMP CONSTRUCTION STRUCTURES","Undergrad","https://catalog.oregonstate.edu/search/?P=CE%20427","No Sustainability Content"]
[null,"CCE","CE",471,"CE 471","FOUNDATIONS FOR STRUCTURES","Undergrad","https://secure.oregonstate.edu/ap/cps/documents/view/115592","No Sustainability Content"]
[null,"CCE","CE",479,"CE 479","SLOPE AND EMBANKMENT DESIGN","Undergrad","https://catalog.oregonstate.edu/search/?P=CE%20479","No Sustainability Content"]
[null,"CCE","CE",481,"CE 481","REINFORCED CONCRETE I","Undergrad","https://catalog.oregonstate.edu/search/?P=CE%20481","No Sustainability Content"]
[null,"CCE","CE",486,"CE 486","PRESTRESSED CONCRETE","Undergrad","https://catalog.oregonstate.edu/search/?P=CE%20486","No Sustainability Content"]
[null,"CCE","CE",505,"CE 505","READING AND CONFERENCE","Grad","https://secure.oregonstate.edu/ap/cps/documents/view/1780","No Sustainability Content"]
[null,"CCE","CE",513,{"$f":"TRIM(C1714)&\" \"&TRIM(D1714)","v":"CE 513"},"GIS IN WATER RESOURCES","Grad","https://secure.oregonstate.edu/ap/cps/documents/view/9735","Unavailable syllabus"]
[null,"CCE","CE",514,"CE 514","GROUNDWATER HYDRAULICS","Grad","https://catalog.oregonstate.edu/search/?P=CE%20514","No Sustainability Content"]
[null,"CCE","CE",526,"CE 526","ADVANCED CONCRETE MATERIALS. (3 Credits)","Grad","https://secure.oregonstate.edu/ap/cps/documents/view/9904","No Sustainability Content"]
[null,"CCE","CE",527,"CE 527","TEMP CONSTRUCTION STRUCTURES","Grad","https://catalog.oregonstate.edu/search/?P=CE%20527","No Sustainability Content"]
[null,"CCE","CE",530,"CE 530","SELECTED TOPICS IN STRUCTURAL ANALYSIS AND MECHANICS. (3 Credits)","Grad","https://secure.oregonstate.edu/ap/cps/documents/view/9914","No Sustainability Content"]
[null,"CCE","CE",532,"CE 532","FINITE ELEMENT ANALYSIS","Grad","https://secure.oregonstate.edu/ap/cps/documents/view/9898","No Sustainability Content"]
[null,"CCE","CE",534,{"$f":"TRIM(C1720)&\" \"&TRIM(D1720)","v":"CE 534"},"STRUCTURAL DYNAMICS","Grad","https://secure.oregonstate.edu/ap/cps/documents/view/9917","Unavailable syllabus"]
[null,"CCE","CE",535,"CE 535","INTRODUCTION TO RANDOM VIBRATIONS. (4 Credits)","Grad","https://secure.oregonstate.edu/ap/cps/documents/view/112210","No Sustainability Content"]
[null,"CCE","CE",536,"CE 536","MATRIX METHODS OF STRUCTURAL ANALYSIS. (4 Credits)","Grad","https://secure.oregonstate.edu/ap/cps/documents/view/9781","No Sustainability Content"]
[null,"CCE","CE",537,"CE 537","NONLINEAR STRUCTURAL ANALYSIS","Grad","https://secure.oregonstate.edu/ap/cps/documents/view/9980","No Sustainability Content"]
[null,"CCE","CE",538,"CE 538","STRUCTURAL RELIABILITY AND RISK ANALYSIS. (4 Credits)","Grad","https://secure.oregonstate.edu/ap/cps/documents/view/131533","No Sustainability Content"]
[null,"CCE","CE",540,{"$f":"TRIM(C1725)&\" \"&TRIM(D1725)","v":"CE 540"},"SPECIAL TOPICS IN HYDRAULICS","Grad","https://secure.oregonstate.edu/ap/cps/documents/view/106369","No Sustainability Content"]
[null,"CCE","CE",544,"CE 544","OPEN CHANNEL FLOW","Grad","https://secure.oregonstate.edu/ap/cps/documents/view/108521","No Sustainability Content"]
[null,"CCE","CE",551,"CE 551","COMPUTER-AIDED SITE AND ROAD DESIGN. (4 Credits)","Grad","https://secure.oregonstate.edu/ap/cps/documents/view/5358","No Sustainability Content"]
[null,"CCE","CE",552,"CE 552","ISOLATED SIGNALIZED INTERSECTIONS. (3 Credits)","Grad","https://secure.oregonstate.edu/ap/cps/documents/view/108311","No Sustainability Content"]
[null,"CCE","CE",553,"CE 553","RAILROAD ENGINEERING","Grad","https://secure.oregonstate.edu/ap/cps/documents/view/115595","No Sustainability Content"]
[null,"CCE","CE",554,"CE 554","DRIVING SIMULATION",{"$f":"IF(D1730>499,\"Grad\", \"Undergrad\")","v":"Grad"},"https://secure.oregonstate.edu/ap/cps/documents/view/113560","No Sustainability Content"]
[null,"CCE","CE",556,{"$f":"TRIM(C1731)&\" \"&TRIM(D1731)","v":"CE 556"},"TRANSPORTATION SAFETY ANALYSIS","Grad","https://secure.oregonstate.edu/ap/cps/documents/view/129311","No Sustainability Content"]
[null,"CCE","CE",557,"CE 557","NETWORK FLOW ANALYSIS AND OPTIMIZATION. (3 Credits)","Grad","https://secure.oregonstate.edu/ap/cps/documents/view/129312","No Sustainability Content"]
[null,"CCE","CE",562,"CE 562","DIGITAL TERRAIN MODELING. (4 Credits)","Grad","https://secure.oregonstate.edu/ap/cps/documents/view/102915","No Sustainability Content"]
[null,"CCE","CE",566,"CE 566","3D LASER SCANNING AND IMAGING","Grad","https://secure.oregonstate.edu/ap/cps/documents/view/124980","No Sustainability Content"]
[null,"CCE","CE",567,"CE 567","COASTAL REMOTE SENSING. (4 Credits)","Grad","https://secure.oregonstate.edu/ap/cps/documents/view/129239","No Sustainability Content"]
[null,"CCE","CE",568,"CE 568","LEAST SQUARES ADJUSTMENTS. (3 Credits)","Grad","https://secure.oregonstate.edu/ap/cps/documents/view/125749","No Sustainability Content"]
[null,"CCE","CE",571,"CE 571","ADV FOUNDATION ENGINEERING","Grad","https://secure.oregonstate.edu/ap/cps/documents/view/120763","No Sustainability Content"]
[null,"CCE","CE",574,"CE 574","ENGINEERING PROPERTIES OF SOILS. (5 Credits)","Grad","https://secure.oregonstate.edu/ap/cps/documents/view/5731","No Sustainability Content"]
[null,"CCE","CE",575,"CE 575","EARTH RETENTION AND SUPPORT","Grad","https://secure.oregonstate.edu/ap/cps/documents/view/121318","No Sustainability Content"]
[null,"CCE","CE",576,"CE 576","GROUND IMPROVEMENT. (3 Credits)","Grad","https://secure.oregonstate.edu/ap/cps/documents/view/121543","No Sustainability Content"]
[null,"CCE","CE",577,"CE 577","STATIC/DYNAMIC SOIL BEHAVIOR","Grad","https://secure.oregonstate.edu/ap/cps/documents/view/120064","No Sustainability Content"]
[null,"CCE","CE",579,"CE 579","SLOPE AND EMBANKMENT DESIGN","Grad","https://catalog.oregonstate.edu/search/?P=CE%20579","No Sustainability Content"]
[null,"CCE","CE",580,"CE 580","ST/STRUCTURAL DESIGN","Grad","https://secure.oregonstate.edu/ap/cps/documents/view/100803","No Sustainability Content"]
[null,"CCE","CE",581,"CE 581","REINFORCED CONCRETE I","Grad","https://catalog.oregonstate.edu/search/?P=CE%20581","No Sustainability Content"]
[null,"CCE","CE",583,"CE 583","BRIDGE DESIGN","Grad","https://secure.oregonstate.edu/ap/cps/documents/view/9839","No Sustainability Content"]
[null,"CCE","CE",585,"CE 585","MATRIX STRUCTURAL ANALYSIS","Grad","https://secure.oregonstate.edu/ap/cps/documents/view/9784","No Sustainability Content"]
[null,"CCE","CE",586,"CE 586","PRESTRESSED CONCRETE","Grad","https://catalog.oregonstate.edu/search/?P=CE%20586","No Sustainability Content"]
[null,"CCE","CE",588,"CE 588","Thin Film Materials Characterization and Properties","Grad","https://secure.oregonstate.edu/ap/cps/documents/view/9913","No Sustainability Content"]
[null,"CCE","CE",589,"CE 589","SEISMIC DESIGN","Grad","https://secure.oregonstate.edu/ap/cps/documents/view/9905","No Sustainability Content"]
[null,"CCE","CE",591,"CE 591","TRANSP SYS ANALY, PLAN, POLICY","Grad","https://secure.oregonstate.edu/ap/cps/documents/view/4458","No Sustainability Content"]
[null,"CCE","CE",593,{"$f":"TRIM(C1751)&\" \"&TRIM(D1751)","v":"CE 593"},"TRAFFIC FLOW ANALYSIS/CONTROL","Grad","https://secure.oregonstate.edu/ap/cps/documents/view/9962","Unavailable syllabus"]
[null,"CCE","CE",595,"CE 595","TRAFFIC OPERATIONS & DESIGN","Grad","https://secure.oregonstate.edu/ap/cps/documents/view/4724","No Sustainability Content"]
[null,"CCE","CE",630,"CE 630","OCEAN WAVE MECHANICS I","Grad","https://secure.oregonstate.edu/ap/cps/documents/view/7601","No Sustainability Content"]
[null,"CCE","CE",631,"CE 631","OCEAN WAVE MECHANICS II","Grad","https://secure.oregonstate.edu/ap/cps/documents/view/7598","No Sustainability Content"]
[null,"CCE","CE",634,"CE 634","LONG WAVE MECHANICS","Grad","https://secure.oregonstate.edu/ap/cps/documents/view/7753","No Sustainability Content"]
[null,"CCE","CE",635,"CE 635","APPLIED MODELING OF NEARSHORE PROCESSES. (4 Credits)","Grad","https://secure.oregonstate.edu/ap/cps/documents/view/8215","Unavailable syllabus"]
[null,"CCE","CE",661,{"$f":"TRIM(C1757)&\" \"&TRIM(D1757)","v":"CE 661"},"KINEMATIC POSITIONING & NAV","Grad","https://secure.oregonstate.edu/ap/cps/documents/view/129235 ","No Sustainability Content"]
[null,"CCE","CE",663,"CE 663","GEODESY. (4 Credits)","Grad","https://secure.oregonstate.edu/ap/cps/documents/view/134192","No Sustainability Content"]
[null,"CCE","CEM",326,"CEM 326","CONSTRUCTION SAFETY. (3 Credits)","Undergrad","https://secure.oregonstate.edu/ap/cps/documents/view/131132","No Sustainability Content"]
[null,"CCE","CEM",343,"CEM 343","CONSTR PLANNING & SCHEDULING","Undergrad","https://secure.oregonstate.edu/ap/cps/documents/view/9776","No Sustainability Content"]
[null,"CCE","CEM",431,{"$f":"TRIM(C1761)&\" \"&TRIM(D1761)","v":"CEM 431"},"OBTAINING CONST CONTRACTS","Undergrad","https://secure.oregonstate.edu/ap/cps/documents/view/9825","Unavailable syllabus"]
[null,"CCE","CEM",432,{"$f":"TRIM(C1762)&\" \"&TRIM(D1762)","v":"CEM 432"},"CONSTRUCTION PROJECT PLANNING","Undergrad","https://secure.oregonstate.edu/ap/cps/documents/view/127513","No Sustainability Content"]
[null,"CCE","CEM",441,{"$f":"TRIM(C1763)&\" \"&TRIM(D1763)","v":"CEM 441"},"HEAVY CIVIL CONSTRUCTION MGMT","Undergrad","https://secure.oregonstate.edu/ap/cps/documents/view/9959","Unavailable syllabus"]
[null,"CCE","CEM",442,"CEM 442","BUILDING CONSTRUCTION MGMT","Undergrad","https://secure.oregonstate.edu/ap/cps/documents/view/9738","No Sustainability Content"]
[null,"CCE","CEM",443,{"$f":"TRIM(C1765)&\" \"&TRIM(D1765)","v":"CEM 443"},"^PROJECT MGMT FOR CONSTRUCTION","Undergrad","https://secure.oregonstate.edu/ap/cps/documents/view/133468","No Sustainability Content"]
[null,"CCE","CEM",541,"CEM 541","HEAVY CIVIL CONSTRUCTION MANAGEMENT. (4 Credits)","Grad","https://secure.oregonstate.edu/ap/cps/documents/view/9959","Unavailable syllabus"]
[null,"CH","CH",110,"CH 110","*ROYGBIV: THE CHEMISTRY OF COLORS. (4 Credits)","Undergrad","https://secure.oregonstate.edu/ap/cps/documents/view/133620","No Sustainability Content"]
[null,"CH","CH",122,"CH 122","*GENERAL CHEMISTRY","Undergrad","https://secure.oregonstate.edu/ap/cps/documents/view/120782\nhttps://secure.oregonstate.edu/ap/cps/documents/view/121722","No Sustainability Content"]
[null,"CH","CH",123,"CH 123","*GENERAL CHEMISTRY","Undergrad","https://secure.oregonstate.edu/ap/cps/documents/view/120783\nhttps://secure.oregonstate.edu/ap/cps/documents/view/121723","No Sustainability Content"]
[null,"CH","CH",125,"CH 125","GENERAL CHEMISTRY. (2 Credits)","Undergrad","https://secure.oregonstate.edu/ap/cps/documents/view/119398","No Sustainability Content"]
[null,"CH","CH",130,{"$f":"TRIM(C1771)&\" \"&TRIM(D1771)","v":"CH 130"},"GENERAL CHEM/LIVING SYSTEMS","Undergrad","https://secure.oregonstate.edu/ap/cps/documents/view/9795","Unavailable syllabus"]
[null,"CH","CH",140,"CH 140","GENERAL, ORGANIC & BIOL CHEM","Undergrad","https://secure.oregonstate.edu/ap/cps/documents/view/110141","No Sustainability Content"]
[null,"CH","CH",201,"CH 201","CHEM FOR ENGINEERING MAJORS","Undergrad","https://secure.oregonstate.edu/ap/cps/documents/view/125819","No Sustainability Content"]
[null,"CH","CH",202,"CH 202","CHEMISTRY: ENGINEERING MAJORS","Undergrad","https://secure.oregonstate.edu/ap/cps/documents/view/120784","No Sustainability Content"]
[null,"CH","CH",205,"CH 205","LABORATORY FOR CH 202","Undergrad","https://secure.oregonstate.edu/ap/cps/documents/view/579","No Sustainability Content"]
[null,"CH","CH",220,{"$f":"TRIM(C1776)&\" \"&TRIM(D1776)","v":"CH 220"},"CAREERS IN CHEMISTRY","Undergrad","https://secure.oregonstate.edu/ap/cps/documents/view/100872","Unavailable syllabus"]
[null,"CH","CH",231,"CH 231","GENERAL CHEMISTRY","Undergrad","https://secure.oregonstate.edu/ap/cps/documents/view/125708","No Sustainability Content"]
[null,"CH","CH",232,"CH 232","GENERAL CHEMISTRY","Undergrad","https://secure.oregonstate.edu/ap/cps/documents/view/122050","No Sustainability Content"]
[null,"CH","CH",233,"CH 233","GENERAL CHEMISTRY","Undergrad","https://secure.oregonstate.edu/ap/cps/documents/view/122051","No Sustainability Content"]
[null,"CH","CH",261,"CH 261","*LABORATORY FOR CHEMISTRY 231","Undergrad","https://secure.oregonstate.edu/ap/cps/documents/view/106477","No Sustainability Content"]
[null,"CH","CH",262,"CH 262","*LABORATORY FOR CHEMISTRY 232","Undergrad","https://secure.oregonstate.edu/ap/cps/documents/view/106478","No Sustainability Content"]
[null,"CH","CH",263,"CH 263","*LABORATORY FOR CHEMISTRY 233","Undergrad","https://secure.oregonstate.edu/ap/cps/documents/view/106479","No Sustainability Content"]
[null,"CH","CH",271,"CH 271","*LAB FOR CH 231 FOR CHEM MAJOR","Undergrad","https://secure.oregonstate.edu/ap/cps/documents/view/106483","No Sustainability Content"]
[null,"CH","CH",272,"CH 272","*LAB FOR CH 232 FOR CHEM MAJOR","Undergrad","https://secure.oregonstate.edu/ap/cps/documents/view/106485","No Sustainability Content"]
[null,"CH","CH",273,"CH 273","*LAB FOR CH 233 FOR CHEM MAJOR","Undergrad","https://secure.oregonstate.edu/ap/cps/documents/view/106486","No Sustainability Content"]
[null,"CH","CH",331,"CH 331","ORGANIC CHEMISTRY","Undergrad","https://secure.oregonstate.edu/ap/cps/documents/view/124526","No Sustainability Content"]
[null,"CH","CH",332,"CH 332","ORGANIC CHEMISTRY","Undergrad","https://secure.oregonstate.edu/ap/cps/documents/view/124491","No Sustainability Content"]
[null,"CH","CH",337,"CH 337","ORGANIC CHEMISTRY LABORATORY","Undergrad","https://secure.oregonstate.edu/ap/cps/documents/view/115265","No Sustainability Content"]
[null,"CH","CH",361,"CH 361","EXPERIMENTAL CHEMISTRY I","Undergrad","https://secure.oregonstate.edu/ap/cps/documents/view/1909","No Sustainability Content"]
[null,"CH","CH",411,"CH 411","INORGANIC CHEMISTRY","Undergrad","https://secure.oregonstate.edu/ap/cps/documents/view/116173","No Sustainability Content"]
[null,"CH","CH",412,"CH 412","INORGANIC CHEMISTRY","Undergrad","https://secure.oregonstate.edu/ap/cps/documents/view/116189","No Sustainability Content"]
[null,"CH","CH",413,"CH 413","Solid State Chemistry","Undergrad","https://secure.oregonstate.edu/ap/cps/documents/view/99940","No Sustainability Content"]
[null,"CH","CH",441,{"$f":"TRIM(C1793)&\" \"&TRIM(D1793)","v":"CH 441"},"PHYSICAL CHEMISTRY","Undergrad","https://secure.oregonstate.edu/ap/cps/documents/view/130248","No Sustainability Content"]
[null,"CH","CH",471,"CH 471","ADVANCED ORGANIC CHEMISTRY. (3 Credits)",{"$f":"IF(D1794>499,\"Grad\", \"Undergrad\")","v":"Undergrad"},"https://catalog.oregonstate.edu/search/?P=CH%20471","No Sustainability Content"]
[null,"CH","CH",490,"CH 490","CMPTR PROG FOR SCIENTISTS","Undergrad","https://catalog.oregonstate.edu/search/?P=CH%20490","No Sustainability Content"]
[null,"CH","CH",511,"CH 511","INORGANIC CHEMISTRY","Grad","https://secure.oregonstate.edu/ap/cps/documents/view/115995","No Sustainability Content"]
[null,"CH","CH",512,"CH 512","INORGANIC CHEMISTRY","Grad","https://secure.oregonstate.edu/ap/cps/documents/view/116176","No Sustainability Content"]
[null,"CH","CH",513,"CH 513","SOLID STATE CHEMISTRY","Grad","https://catalog.oregonstate.edu/search/?P=CH%20513","No Sustainability Content"]
[null,"CH","CH",516,"CH 516","RADIOCHEMISTRY","Grad","https://secure.oregonstate.edu/ap/cps/documents/view/9902","No Sustainability Content"]
[null,"CH","CH",541,{"$f":"TRIM(C1800)&\" \"&TRIM(D1800)","v":"CH 541"},"PHYSICAL CHEMISTRY","Grad","https://secure.oregonstate.edu/ap/cps/documents/view/130248","No Sustainability Content"]
[null,"CH","CH",548,"CH 548","Using Instruments and Online Interactions for Instructional Laboratory Experi-ments in the Physical Sciences","Grad","https://secure.oregonstate.edu/ap/cps/documents/view/109688","No Sustainability Content"]
[null,"CH","CH",571,"CH 571","ADVANCED ORGANIC CHEMISTRY. (3 Credits)","Grad","https://catalog.oregonstate.edu/search/?P=CH%20571","No Sustainability Content"]
[null,"CH","CH",580,"CH 580","Electron Microscopy-I","Grad","https://secure.oregonstate.edu/ap/cps/documents/view/102234","No Sustainability Content"]
[null,"CH","CH",582,"CH 582","CHEMISTRY AND MATERIALS OF BATTERIES AND SUPER CAPACITORS. (3 Credits)","Grad","https://secure.oregonstate.edu/ap/cps/documents/view/112368","No Sustainability Content"]
[null,"CH","CH",584,"CH 584","INSTRUMENTS ONLINE INTERACTION","Grad","https://secure.oregonstate.edu/ap/cps/documents/view/112614","No Sustainability Content"]
[null,"CH","CH",590,"CH 590","CMPTR PROG FOR SCIENTISTS","Grad","https://catalog.oregonstate.edu/search/?P=CH%20590","No Sustainability Content"]
[null,"CH","CH",614,"CH 614","ST/INORGANIC CHEMISTRY","Grad","https://secure.oregonstate.edu/ap/cps/documents/view/1758","No Sustainability Content"]
[null,"CH","CH",615,"CH 615","SELECTED TOPICS INORGANIC CHEM","Grad","https://secure.oregonstate.edu/ap/cps/documents/view/112955","No Sustainability Content"]
[null,"CH","CH",616,{"$f":"TRIM(C1809)&\" \"&TRIM(D1809)","v":"CH 616"},"DIFFRACTION","Grad","https://secure.oregonstate.edu/ap/cps/documents/view/132925","No Sustainability Content"]
[null,"CH","CH",631,"CH 631","ADVANCED ORGANIC CHEMISTRY","Grad","https://secure.oregonstate.edu/ap/cps/documents/view/101796","No Sustainability Content"]
[null,"CH","CH",633,"CH 633","ARGUMENT IN ORGANIC CHEMISTRY","Grad","https://secure.oregonstate.edu/ap/cps/documents/view/3476","No Sustainability Content"]
[null,"CH","CH",662,"CH 662","ANALYTICAL ELECTROCHEMISTRY","Grad","https://secure.oregonstate.edu/ap/cps/documents/view/4505","No Sustainability Content"]
[null,"CH","CH",697,"CH 697","MASS SPECTRO OF ORGANIC COMPOU","Grad","https://secure.oregonstate.edu/ap/cps/documents/view/99906","No Sustainability Content"]
[null,"CBE","CHE",311,"CHE 311","THERMODYNAMICS","Undergrad","https://secure.oregonstate.edu/ap/cps/documents/view/100909","No Sustainability Content"]
[null,"CBE","CHE",312,"CHE 312","CHEMICAL ENGR THERMODYNAMICS","Undergrad","https://secure.oregonstate.edu/ap/cps/documents/view/5799","No Sustainability Content"]
[null,"CBE","CHE",320,"CHE 320","SAFETY, ENGINEERING ETHICS AND","Undergrad","https://secure.oregonstate.edu/ap/cps/documents/view/107749","No Sustainability Content"]
[null,"CBE","CHE",331,"CHE 331","TRANSPORT PHENOMENA I","Undergrad","https://secure.oregonstate.edu/ap/cps/documents/view/100682","No Sustainability Content"]
[null,"CBE","CHE",332,"CHE 332","TRANSPORT PHENOMENA II","Undergrad","https://secure.oregonstate.edu/ap/cps/documents/view/106596","No Sustainability Content"]
[null,"CBE","CHE",333,"CHE 333","TRANSPORT PHENOMENA III","Undergrad","https://secure.oregonstate.edu/ap/cps/documents/view/105254","No Sustainability Content"]
[null,"CBE","CHE",334,"CHE 334","TRANSPORT PHENOMENA LABORATORY","Undergrad","https://secure.oregonstate.edu/ap/cps/documents/view/121398","No Sustainability Content"]
[null,"CBE","CHE",361,"CHE 361","CHEMICAL DYNAMICS & SIMULATION","Undergrad","https://secure.oregonstate.edu/ap/cps/documents/view/100910","No Sustainability Content"]
[null,"CBE","CHE",411,"CHE 411","MASS TRANSFER OPERATIONS","Undergrad","https://secure.oregonstate.edu/ap/cps/documents/view/5418","No Sustainability Content"]
[null,"CBE","CHE",415,"CHE 415","CHEMICAL ENGINEERING LAB I","Undergrad","https://secure.oregonstate.edu/ap/cps/documents/view/5039","No Sustainability Content"]
[null,"CBE","CHE",443,"CHE 443","CHEMICAL REACTION ENGINEERING","Undergrad","https://secure.oregonstate.edu/ap/cps/documents/view/121469","No Sustainability Content"]
[null,"CBE","CHE",452,"CHE 452","ELECTROCHEMICAL ENERGY SYSTEMS. (3 Credits)","Undergrad","https://secure.oregonstate.edu/ap/cps/documents/view/131900","No Sustainability Content"]
[null,"CBE","CHE",461,"CHE 461","PROCESS CONTROL","Undergrad","https://secure.oregonstate.edu/ap/cps/documents/view/5044","No Sustainability Content"]
[null,"CBE","CHE",552,"CHE 552","ELECTROCHEMICAL ENERGY SYSTEMS. (3 Credits)","Grad","https://secure.oregonstate.edu/ap/cps/documents/view/131900","No Sustainability Content"]
[null,"CBE","CHE",611,{"$f":"TRIM(C1828)&\" \"&TRIM(D1828)","v":"CHE 611"},"ELECTRONIC MATERIAL PROCESSING","Grad","https://secure.oregonstate.edu/ap/cps/documents/view/10074","No Sustainability Content"]
[null,"CBE","CHE",612,"CHE 612","PROCESS INTEGRATION. (3 Credits)","Grad","https://secure.oregonstate.edu/ap/cps/documents/view/10075","No Sustainability Content"]
[null,"CBE","CHE",613,"CHE 613","ELECTRON MATERIALS & CHARACTER","Grad","https://secure.oregonstate.edu/ap/cps/documents/view/10076","No Sustainability Content"]
[null,"SLCS","CHN",111,"CHN 111","FIRST-YEAR CHINESE","Undergrad","https://secure.oregonstate.edu/ap/cps/documents/view/117235","No Sustainability Content"]
[null,"SLCS","CHN",112,{"$f":"TRIM(C1832)&\" \"&TRIM(D1832)","v":"CHN 112"},"FIRST-YEAR CHINESE","Undergrad","https://secure.oregonstate.edu/ap/cps/documents/view/117237","No Sustainability Content"]
[null,"SLCS","CHN",113,"CHN 113","FIRST-YEAR CHINESE","Undergrad","https://secure.oregonstate.edu/ap/cps/documents/view/117584","No Sustainability Content"]
[null,"SLCS","CHN",212,"CHN 212","SECOND-YEAR CHINESE","Undergrad","https://secure.oregonstate.edu/ap/cps/documents/view/116877","No Sustainability Content"]
[null,"SLCS","CHN",213,"CHN 213","SECOND-YEAR CHINESE","Undergrad","https://secure.oregonstate.edu/ap/cps/documents/view/116878","No Sustainability Content"]
[null,"SLCS","CHN",311,"CHN 311","THIRD-YEAR CHINESE LANGUAGE","Undergrad","https://secure.oregonstate.edu/ap/cps/documents/view/111052","No Sustainability Content"]
[null,"SLCS","CHN",312,"CHN 312","THIRD-YEAR CHINESE LANGUAGE","Undergrad","https://secure.oregonstate.edu/ap/cps/documents/view/111210","No Sustainability Content"]
[null,"SLCS","CHN",313,"CHN 313","THIRD-YEAR CHINESE LANGUAGE","Undergrad","https://secure.oregonstate.edu/ap/cps/documents/view/111213","No Sustainability Content"]
[null,"SLCS","CHN",331,"CHN 331","Chinese Culture ","Undergrad","https://secure.oregonstate.edu/ap/cps/documents/view/124517","No Sustainability Content"]
[null,"SLCS","CHN",332,"CHN 332","Chinese Culture ","Undergrad","https://secure.oregonstate.edu/ap/cps/documents/view/123376","No Sustainability Content"]
[null,"SLCS","CHN",333,"CHN 333","Chinese Culture ","Undergrad","https://secure.oregonstate.edu/ap/cps/documents/view/123372","No Sustainability Content"]
[null,"SLCS","CHN",345,"CHN 345","MULTIMODAL LITERACIES: CHINESE. (2 Credits)","Undergrad","https://secure.oregonstate.edu/ap/cps/documents/view/113937","No Sustainability Content"]
[null,"SAC","COMM",211,"COMM 211","*COMMUNICATING ONLINE","Undergrad","https://secure.oregonstate.edu/ap/cps/documents/view/120705","No Sustainability Content"]
[null,"SAC","COMM",323,"COMM 323","COMMUNITY DIALOGUE. (4 Credits)","Undergrad","https://secure.oregonstate.edu/ap/cps/documents/view/113440","No Sustainability Content"]
[null,"SAC","COMM",388,"COMM 388","SOCIAL MEDIA AND INTERPERSONAL RELATIONSHIPS. (3 Credits)","Undergrad","https://secure.oregonstate.edu/ap/cps/documents/view/124248","No Sustainability Content"]
[null,"SAC","COMM",435,"COMM 435","SCIENTIFIC, TECHNICAL, & PROFESSIONAL COMMUNICATION CAPSTONE. (1 Credit)","Undergrad","https://secure.oregonstate.edu/ap/cps/documents/view/122161","No Sustainability Content"]
[null,"SAC","COMM",470,"COMM 470","HISTORY OF SPEECH COMMUNICATION. (3 Credits)","Undergrad","https://secure.oregonstate.edu/ap/cps/documents/view/119867","No Sustainability Content"]
[null,"SAC","COMM",550,"COMM 550","COMMUNICATION AND THE PRACTICE OF SCIENCE. (3 Credits)","Grad","https://secure.oregonstate.edu/ap/cps/documents/view/104079","No Sustainability Content"]
[null,"SAC","COMM",565,"COMM 565","RESEARCH METHODS IN RHETORIC. (3 Credits)","Grad","https://secure.oregonstate.edu/ap/cps/documents/view/127658","No Sustainability Content"]
[null,"SAC","COMM",590,"COMM 590","GRADUATE SEMINAR IN RHETORIC. (3 Credits)","Grad","https://secure.oregonstate.edu/ap/cps/documents/view/127561","No Sustainability Content"]
[null,"COUN","COUN",421,"COUN 421","PERSONAL GROWTH AND WELLNESS IN THE MODERN WORLD. (3 Credits)","Undergrad","https://secure.oregonstate.edu/ap/cps/documents/view/129858","No Sustainability Content"]
[null,"COUN","COUN",520,"COUN 520","INTRODUCTION TO GRADUATE STUDY IN SPEECH COMMUNICATION","Grad","https://secure.oregonstate.edu/ap/cps/documents/view/127559 ","No Sustainability Content"]
[null,"COUN","COUN",562,"COUN 562","INTRO TO COUNSELING RESEARCH","Grad","https://secure.oregonstate.edu/ap/cps/documents/view/123733","No Sustainability Content"]
[null,"COUN","COUN",591,{"$f":"TRIM(C1854)&\" \"&TRIM(D1854)","v":"COUN 591"},"INSTRUCTIONAL STRATEGIES","Grad","https://secure.oregonstate.edu/ap/cps/documents/view/129502 ","No Sustainability Content"]
[null,"CSS","CROP",101,{"$f":"TRIM(C1855)&\" \"&TRIM(D1855)","v":"CROP 101"},"INTRO TO CROP, SOIL, INSECT","Undergrad","https://secure.oregonstate.edu/ap/cps/documents/view/132079","No Sustainability Content"]
[null,"CSS","CROP",319,"CROP 319","PRIN OF FIELD CROP PRODUCTION","Undergrad","https://secure.oregonstate.edu/ap/cps/documents/view/108402","No Sustainability Content"]
[null,"CSS","CROP",407,"CROP 407","SEMINAR","Undergrad","https://secure.oregonstate.edu/ap/cps/documents/view/110133","No Sustainability Content"]
[null,"EECS","CS",151,"CS 151","INTRODUCTION TO PROGRAMMING I WITH EMBEDDED CONTROL LAB. (4 Credits)",{"$f":"IF(D1858>499,\"Grad\", \"Undergrad\")","v":"Undergrad"},"https://secure.oregonstate.edu/ap/cps/documents/view/101748","No Sustainability Content"]
[null,"EECS","CS",160,"CS 160","COMPUTER SCIENCE ORIENTATION","Undergrad","https://secure.oregonstate.edu/ap/cps/documents/view/114008","No Sustainability Content"]
[null,"EECS","CS",161,"CS 161","INTRO TO COMPUTER SCIENCE I","Undergrad","https://secure.oregonstate.edu/ap/cps/documents/view/122731","No Sustainability Content"]
[null,"EECS","CS",162,"CS 162","INTRO TO COMPUTER SCIENCE II","Undergrad","https://secure.oregonstate.edu/ap/cps/documents/view/122732","No Sustainability Content"]
[null,"EECS","CS",165,"CS 165","ACCELERATED INTRO TO COMP SCI","Undergrad","https://secure.oregonstate.edu/ap/cps/documents/view/110937","No Sustainability Content"]
[null,"EECS","CS",201,{"$f":"TRIM(C1863)&\" \"&TRIM(D1863)","v":"CS 201"},"COMP PROGRAMMING NON-CS MAJORS","Undergrad","https://secure.oregonstate.edu/ap/cps/documents/view/128175","No Sustainability Content"]
[null,"EECS","CS",225,"CS 225","DISCRETE STRUCTURES IN CS","Undergrad","https://secure.oregonstate.edu/ap/cps/documents/view/112096","No Sustainability Content"]
[null,"EECS","CS",261,"CS 261","DATA STRUCTURES","Undergrad","https://secure.oregonstate.edu/ap/cps/documents/view/117224","No Sustainability Content"]
[null,"EECS","CS",271,"CS 271","COMPUTER ARCH & ASSEM LANGUAGE","Undergrad","https://secure.oregonstate.edu/ap/cps/documents/view/108330","No Sustainability Content"]
[null,"EECS","CS",278,"CS 278","Network Security","Undergrad","https://secure.oregonstate.edu/ap/cps/documents/view/121534  ","No Sustainability Content"]
[null,"EECS","CS",290,"CS 290","WEB DEVELOPMENT","Undergrad","https://secure.oregonstate.edu/ap/cps/documents/view/117158","No Sustainability Content"]
[null,"EECS","CS",311,"CS 311","Operating Systems I","Undergrad","https://secure.oregonstate.edu/ap/cps/documents/view/104723","No Sustainability Content"]
[null,"EECS","CS",312,{"$f":"TRIM(C1870)&\" \"&TRIM(D1870)","v":"CS 312"},"SYSTEM ADMINISTRATION","Undergrad","https://secure.oregonstate.edu/ap/cps/documents/view/128987","No Sustainability Content"]
[null,"EECS","CS",321,"CS 321","INTRO TO THEORY OF COMPUTATION","Undergrad","https://secure.oregonstate.edu/ap/cps/documents/view/117164","No Sustainability Content"]
[null,"EECS","CS",325,"CS 325","ANALYSIS OF ALGORITHMS","Undergrad","https://secure.oregonstate.edu/ap/cps/documents/view/117256","No Sustainability Content"]
[null,"EECS","CS",331,"CS 331","INTRO ARTIFICIAL INTELLIGENCE","Undergrad","https://secure.oregonstate.edu/ap/cps/documents/view/7045","No Sustainability Content"]
[null,"EECS","CS",340,"CS 340","INTRODUCTION TO DATABASES","Undergrad","https://secure.oregonstate.edu/ap/cps/documents/view/121539","No Sustainability Content"]
[null,"EECS","CS",344,"CS 344","OPERATING SYSTEMS I","Undergrad","https://secure.oregonstate.edu/ap/cps/documents/view/114292","No Sustainability Content"]
[null,"EECS","CS",352,"CS 352","INTRO TO USABILITY ENGINEERING","Undergrad","https://secure.oregonstate.edu/ap/cps/documents/view/108328","No Sustainability Content"]
[null,"EECS","CS",361,"CS 361","SOFTWARE ENGINEERING I","Undergrad","https://secure.oregonstate.edu/ap/cps/documents/view/126086","No Sustainability Content"]
[null,"EECS","CS",362,"CS 362","SOFTWARE ENGINEERING II","Undergrad","https://secure.oregonstate.edu/ap/cps/documents/view/102098","No Sustainability Content"]
[null,"EECS","CS",370,"CS 370","INTRODUCTION TO SECURITY","Undergrad","https://secure.oregonstate.edu/ap/cps/documents/view/119265","No Sustainability Content"]
[null,"EECS","CS",372,"CS 372","INTRO TO COMPUTER NETWORKS","Undergrad","https://catalog.oregonstate.edu/search/?P=CS%20372","No Sustainability Content"]
[null,"EECS","CS",373,"CS 373","DEFENSE AGAINST THE DARK ARTS","Undergrad","https://secure.oregonstate.edu/ap/cps/documents/view/126074","No Sustainability Content"]
[null,"EECS","CS",381,"CS 381","PROGRAMMING LANGUAGE FUND","Undergrad","https://secure.oregonstate.edu/ap/cps/documents/view/117165","No Sustainability Content"]
[null,"EECS","CS",420,"CS 420","GRAPH THEORY WITH APPLS TO CMP","Undergrad","https://secure.oregonstate.edu/ap/cps/documents/view/117169","No Sustainability Content"]
[null,"EECS","CS",427,"CS 427","CRYPTOGRAPHY","Undergrad","https://secure.oregonstate.edu/ap/cps/documents/view/121879","No Sustainability Content"]
[null,"EECS","CS",434,"CS 434","MACHINE LEARNING & DATA MINING","Undergrad","https://secure.oregonstate.edu/ap/cps/documents/view/7044","No Sustainability Content"]
[null,"EECS","CS",440,"CS 440","DATABASE MANAGEMENT SYSTEMS","Undergrad","https://secure.oregonstate.edu/ap/cps/documents/view/122259","No Sustainability Content"]
[null,"EECS","CS",444,"CS 444","OPERATING SYSTEMS II","Undergrad","https://catalog.oregonstate.edu/search/?P=CS%20444","No Sustainability Content"]
[null,"EECS","CS",446,"CS 446","NETWORKS IN COMPUT BIOLOGY","Undergrad","https://catalog.oregonstate.edu/search/?P=CS%20446","No Sustainability Content"]
[null,"EECS","CS",447,{"$f":"TRIM(C1889)&\" \"&TRIM(D1889)","v":"CS 447"},"WIRELESS EMBEDDED SYSTEMS","Undergrad","https://secure.oregonstate.edu/ap/cps/documents/view/127530","No Sustainability Content"]
[null,"EECS","CS",450,"CS 450","INTRO TO COMPUTER GRAPHICS","Undergrad","https://catalog.oregonstate.edu/search/?P=CS%20450","No Sustainability Content"]
[null,"EECS","CS",453,"CS 453","SCIENTIFIC VISUALIZATION. (4 Credits)","Undergrad","https://secure.oregonstate.edu/ap/cps/documents/view/126077","No Sustainability Content"]
[null,"EECS","CS",457,"CS 457","COMPUTER GRAPHICS SHADERS","Undergrad","https://catalog.oregonstate.edu/search/?P=CS%20457","No Sustainability Content"]
[null,"EECS","CS",461,"CS 461","^SENIOR SOFTWARE ENGIN PROJECT","Undergrad","https://secure.oregonstate.edu/ap/cps/documents/view/105385","No Sustainability Content"]
[null,"EECS","CS",462,"CS 462","^SENIOR SOFTWARE ENGIN PROJECT","Undergrad","https://secure.oregonstate.edu/ap/cps/documents/view/105418","No Sustainability Content"]
[null,"EECS","CS",463,"CS 463","SOFTWARE ENGINEERING PROJECT","Undergrad","https://secure.oregonstate.edu/ap/cps/documents/view/105387","No Sustainability Content"]
[null,"EECS","CS",464,"CS 464","OPEN SOURCE SOFTWARE","Undergrad","https://secure.oregonstate.edu/ap/cps/documents/view/126222","No Sustainability Content"]
[null,"EECS","CS",466,"CS 466","WEB-BASED START-UP PROJECT","Undergrad","https://secure.oregonstate.edu/ap/cps/documents/view/108307","No Sustainability Content"]
[null,"EECS","CS",467,"CS 467","ONLINE CAPSTONE PROJECT","Undergrad","https://secure.oregonstate.edu/ap/cps/documents/view/126221","No Sustainability Content"]
[null,"EECS","CS",468,"CS 468","INCLUSIVE DESIGN (HCI). (4 Credits)","Undergrad","https://secure.oregonstate.edu/ap/cps/documents/view/129035","No Sustainability Content"]
[null,"EECS","CS",475,"CS 475","INTRO TO PARALLEL PROGRAMMING","Undergrad","https://catalog.oregonstate.edu/search/?P=CS%20475","No Sustainability Content"]
[null,"EECS","CS",476,"CS 476","ADVANCED COMPUTER NETWORKING","Undergrad","https://catalog.oregonstate.edu/search/?P=CS%20476","No Sustainability Content"]
[null,"EECS","CS",478,"CS 478","NETWORK SECURITY","Undergrad","https://catalog.oregonstate.edu/search/?P=CS%20478","No Sustainability Content"]
[null,"EECS","CS",480,"CS 480","TRANSLATORS","Undergrad","https://secure.oregonstate.edu/ap/cps/documents/view/7584","No Sustainability Content"]
[null,"EECS","CS",491,"CS 491","COMPUTER SCIENCE SKILLS FOR SIMULATION AND GAME PROGRAMMING. (4 Credits)","Undergrad","https://secure.oregonstate.edu/ap/cps/documents/view/117167","No Sustainability Content"]
[null,"EECS","CS",492,{"$f":"TRIM(C1905)&\" \"&TRIM(D1905)","v":"CS 492"},"MOBILE SOFTWARE DEVELOPMENT","Undergrad","https://secure.oregonstate.edu/ap/cps/documents/view/130519","No Sustainability Content"]
[null,"EECS","CS",493,{"$f":"TRIM(C1906)&\" \"&TRIM(D1906)","v":"CS 493"},"CLOUD APPLICATION DEVELOPMENT","Undergrad","https://secure.oregonstate.edu/ap/cps/documents/view/130518","No Sustainability Content"]
[null,"EECS","CS",496,"CS 496","MOBILE/CLOUD SOFTWARE DEVEL","Undergrad","https://secure.oregonstate.edu/ap/cps/documents/view/105431","No Sustainability Content"]
[null,"EECS","CS",511,"CS 511","PROGRAMMING AND DATA STRUCTURES. (4 Credits)","Grad","https://secure.oregonstate.edu/ap/cps/documents/view/133915","No Sustainability Content"]
[null,"EECS","CS",512,"CS 512","DATA SCIENCE TOOLS AND PROGRAMMING. (4 Credits)","Grad","https://secure.oregonstate.edu/ap/cps/documents/view/131972","No Sustainability Content"]
[null,"EECS","CS",515,"CS 515","ALGORITHMS & DATA STRUCTURES","Grad","https://secure.oregonstate.edu/ap/cps/documents/view/111881","No Sustainability Content"]
[null,"EECS","CS",517,"CS 517","THEORY OF COMPUTATION","Grad","https://secure.oregonstate.edu/ap/cps/documents/view/100618","No Sustainability Content"]
[null,"EECS","CS",527,"CS 527","ERROR-CORRECTING CODES","Grad","https://secure.oregonstate.edu/ap/cps/documents/view/10250","No Sustainability Content"]
[null,"EECS","CS",531,"CS 531","ARTIFICIAL INTELLIGENCE","Grad","https://secure.oregonstate.edu/ap/cps/documents/view/101972","No Sustainability Content"]
[null,"EECS","CS",535,{"$f":"TRIM(C1914)&\" \"&TRIM(D1914)","v":"CS 535"},"DEEP LEARNING","Grad","https://secure.oregonstate.edu/ap/cps/documents/view/128169 ","No Sustainability Content"]
[null,"EECS","CS",536,"CS 536","PROBABILISTIC GRAPHICAL MODELS. (4 Credits)","Grad","https://secure.oregonstate.edu/ap/cps/documents/view/111983","No Sustainability Content"]
[null,"EECS","CS",537,"CS 537","COMPUTER VISION I. (3 Credits)","Grad","https://secure.oregonstate.edu/ap/cps/documents/view/131624","No Sustainability Content"]
[null,"EECS","CS",544,"CS 544","OPERATING SYSTEMS II","Grad","https://catalog.oregonstate.edu/search/?P=CS%20544","No Sustainability Content"]
[null,"EECS","CS",546,"CS 546","NETWORKS IN COMPUT BIOLOGY","Grad","https://catalog.oregonstate.edu/search/?P=CS%20546","No Sustainability Content"]
[null,"EECS","CS",550,"CS 550","INTRO TO COMPUTER GRAPHICS","Grad","https://catalog.oregonstate.edu/search/?P=CS%20550","No Sustainability Content"]
[null,"EECS","CS",553,"CS 553","SCIENTIFIC VISUALIZATION. (4 Credits)","Grad","https://secure.oregonstate.edu/ap/cps/documents/view/126077","No Sustainability Content"]
[null,"EECS","CS",554,"CS 554","GEOMETRIC MODELING/COMP GRAPH","Grad","https://secure.oregonstate.edu/ap/cps/documents/view/3498","No Sustainability Content"]
[null,"EECS","CS",556,"CS 556","COMPUTER VISION. (4 Credits)",{"$f":"IF(D1922>499,\"Grad\", \"Undergrad\")","v":"Grad"},"https://secure.oregonstate.edu/ap/cps/documents/view/10251","No Sustainability Content"]
[null,"EECS","CS",557,"CS 557","COMPUTER GRAPHICS SHADERS","Grad","https://catalog.oregonstate.edu/search/?P=CS%20557","No Sustainability Content"]
[null,"EECS","CS",560,"CS 560","DATA-DRIVEN SOFTWARE ENGINEERING. (4 Credits)","Grad","https://secure.oregonstate.edu/ap/cps/documents/view/128171","No Sustainability Content"]
[null,"EECS","CS",561,{"$f":"TRIM(C1925)&\" \"&TRIM(D1925)","v":"CS 561"},"SOFTWARE ENGINEERING METHODS","Grad","https://secure.oregonstate.edu/ap/cps/documents/view/128889 ","No Sustainability Content"]
[null,"EECS","CS",562,{"$f":"TRIM(C1926)&\" \"&TRIM(D1926)","v":"CS 562"},"SOFTWARE PROJECT MANAGEMENT","Grad","https://secure.oregonstate.edu/ap/cps/documents/view/128890","No Sustainability Content"]
[null,"EECS","CS",563,{"$f":"TRIM(C1927)&\" \"&TRIM(D1927)","v":"CS 563"},"SOFTWARE MAINTENANCE/EVOLUTION","Grad","https://secure.oregonstate.edu/ap/cps/documents/view/128891","No Sustainability Content"]
[null,"EECS","CS",564,"CS 564","FIELD STUDIES IN SE AND HCI. (4 Credits)","Grad","https://secure.oregonstate.edu/ap/cps/documents/view/127636","No Sustainability Content"]
[null,"EECS","CS",565,{"$f":"TRIM(C1929)&\" \"&TRIM(D1929)","v":"CS 565"},"HUMAN-COMPUTER INTERACTION","Grad","https://secure.oregonstate.edu/ap/cps/documents/view/127975","No Sustainability Content"]
[null,"EECS","CS",567,{"$f":"TRIM(C1930)&\" \"&TRIM(D1930)","v":"CS 567"},"LAB STUDIES IN SE AND HCI","Grad","https://secure.oregonstate.edu/ap/cps/documents/view/128393","No Sustainability Content"]
[null,"EECS","CS",568,"CS 568","INCLUSIVE DESIGN (HCL). (4 Credits)","Grad","https://secure.oregonstate.edu/ap/cps/documents/view/129035","No Sustainability Content"]
[null,"EECS","CS",572,"CS 572","COMPUTER ARCHITECTURE","Grad","https://catalog.oregonstate.edu/search/?P=CS%20572","No Sustainability Content"]
[null,"EECS","CS",575,"CS 575","INTRO TO PARALLEL PROGRAMMING","Grad","https://catalog.oregonstate.edu/search/?P=CS%20575","No Sustainability Content"]
[null,"EECS","CS",576,"CS 576","ADVANCED COMPUTER NETWORKING","Grad","https://catalog.oregonstate.edu/search/?P=CS%20576","No Sustainability Content"]
[null,"EECS","CS",578,"CS 578","CYBER-SECURITY","Grad","https://catalog.oregonstate.edu/search/?P=CS%20578","No Sustainability Content"]
[null,"EECS","CS",581,"CS 581","PROGRAMMING LANGUAGES I","Grad","https://secure.oregonstate.edu/ap/cps/documents/view/123408","No Sustainability Content"]
[null,"EECS","CS",582,"CS 582","PROGRAMMING LANGUAGES II","Grad","https://secure.oregonstate.edu/ap/cps/documents/view/123409","No Sustainability Content"]
[null,"EECS","CS",583,"CS 583","ADVANCED FUNCTIONAL PROGRAMMING. (4 Credits)","Grad","https://secure.oregonstate.edu/ap/cps/documents/view/123410","No Sustainability Content"]
[null,"EECS","CS",585,"CS 585","DOMAIN-SPECIFIC LANGUAGES","Grad","https://secure.oregonstate.edu/ap/cps/documents/view/123576","No Sustainability Content"]
[null,"EECS","CS",637,"CS 637","COMPUTER VISION II. (4 Credits)","Grad","https://secure.oregonstate.edu/ap/cps/documents/view/125853","No Sustainability Content"]
[null,"SLCS","CSSA",515,{"$f":"TRIM(C1941)&\" \"&TRIM(D1941)","v":"CSSA 515"},"ADV RESEARCH LITERATURE REVIEW","Grad","https://secure.oregonstate.edu/ap/cps/documents/view/130002 ","No Sustainability Content"]
[null,"SLCS","CSSA",530,"CSSA 530","FUNDAMENTALS OF COUNSELING. (3 Credits)","Grad","https://secure.oregonstate.edu/ap/cps/documents/view/132530","No Sustainability Content"]
[null,"SLCS","CSSA",553,{"$f":"TRIM(C1943)&\" \"&TRIM(D1943)","v":"CSSA 553"},"STUDENT DEVELOPMENT THEORY II","Grad","https://secure.oregonstate.edu/ap/cps/documents/view/130110","No Sustainability Content"]
[null,"BA","DHE",121,"DHE 121","Computer Design for Apparel","Undergrad","https://secure.oregonstate.edu/ap/cps/documents/view/10018","No Sustainability Content"]
[null,"BA","DHE",160,"DHE 160","DESIGN PERSPECTIVES. (4 Credits)","Undergrad","https://secure.oregonstate.edu/ap/cps/documents/view/114710","No Sustainability Content"]
[null,"BA","DHE",161,"DHE 161","DESIGN EXPLORATIONS. (4 Credits)","Undergrad","https://secure.oregonstate.edu/ap/cps/documents/view/110732","No Sustainability Content"]
[null,"BA","DHE",162,"DHE 162","Design Collaborations","Undergrad","https://secure.oregonstate.edu/ap/cps/documents/view/110733","No Sustainability Content"]
[null,"BA","DHE",181,"DHE 181","INTRODUCTION TO INTERIOR DESIGN. (3 Credits)","Undergrad","https://secure.oregonstate.edu/ap/cps/documents/view/117056","No Sustainability Content"]
[null,"BA","DHE",187,"DHE 187","INTRODUCTION TO DESIGN COMMUNICATION. (0-3 Credits)","Undergrad","https://secure.oregonstate.edu/ap/cps/documents/view/109979","No Sustainability Content"]
[null,"BA","DHE",221,"DHE 221","Computer Aided Apparel Design 1","Undergrad","https://secure.oregonstate.edu/ap/cps/documents/view/116975","No Sustainability Content"]
[null,"BA","DHE",227,"DHE 227","APPAREL DESIGN AND PRODUCTION 1. (4 Credits)","Undergrad","https://secure.oregonstate.edu/ap/cps/documents/view/120270","No Sustainability Content"]
[null,"BA","DHE",233,"DHE 233","HISTORY OF CONTEMPORARY FASHION. (4 Credits)","Undergrad","https://secure.oregonstate.edu/ap/cps/documents/view/116976","No Sustainability Content"]
[null,"BA","DHE",240,"DHE 240","Survey of Design in the Near Environment","Undergrad","https://secure.oregonstate.edu/ap/cps/documents/view/6126","No Sustainability Content"]
[null,"BA","DHE",242,"DHE 242","INTRODUCTION TO SOFTGOODS MERCHANDSNG. (4 Credits)","Undergrad","https://secure.oregonstate.edu/ap/cps/documents/view/121500","No Sustainability Content"]
[null,"BA","DHE",245,"DHE 245","Applications of Design Theory","Undergrad","https://secure.oregonstate.edu/ap/cps/documents/view/6127","No Sustainability Content"]
[null,"BA","DHE",255,"DHE 255","Fundamentals of Textiles","Undergrad","https://secure.oregonstate.edu/ap/cps/documents/view/116943","No Sustainability Content"]
[null,"BA","DHE",262,"DHE 262","HUMAN-CENTERED RESEARCH IN DESIGN AND MERCHANDISING. (4 Credits)","Undergrad","https://secure.oregonstate.edu/ap/cps/documents/view/116982","No Sustainability Content"]
[null,"BA","DHE",271,"DHE 271","INTRODUCTION TO RETAIL BUYING. (3 Credits)","Undergrad","https://secure.oregonstate.edu/ap/cps/documents/view/110956","No Sustainability Content"]
[null,"BA","DHE",276,"DHE 276","INTRODUCTION TO MERCHANDISING MANAGEMENT. (4 Credits)","Undergrad","https://secure.oregonstate.edu/ap/cps/documents/view/116979","No Sustainability Content"]
[null,"BA","DHE",281,"DHE 281","DRAWING AND SKETCHING INTERIORS. (4 Credits)","Undergrad","https://secure.oregonstate.edu/ap/cps/documents/view/117049","No Sustainability Content"]
[null,"BA","DHE",287,"DHE 287","STUDIO I: DESIGN COMMUNICATION","Undergrad","https://secure.oregonstate.edu/ap/cps/documents/view/109978","No Sustainability Content"]
[null,"BA","DHE",289,"DHE 289","STUDIO II: RESIDENTIAL SPACE PLANNING. (4 Credits)","Undergrad","https://secure.oregonstate.edu/ap/cps/documents/view/95100","No Sustainability Content"]
[null,"BA","DHE",310,"DHE 310","FIELD EXPERIENCE","Undergrad","https://secure.oregonstate.edu/ap/cps/documents/view/115842","No Sustainability Content"]
[null,"BA","DHE",321,"DHE 321","ILLUSTRATION, PORTFOLIO, AND DESIGN DEVELOPMENT. (3 Credits)","Undergrad","https://secure.oregonstate.edu/ap/cps/documents/view/120266","No Sustainability Content"]
[null,"BA","DHE",327,"DHE 327","APPAREL DESIGN AND PRODUCTION 2. (4 Credits)","Undergrad","https://secure.oregonstate.edu/ap/cps/documents/view/120264","No Sustainability Content"]
[null,"BA","DHE",328,"DHE 328","COMPUTER-AIDED PATTERN DEVELOPMENT. (3 Credits)","Undergrad","https://secure.oregonstate.edu/ap/cps/documents/view/109687","No Sustainability Content"]
[null,"BA","DHE",334,"DHE 334","FASHION HISTORY AND SOCIETY. (4 Credits)","Undergrad","https://secure.oregonstate.edu/ap/cps/documents/view/116977","No Sustainability Content"]
[null,"BA","DHE",352,"DHE 352","TEXTILES FOR INTERIORS","Undergrad","https://secure.oregonstate.edu/ap/cps/documents/view/7298","No Sustainability Content"]
[null,"BA","DHE",376,"DHE 376","RETAIL MERCHANDISE PLANNING AND PRESENTATION. (4 Credits)","Undergrad","https://secure.oregonstate.edu/ap/cps/documents/view/116980","No Sustainability Content"]
[null,"BA","DHE",387,"DHE 387","STUDIO III: ADVANCED DESIGN COMMUNICATION. (4 Credits)","Undergrad","https://secure.oregonstate.edu/ap/cps/documents/view/7553","No Sustainability Content"]
[null,"BA","DHE",410,"DHE 410","Field Experience\nInterior Design\n","Undergrad","https://secure.oregonstate.edu/ap/cps/documents/view/4219","No Sustainability Content"]
[null,"BA","DHE",422,"DHE 422","Special Topics in Design and Human Environment","Undergrad","https://secure.oregonstate.edu/ap/cps/documents/view/10332","No Sustainability Content"]
[null,"BA","DHE",427,"DHE 427","DRAPING. (4 Credits)","Undergrad","https://catalog.oregonstate.edu/search/?P=DHE%20427","No Sustainability Content"]
[null,"BA","DHE",428,"DHE 428","APPAREL PRODUCTION PROCESSES. (4 Credits)","Undergrad","https://catalog.oregonstate.edu/search/?P=DHE%20428","No Sustainability Content"]
[null,"BA","DHE",429,"DHE 429","ADVANCED APPAREL DESIGN. (4 Credits)","Undergrad","https://catalog.oregonstate.edu/search/?P=DHE%20429","No Sustainability Content"]
[null,"BA","DHE",432,"DHE 432","Advanced Housing Design","Undergrad","https://secure.oregonstate.edu/ap/cps/documents/view/7792","No Sustainability Content"]
[null,"BA","DHE",443,"DHE 443","STUDIO VI: COMMERCIAL DESIGN. (4 Credits)","Undergrad","https://secure.oregonstate.edu/ap/cps/documents/view/7557","No Sustainability Content"]
[null,"BA","DHE",453,"DHE 453","PRODUCT QUALITY ASSURANCE. (4 Credits)","Undergrad","https://catalog.oregonstate.edu/search/?P=DHE%20453","No Sustainability Content"]
[null,"BA","DHE",463,"DHE 463","HISTORY OF CONTEMPORARY FASHION. (4 Credits)","Undergrad","https://secure.oregonstate.edu/ap/cps/documents/view/130109","No Sustainability Content"]
[null,"BA","DHE",472,"DHE 472","MERCHANDISE PLANNING AND CONTROL. (4 Credits)","Undergrad","https://secure.oregonstate.edu/ap/cps/documents/view/111025","No Sustainability Content"]
[null,"BA","DHE",476,"DHE 476","LINE PLANNING AND PRODUCT DEVELOPMENT. (4 Credits)","Undergrad","https://secure.oregonstate.edu/ap/cps/documents/view/116981","No Sustainability Content"]
[null,"BA","DHE",481,"DHE 481","^PRO PRAC IN HOUS & INT DESIGN","Undergrad","https://catalog.oregonstate.edu/search/?P=DHE%20481","No Sustainability Content"]
[null,"BA","DHE",488,"DHE 488","STUDIO VI: HEALTHCARE DESIGN. (4 Credits)","Undergrad","https://secure.oregonstate.edu/ap/cps/documents/view/117744","No Sustainability Content"]
[null,"BA","DHE",495,"DHE 495","Studio VII: Senior Thesis II","Undergrad","https://secure.oregonstate.edu/ap/cps/documents/view/120127","No Sustainability Content"]
[null,"BA","DHE",527,"DHE 527","Draping","Grad","https://secure.oregonstate.edu/ap/cps/documents/view/7291","No Sustainability Content"]
[null,"BA","DHE",528,"DHE 528","APPAREL PRODUCTION PROCESSES. (4 Credits)",{"$f":"IF(D1986>499,\"Grad\", \"Undergrad\")","v":"Grad"},"https://catalog.oregonstate.edu/search/?P=DHE%20528","No Sustainability Content"]
[null,"BA","DHE",529,"DHE 529","ADVANCED APPAREL DESIGN. (4 Credits)","Grad","https://catalog.oregonstate.edu/search/?P=DHE%20529","No Sustainability Content"]
[null,"BA","DHE",543,"DHE 543","Commercial Design, Studio VI","Grad","https://secure.oregonstate.edu/ap/cps/documents/view/7820","No Sustainability Content"]
[null,"BA","DHE",545,"DHE 545","Advanced Commercial Design, Studio VII","Grad","https://secure.oregonstate.edu/ap/cps/documents/view/5445","No Sustainability Content"]
[null,"BA","DHE",553,"DHE 553","Product Quality Assurance","Grad","https://secure.oregonstate.edu/ap/cps/documents/view/95920","No Sustainability Content"]
[null,"BA","DHE",555,"DHE 555","Functional Textiles","Grad","https://secure.oregonstate.edu/ap/cps/documents/view/108998","No Sustainability Content"]
[null,"BA","DHE",563,"DHE 563","HISTORY OF CONTEMPORARY FASHION. (4 Credits)","Grad","https://secure.oregonstate.edu/ap/cps/documents/view/130109","No Sustainability Content"]
[null,"BA","DHE",572,"DHE 572","MERCHANDISE PLANNING AND CONTROL. (4 Credits)","Grad","https://secure.oregonstate.edu/ap/cps/documents/view/4116","No Sustainability Content"]
[null,"BA","DHE",581,"DHE 581","Professional Practice in Housing and Interior Design ","Grad","https://secure.oregonstate.edu/ap/cps/documents/view/9236","No Sustainability Content"]
[null,"BA","DHE",594,"DHE 594","RESEARCH METHODS IN DESIGN AND HUMAN ENVIRONMENT. (3 Credits)","Grad","https://secure.oregonstate.edu/ap/cps/documents/view/5681","No Sustainability Content"]
[null,"BA","DSGN",121,"DSGN 121","COMPUTER AIDED DESIGN. (3 Credits)","Undergrad","https://secure.oregonstate.edu/ap/cps/documents/view/130343","No Sustainability Content"]
[null,"BA","DSGN",226,{"$f":"TRIM(C1997)&\" \"&TRIM(D1997)","v":"DSGN 226"},"SPECIFICATION BUYING","Undergrad","https://secure.oregonstate.edu/ap/cps/documents/view/127540 ","No Sustainability Content"]
[null,"BA","DSGN",244,{"$f":"TRIM(C1998)&\" \"&TRIM(D1998)","v":"DSGN 244"},"COLOR INNOVATION","Undergrad","https://secure.oregonstate.edu/ap/cps/documents/view/126405","No Sustainability Content"]
[null,"BA","DSGN",276,{"$f":"TRIM(C1999)&\" \"&TRIM(D1999)","v":"DSGN 276"},"INTRO TO MERCHANDISING MGMT","Undergrad","https://secure.oregonstate.edu/ap/cps/documents/view/128422","No Sustainability Content"]
[null,"BA","DSGN",281,{"$f":"TRIM(C2000)&\" \"&TRIM(D2000)","v":"DSGN 281"},"DRAWING AND SKETCHING","Undergrad","https://secure.oregonstate.edu/ap/cps/documents/view/128866 ","No Sustainability Content"]
[null,"BA","DSGN",282,"DSGN 282","PERSONAL, PROFESSIONAL, AND LEADERSHIP DEVELOPMENT I. (1 Credit)","Undergrad","https://secure.oregonstate.edu/ap/cps/documents/view/132210","No Sustainability Content"]
[null,"BA","DSGN",283,"DSGN 283","PERSONAL, PROFESSIONAL, AND LEADERSHIP DEVELOPMENT II. (1 Credit)","Undergrad","https://secure.oregonstate.edu/ap/cps/documents/view/132215","No Sustainability Content"]
[null,"BA","DSGN",284,"DSGN 284","PERSONAL, PROFESSIONAL, AND LEADERSHIP DEVELOPMENT III. (1 Credit)","Undergrad","https://secure.oregonstate.edu/ap/cps/documents/view/132217","No Sustainability Content"]
[null,"BA","DSGN",287,"DSGN 287","STUDIO I: DESIGN COMMUNICATION. (4 Credits)","Undergrad","https://secure.oregonstate.edu/ap/cps/documents/view/129185","No Sustainability Content"]
[null,"BA","DSGN",327,{"$f":"TRIM(C2005)&\" \"&TRIM(D2005)","v":"DSGN 327"},"PERFORM APPAREL INNOVATION I","Undergrad","https://secure.oregonstate.edu/ap/cps/documents/view/127938","No Sustainability Content"]
[null,"BA","DSGN",328,{"$f":"TRIM(C2006)&\" \"&TRIM(D2006)","v":"DSGN 328"},"DIGITAL DESIGN FOR APPAREL","Undergrad","https://secure.oregonstate.edu/ap/cps/documents/view/127939","No Sustainability Content"]
[null,"BA","DSGN",329,{"$f":"TRIM(C2007)&\" \"&TRIM(D2007)","v":"DSGN 329"},"SPORTSWEAR INDUSTRY COLLAB","Undergrad","https://secure.oregonstate.edu/ap/cps/documents/view/127940","No Sustainability Content"]
[null,"BA","DSGN",330,{"$f":"TRIM(C2008)&\" \"&TRIM(D2008)","v":"DSGN 330"},"^FASHION MARKET ANALYSIS","Undergrad","https://secure.oregonstate.edu/ap/cps/documents/view/129685 ","No Sustainability Content"]
[null,"BA","DSGN",333,"DSGN 333","HISTORY OF CONTEMPORARY FASHION. (4 Credits)","Undergrad","https://secure.oregonstate.edu/ap/cps/documents/view/130109","No Sustainability Content"]
[null,"BA","DSGN",341,{"$f":"TRIM(C2010)&\" \"&TRIM(D2010)","v":"DSGN 341"},"DSGN THINKING & PROCESS INNOV","Undergrad","https://secure.oregonstate.edu/ap/cps/documents/view/126978","No Sustainability Content"]
[null,"BA","DSGN",342,"DSGN 342","INTRODUCTION TO DESIGN MANAGEMENT. (4 Credits)","Undergrad","https://secure.oregonstate.edu/ap/cps/documents/view/133087","No Sustainability Content"]
[null,"BA","DSGN",343,"DSGN 343","IDEA VISUALIZATION. (4 Credits)","Undergrad","https://secure.oregonstate.edu/ap/cps/documents/view/126431","No Sustainability Content"]
[null,"BA","DSGN",355,{"$f":"TRIM(C2013)&\" \"&TRIM(D2013)","v":"DSGN 355"},"SPEC & EVAL OF PERFORMANCE MAT","Undergrad","https://secure.oregonstate.edu/ap/cps/documents/view/128227 ","No Sustainability Content"]
[null,"BA","DSGN",356,"DSGN 356","SPECIFICATION AND EVALUATION OF PERFORMANCE MATERIALS. (3 Credits)","Undergrad","https://secure.oregonstate.edu/ap/cps/documents/view/133804","No Sustainability Content"]
[null,"BA","DSGN",377,"DSGN 377","RETAIL AND MERCHANDISING. (4 Credits)","Undergrad","https://secure.oregonstate.edu/ap/cps/documents/view/129525","No Sustainability Content"]
[null,"BA","DSGN",387,{"$f":"TRIM(C2016)&\" \"&TRIM(D2016)","v":"DSGN 387"},"STUDIO III: ADV DESIGN COMM","Undergrad","https://secure.oregonstate.edu/ap/cps/documents/view/128244","No Sustainability Content"]
[null,"BA","DSGN",427,{"$f":"TRIM(C2017)&\" \"&TRIM(D2017)","v":"DSGN 427"},"PERFORM APPAREL INNOVATION II","Undergrad","https://secure.oregonstate.edu/ap/cps/documents/view/127941","No Sustainability Content"]
[null,"BA","DSGN",428,{"$f":"TRIM(C2018)&\" \"&TRIM(D2018)","v":"DSGN 428"},"TECHSPORTSWEAR SIZE AND FIT","Undergrad","https://secure.oregonstate.edu/ap/cps/documents/view/128008","No Sustainability Content"]
[null,"BA","DSGN",429,{"$f":"TRIM(C2019)&\" \"&TRIM(D2019)","v":"DSGN 429"},"FUNCTION DESIGN & PROD DEVLOP","Undergrad","https://secure.oregonstate.edu/ap/cps/documents/view/127944","No Sustainability Content"]
[null,"BA","DSGN",440,"DSGN 440","DESIGN RESEARCH. (4 Credits)","Undergrad","https://secure.oregonstate.edu/ap/cps/documents/view/126434","No Sustainability Content"]
[null,"BA","DSGN",441,"DSGN 441","SERVICE DESIGN INNOVATION. (4 Credits)","Undergrad","https://secure.oregonstate.edu/ap/cps/documents/view/126435","No Sustainability Content"]
[null,"BA","DSGN",464,"DSGN 464","CONTEMPORARY HISTORY OF INTERIORS AND HOUSING. (3 Credits)","Undergrad","https://secure.oregonstate.edu/ap/cps/documents/view/128241","No Sustainability Content"]
[null,"BA","DSGN",471,"DSGN 471","RETAIL PRESENTATION STRATEGIES. (4 Credits)","Undergrad","https://secure.oregonstate.edu/ap/cps/documents/view/128839","No Sustainability Content"]
[null,"BA","DSGN",472,{"$f":"TRIM(C2024)&\" \"&TRIM(D2024)","v":"DSGN 472"},"MERCHANDISE PLANNING & CONTROL","Undergrad","https://secure.oregonstate.edu/ap/cps/documents/view/129686","No Sustainability Content"]
[null,"BA","DSGN",473,{"$f":"TRIM(C2025)&\" \"&TRIM(D2025)","v":"DSGN 473"},"RETAIL STRATEGIES PRACTICUM","Undergrad","https://secure.oregonstate.edu/ap/cps/documents/view/126438","No Sustainability Content"]
[null,"BA","DSGN",495,{"$f":"TRIM(C2026)&\" \"&TRIM(D2026)","v":"DSGN 495"},"STUDIO VII: SENIOR THESIS II","Undergrad","https://secure.oregonstate.edu/ap/cps/documents/view/129673","No Sustainability Content"]
[null,"LA","EAH",412,"EAH 412","*^ENVIRONMENTAL SCIENCE IN CONTEXT. (4 Credits)","Undergrad","https://secure.oregonstate.edu/ap/cps/documents/view/126407","No Sustainability Content"]
[null,"LA","EAH",512,{"$f":"TRIM(C2028)&\" \"&TRIM(D2028)","v":"EAH 512"},"ENV SCIENCE IN CONTEXT","Grad","https://secure.oregonstate.edu/ap/cps/documents/view/126407","No Sustainability Content"]
[null,"EECS","ECE",111,"ECE 111","INTRODUCTION TO ECE: TOOLS","Undergrad","https://secure.oregonstate.edu/ap/cps/documents/view/6724","No Sustainability Content"]
[null,"EECS","ECE",112,"ECE 112","INTRODUCTION TO ECE: CONCEPTS","Undergrad","https://secure.oregonstate.edu/ap/cps/documents/view/101786","No Sustainability Content"]
[null,"EECS","ECE",151,"ECE 151"," Introduction to Programming I with Embedded Control Lab ","Undergrad","https://secure.oregonstate.edu/ap/cps/documents/view/102677","No Sustainability Content"]
[null,"EECS","ECE",152,"ECE 152","Introduction to Programming II with Embedded Control Lab","Undergrad","https://secure.oregonstate.edu/ap/cps/documents/view/101788","No Sustainability Content"]
[null,"EECS","ECE",271,"ECE 271","DIGITAL LOGIC DESIGN","Undergrad","https://secure.oregonstate.edu/ap/cps/documents/view/6937","No Sustainability Content"]
[null,"EECS","ECE",272,{"$f":"TRIM(C2034)&\" \"&TRIM(D2034)","v":"ECE 272"},"DIGITAL LOGIC DESIGN LAB","Undergrad","https://secure.oregonstate.edu/ap/cps/documents/view/127265","No Sustainability Content"]
[null,"EECS","ECE",322,"ECE 322","ELECTRONICS I","Undergrad","https://secure.oregonstate.edu/ap/cps/documents/view/6938","No Sustainability Content"]
[null,"EECS","ECE",323,{"$f":"TRIM(C2036)&\" \"&TRIM(D2036)","v":"ECE 323"},"ELECTRONICS II","Undergrad","https://secure.oregonstate.edu/ap/cps/documents/view/126940","No Sustainability Content"]
[null,"EECS","ECE",331,"ECE 331","ELECTROMECH ENERGY CONVERSION","Undergrad","https://secure.oregonstate.edu/ap/cps/documents/view/117106","No Sustainability Content"]
[null,"EECS","ECE",341,{"$f":"TRIM(C2038)&\" \"&TRIM(D2038)","v":"ECE 341"},"JUNIOR DESIGN I","Undergrad","https://secure.oregonstate.edu/ap/cps/documents/view/126946 ","No Sustainability Content"]
[null,"EECS","ECE",342,{"$f":"TRIM(C2039)&\" \"&TRIM(D2039)","v":"ECE 342"},"JUNIOR DESIGN II","Undergrad","https://secure.oregonstate.edu/ap/cps/documents/view/126945 ","No Sustainability Content"]
[null,"EECS","ECE",351,"ECE 351","SIGNALS AND SYSTEMS I","Undergrad","https://secure.oregonstate.edu/ap/cps/documents/view/6939","No Sustainability Content"]
[null,"EECS","ECE",352,"ECE 352","SIGNALS AND SYSTEMS II","Undergrad","https://secure.oregonstate.edu/ap/cps/documents/view/6940","No Sustainability Content"]
[null,"EECS","ECE",353,"ECE 353","INTRO TO PROB & RANDOM SIGNALS","Undergrad","https://secure.oregonstate.edu/ap/cps/documents/view/4447","No Sustainability Content"]
[null,"EECS","ECE",372,"ECE 372","INTRO TO COMPUTER NETWORKS","Undergrad","https://catalog.oregonstate.edu/search/?P=ECE%20372","No Sustainability Content"]
[null,"EECS","ECE",375,"ECE 375","COMPUTER ORG & ASSEMBLY LANG","Undergrad","https://secure.oregonstate.edu/ap/cps/documents/view/6941","No Sustainability Content"]
[null,"EECS","ECE",391,"ECE 391","TRANSMISSION LINES","Undergrad","https://secure.oregonstate.edu/ap/cps/documents/view/10351","No Sustainability Content"]
[null,"EECS","ECE",411,"ECE 411","ENGINEERING MAGNETICS. (3 Credits)","Undergrad","https://secure.oregonstate.edu/ap/cps/documents/view/100326","No Sustainability Content"]
[null,"EECS","ECE",413,"ECE 413","SENSORS","Undergrad","https://secure.oregonstate.edu/ap/cps/documents/view/100325","No Sustainability Content"]
[null,"EECS","ECE",415,"ECE 415","MATERIAL SCIENCE OF NANOTECHNOLOGY. (3 Credits)","Undergrad","https://secure.oregonstate.edu/ap/cps/documents/view/117967","No Sustainability Content"]
[null,"EECS","ECE",416,"ECE 416","ELECTRONIC MATERIALS & DEVICES","Undergrad","https://catalog.oregonstate.edu/search/?P=ECE%20416","No Sustainability Content"]
[null,"EECS","ECE",417,"ECE 417","BASIC SEMICONDUCTOR DEVICES",{"$f":"IF(D2050>499,\"Grad\", \"Undergrad\")","v":"Undergrad"},"https://catalog.oregonstate.edu/search/?P=ECE%20417","No Sustainability Content"]
[null,"EECS","ECE",418,"ECE 418","SEMICONDUCTOR PROCESSING","Undergrad","https://catalog.oregonstate.edu/search/?P=ECE%20418","No Sustainability Content"]
[null,"EECS","ECE",422,"ECE 422","CMOS INTEGRATED CIRCUITS I","Undergrad","https://catalog.oregonstate.edu/search/?P=ECE%20422","No Sustainability Content"]
[null,"EECS","ECE",431,"ECE 431","POWER ELECTRONICS","Undergrad","https://catalog.oregonstate.edu/search/?P=ECE%20431","No Sustainability Content"]
[null,"EECS","ECE",432,"ECE 432","DYNAMICS OF ELECTROMECHANICAL ENERGY CONVERSION. (4 Credits)","Undergrad","https://catalog.oregonstate.edu/search/?P=ECE%20432","No Sustainability Content"]
[null,"EECS","ECE",433,"ECE 433","POWER SYSTEM ANALYSIS","Undergrad","https://catalog.oregonstate.edu/search/?P=ECE%20433","No Sustainability Content"]
[null,"EECS","ECE",437,"ECE 437","SMART GRID","Undergrad","https://catalog.oregonstate.edu/search/?P=ECE%20437","No Sustainability Content"]
[null,"EECS","ECE",438,"ECE 438","ELECTRIC AND HYBRID ELECTRIC VEHICLES. (4 Credits)","Undergrad","https://catalog.oregonstate.edu/search/?P=ECE%20438","No Sustainability Content"]
[null,"EECS","ECE",441,"ECE 441","^ENGINEERING DESIGN PROJECT","Undergrad","https://secure.oregonstate.edu/ap/cps/documents/view/114112","No Sustainability Content"]
[null,"EECS","ECE",442,"ECE 442","^ENGINEERING DESIGN PROJECT","Undergrad","https://secure.oregonstate.edu/ap/cps/documents/view/114114","No Sustainability Content"]
[null,"EECS","ECE",451,"ECE 451","SYSTEMS DYNAMICS AND CONTROL","Undergrad","https://secure.oregonstate.edu/ap/cps/documents/view/104353","No Sustainability Content"]
[null,"EECS","ECE",461,"ECE 461","ANALOG & DIGITAL COMMUNICATION","Undergrad","https://catalog.oregonstate.edu/search/?P=ECE%20461","No Sustainability Content"]
[null,"EECS","ECE",462,"ECE 462","DIGITAL COMM & CHANNEL CODING","Undergrad","https://catalog.oregonstate.edu/search/?P=ECE%20462","No Sustainability Content"]
[null,"EECS","ECE",463,"ECE 463","WIRELESS COMMUNICATIONS NETWK","Undergrad","https://catalog.oregonstate.edu/search/?P=ECE%20463","No Sustainability Content"]
[null,"EECS","ECE",464,"ECE 464","DIGITAL SIGNAL PROCESSING","Undergrad","https://catalog.oregonstate.edu/search/?P=ECE%20464","No Sustainability Content"]
[null,"EECS","ECE",468,"ECE 468","DIGITAL IMAGE PROCESSING","Undergrad","https://catalog.oregonstate.edu/search/?P=ECE%20468","No Sustainability Content"]
[null,"EECS","ECE",471,"ECE 471","ENERGY-EFFICIENT VLSI DESIGN","Undergrad","https://catalog.oregonstate.edu/search/?P=ECE%20471","No Sustainability Content"]
[null,"EECS","ECE",473,"ECE 473","MICROCONTROLLER SYSTEM DESIGN","Undergrad","https://catalog.oregonstate.edu/search/?P=ECE%20473","No Sustainability Content"]
[null,"EECS","ECE",474,"ECE 474","VLSI SYSTEM DESIGN","Undergrad","https://catalog.oregonstate.edu/search/?P=ECE%20474","No Sustainability Content"]
[null,"EECS","ECE",476,"ECE 476","ADVANCED COMPUTER NETWORKING","Undergrad","https://catalog.oregonstate.edu/search/?P=ECE%20476","No Sustainability Content"]
[null,"EECS","ECE",477,"ECE 477","MULTIMEDIA SYSTEMS","Undergrad","https://catalog.oregonstate.edu/search/?P=ECE%20477","No Sustainability Content"]
[null,"EECS","ECE",478,"ECE 478","NETWORK SECURITY","Undergrad","https://catalog.oregonstate.edu/search/?P=ECE%20478","No Sustainability Content"]
[null,"EECS","ECE",484,"ECE 484","ANTENNAS AND PROPAGATION","Undergrad","https://catalog.oregonstate.edu/search/?P=ECE%20484","No Sustainability Content"]
[null,"EECS","ECE",485,"ECE 485","MICROWAVE DESIGN TECHNIQUES","Undergrad","https://catalog.oregonstate.edu/search/?P=ECE%20485","No Sustainability Content"]
[null,"EECS","ECE",516,"ECE 516","ELECTRONIC MATERIALS & DEVICES","Grad","https://catalog.oregonstate.edu/search/?P=ECE%20516","No Sustainability Content"]
[null,"EECS","ECE",517,"ECE 517","BASIC SEMICONDUCTOR DEVICES","Grad","https://catalog.oregonstate.edu/search/?P=ECE%20517","No Sustainability Content"]
[null,"EECS","ECE",518,"ECE 518","SEMICONDUCTOR PROCESSING","Grad","https://catalog.oregonstate.edu/search/?P=ECE%20518","No Sustainability Content"]
[null,"EECS","ECE",522,"ECE 522","CMOS INTEGRATED CIRCUITS I","Grad","https://catalog.oregonstate.edu/search/?P=ECE%20522","No Sustainability Content"]
[null,"EECS","ECE",531,"ECE 531","POWER ELECTRONICS","Grad","https://catalog.oregonstate.edu/search/?P=ECE%20531","No Sustainability Content"]
[null,"EECS","ECE",532,"ECE 532","DYNAMICS OF ELECTROMECHANICAL ENERGY CONVERSION. (4 Credits)","Grad","https://catalog.oregonstate.edu/search/?P=ECE%20532","No Sustainability Content"]
[null,"EECS","ECE",533,"ECE 533","POWER SYSTEM ANALYSIS","Grad","https://catalog.oregonstate.edu/search/?P=ECE%20533","No Sustainability Content"]
[null,"EECS","ECE",537,"ECE 537","SMART GRID","Grad","https://catalog.oregonstate.edu/search/?P=ECE%20537","No Sustainability Content"]
[null,"EECS","ECE",538,"ECE 538","ELECTRIC AND HYBRID ELECTRIC VEHICLES. (4 Credits)","Grad","https://catalog.oregonstate.edu/search/?P=ECE%20538","No Sustainability Content"]
[null,"EECS","ECE",561,"ECE 561","ANALOG & DIGITAL COMMUNICATION","Grad","https://catalog.oregonstate.edu/search/?P=ECE%20561","No Sustainability Content"]
[null,"EECS","ECE",562,"ECE 562","DIGITAL COMM & CHANNEL CODING","Grad","https://catalog.oregonstate.edu/search/?P=ECE%20562","No Sustainability Content"]
[null,"EECS","ECE",563,"ECE 563","WIRELESS COMMUNICATIONS NETWK","Grad","https://catalog.oregonstate.edu/search/?P=ECE%20563","No Sustainability Content"]
[null,"EECS","ECE",565,"ECE 565","ESTIMATION, FILTERING, DETECT","Grad","https://secure.oregonstate.edu/ap/cps/documents/view/9462","No Sustainability Content"]
[null,"EECS","ECE",566,"ECE 566","INFORMATION THEORY","Grad","https://secure.oregonstate.edu/ap/cps/documents/view/9519","No Sustainability Content"]
[null,"EECS","ECE",568,"ECE 568","Advanced Digital Image Processing","Grad","https://secure.oregonstate.edu/ap/cps/documents/view/4523","No Sustainability Content"]
[null,"EECS","ECE",571,"ECE 571","ENERGY-EFFICIENT VLSI DESIGN","Grad","https://catalog.oregonstate.edu/search/?P=ECE%20571","No Sustainability Content"]
[null,"EECS","ECE",572,"ECE 572","COMPUTER ARCHITECTURE","Grad","https://catalog.oregonstate.edu/search/?P=ECE%20572","No Sustainability Content"]
[null,"EECS","ECE",573,"ECE 573","MICROCONTROLLER SYSTEM DESIGN","Grad","https://catalog.oregonstate.edu/search/?P=ECE%20573","No Sustainability Content"]
[null,"EECS","ECE",574,"ECE 574","VLSI SYSTEM DESIGN","Grad","https://catalog.oregonstate.edu/search/?P=ECE%20574","No Sustainability Content"]
[null,"EECS","ECE",576,"ECE 576","ADVANCED COMPUTER NETWORKING","Grad","https://catalog.oregonstate.edu/search/?P=ECE%20576","No Sustainability Content"]
[null,"EECS","ECE",577,"ECE 577","MULTIMEDIA SYSTEMS","Grad","https://catalog.oregonstate.edu/search/?P=ECE%20577","No Sustainability Content"]
[null,"EECS","ECE",578,"ECE 578","CYBER-SECURITY","Grad","https://catalog.oregonstate.edu/search/?P=ECE%20578","No Sustainability Content"]
[null,"EECS","ECE",584,"ECE 584","ANTENNAS AND PROPAGATION","Grad","https://catalog.oregonstate.edu/search/?P=ECE%20584","No Sustainability Content"]
[null,"EECS","ECE",585,"ECE 585","MICROWAVE DESIGN TECHNIQUES","Grad","https://catalog.oregonstate.edu/search/?P=ECE%20585","No Sustainability Content"]
[null,"EECS","ECE",611,"ECE 611","ELECTRONIC MATERIAL PROCESSING","Grad","https://secure.oregonstate.edu/ap/cps/documents/view/10154","No Sustainability Content"]
[null,"EECS","ECE",612,"ECE 612","PROCESS INTEGRATION","Grad","https://secure.oregonstate.edu/ap/cps/documents/view/10153","No Sustainability Content"]
[null,"EECS","ECE",613,"ECE 613","ELECTRON MATERIALS & CHARACTER","Grad","https://secure.oregonstate.edu/ap/cps/documents/view/10152","No Sustainability Content"]
[null,"EECS","ECE",614,"ECE 614","SEMICONDUCTORS","Grad","https://secure.oregonstate.edu/ap/cps/documents/view/10077","No Sustainability Content"]
[null,"EECS","ECE",615,"ECE 615","SEMICONDUCTOR DEVICES I. (3 Credits)","Grad","https://secure.oregonstate.edu/ap/cps/documents/view/10078","No Sustainability Content"]
[null,"EECS","ECE",616,"ECE 616","SEMICONDUCTOR DEVICES II. (3 Credits)","Grad","https://secure.oregonstate.edu/ap/cps/documents/view/10079","No Sustainability Content"]
[null,"SPP","ECON",315,"ECON 315","INTER MACROECONOMIC THEORY","Undergrad","https://secure.oregonstate.edu/ap/cps/documents/view/99976","No Sustainability Content"]
[null,"SPP","ECON",350,"ECON 350","FINANCIAL ECONOMICS","Undergrad","https://secure.oregonstate.edu/ap/cps/documents/view/121952","No Sustainability Content"]
[null,"SPP","ECON",411,"ECON 411","ADVANCED MICROECONOMIC THEORY","Undergrad","https://secure.oregonstate.edu/ap/cps/documents/view/100026","No Sustainability Content"]
[null,"SPP","ECON",414,"ECON 414","BEHAVIORAL ECONOMICS. (4 Credits)","Undergrad","https://catalog.oregonstate.edu/search/?P=ECON%20414","No Sustainability Content"]
[null,"SPP","ECON",415,"ECON 415","ADV MACROECONOMIC THEORY","Undergrad","https://secure.oregonstate.edu/ap/cps/documents/view/99974","No Sustainability Content"]
[null,"SPP","ECON",420,{"$f":"TRIM(C2109)&\" \"&TRIM(D2109)","v":"ECON 420"},"GAME THEORY","Undergrad","https://secure.oregonstate.edu/ap/cps/documents/view/126953","No Sustainability Content"]
[null,"SPP","ECON",423,"ECON 423","PRE-ECONOMETRICS","Undergrad","https://secure.oregonstate.edu/ap/cps/documents/view/10042","No Sustainability Content"]
[null,"SPP","ECON",424,"ECON 424","INTRODUCTION TO ECONOMETRICS","Undergrad","https://secure.oregonstate.edu/ap/cps/documents/view/100491","No Sustainability Content"]
[null,"SPP","ECON",427,"ECON 427","INTRO ECONOMETRICS W/ CALCULUS","Undergrad","https://secure.oregonstate.edu/ap/cps/documents/view/121889","No Sustainability Content"]
[null,"SPP","ECON",428,{"$f":"TRIM(C2113)&\" \"&TRIM(D2113)","v":"ECON 428"},"^INTRO TO ECONOMIC RESEARCH","Undergrad","https://secure.oregonstate.edu/ap/cps/documents/view/132340","No Sustainability Content"]
[null,"SPP","ECON",435,"ECON 435","PUBLIC ECONOMICS",{"$f":"IF(D2114>499,\"Grad\", \"Undergrad\")","v":"Undergrad"},"https://catalog.oregonstate.edu/search/?P=ECON%20435","No Sustainability Content"]
[null,"SPP","ECON",440,"ECON 440","ECONOMICS OF GLOBALIZATION. (4 Credits)","Undergrad","https://secure.oregonstate.edu/ap/cps/documents/view/5357","No Sustainability Content"]
[null,"SPP","ECON",460,{"$f":"TRIM(C2116)&\" \"&TRIM(D2116)","v":"ECON 460"},"INDUST ORGANIZ THEORY & POLICY","Undergrad","https://secure.oregonstate.edu/ap/cps/documents/view/130842","No Sustainability Content"]
[null,"SPP","ECON",461,"ECON 461","LAW, ECONOMICS, AND REGULATION","Undergrad","https://catalog.oregonstate.edu/search/?P=ECON%20461","No Sustainability Content"]
[null,"SPP","ECON",462,"ECON 462","MANAGERIAL ECONOMICS","Undergrad","https://catalog.oregonstate.edu/search/?P=ECON%20462","No Sustainability Content"]
[null,"SPP","ECON",480,"ECON 480","LABOR ECONOMICS & SOCIAL POLIC","Undergrad","https://catalog.oregonstate.edu/search/?P=ECON%20480","No Sustainability Content"]
[null,"SPP","ECON",491,"ECON 491","ECONOMICS OF INEQUALITY. (4 Credits)","Undergrad","https://secure.oregonstate.edu/ap/cps/documents/view/132307","No Sustainability Content"]
[null,"SPP","ECON",514,"ECON 514","BEHAVIORAL ECONOMICS. (4 Credits)","Grad","https://catalog.oregonstate.edu/search/?P=ECON%20514","No Sustainability Content"]
[null,"SPP","ECON",520,"ECON 520","GAME THEORY. (4 Credits)","Grad","https://secure.oregonstate.edu/ap/cps/documents/view/126953","No Sustainability Content"]
[null,"SPP","ECON",524,"ECON 524","INTRODUCTION TO ECONOMETRICS","Grad","https://secure.oregonstate.edu/ap/cps/documents/view/100491","No Sustainability Content"]
[null,"SPP","ECON",535,"ECON 535","PUBLIC ECONOMICS","Grad","https://catalog.oregonstate.edu/search/?P=ECON%20535","No Sustainability Content"]
[null,"SPP","ECON",560,{"$f":"TRIM(C2125)&\" \"&TRIM(D2125)","v":"ECON 560"},"INDUST ORGANIZ THEORY & POLICY","Grad","https://secure.oregonstate.edu/ap/cps/documents/view/130842","No Sustainability Content"]
[null,"SPP","ECON",561,"ECON 561","LAW, ECONOMICS, AND REGULATION","Grad","https://catalog.oregonstate.edu/search/?P=ECON%20561","No Sustainability Content"]
[null,"SPP","ECON",562,"ECON 562","MANAGERIAL ECONOMICS","Grad","https://catalog.oregonstate.edu/search/?P=ECON%20562","No Sustainability Content"]
[null,"SPP","ECON",570,"ECON 570","MACROECONOMIC THEORY I. (4 Credits)","Grad","https://secure.oregonstate.edu/ap/cps/documents/view/5791","No Sustainability Content"]
[null,"SPP","ECON",580,"ECON 580","LABOR ECONOMICS & SOCIAL POLIC","Grad","https://catalog.oregonstate.edu/search/?P=ECON%20580","No Sustainability Content"]
[null,"ED","ED",216,{"$f":"TRIM(C2130)&\" \"&TRIM(D2130)","v":"ED 216"},"*PURPOSE OF EDUC IN DEMOCRACY","Undergrad","https://secure.oregonstate.edu/ap/cps/documents/view/129528","No Sustainability Content"]
[null,"ED","ED",219,{"$f":"TRIM(C2131)&\" \"&TRIM(D2131)","v":"ED 219"},"MULTICULTURAL ISSUES IN EDUCAT","Undergrad","https://secure.oregonstate.edu/ap/cps/documents/view/128074","No Sustainability Content"]
[null,"ED","ED",412,{"$f":"TRIM(C2132)&\" \"&TRIM(D2132)","v":"ED 412"},"LEARN STYLES & NEEDS IN ADOLES","Undergrad","https://secure.oregonstate.edu/ap/cps/documents/view/128315 ","No Sustainability Content"]
[null,"ED","ED",413,"ED 413","LEARNING ENVIRONMENTS I: FOSTERING CLASS ENGAGEMENT. (3 Credits)","Undergrad","https://secure.oregonstate.edu/ap/cps/documents/view/133049","No Sustainability Content"]
[null,"ED","ED",414,"ED 414","LEARNING ENVIRONMENTS II: ADVANCING EVERY STUDENT. (2 Credits)","Undergrad","https://secure.oregonstate.edu/ap/cps/documents/view/134052","No Sustainability Content"]
[null,"ED","ED",420,{"$f":"TRIM(C2135)&\" \"&TRIM(D2135)","v":"ED 420"},"CLASSROOM MANAGEMENT","Undergrad","https://secure.oregonstate.edu/ap/cps/documents/view/129044","Unavailable syllabus"]
[null,"ED","ED",429,{"$f":"TRIM(C2136)&\" \"&TRIM(D2136)","v":"ED 429"},"CTE CURRICULUM","Undergrad","https://secure.oregonstate.edu/ap/cps/documents/view/129084","No Sustainability Content"]
[null,"ED","ED",440,{"$f":"TRIM(C2137)&\" \"&TRIM(D2137)","v":"ED 440"},"PSYCHOLOGY OF THE ADOLESCENT","Undergrad","https://secure.oregonstate.edu/ap/cps/documents/view/130090 ","No Sustainability Content"]
[null,"ED","ED",450,"ED 450","FOUNDATIONS OF EDUCATION AND PLANNING. (4 Credits)","Undergrad","https://secure.oregonstate.edu/ap/cps/documents/view/133070","No Sustainability Content"]
[null,"ED","ED",452,"ED 452","USING DATA TO SUPPORT ALL STUDENTS. (3 Credits)","Undergrad","https://secure.oregonstate.edu/ap/cps/documents/view/130803","No Sustainability Content"]
[null,"ED","ED",457,{"$f":"TRIM(C2140)&\" \"&TRIM(D2140)","v":"ED 457"},"TEACHING ELEMENTARY MATH","Undergrad","https://secure.oregonstate.edu/ap/cps/documents/view/130296 ","No Sustainability Content"]
[null,"ED","ED",470,"ED 470","BILITERACY INSTRUCTION. (3 Credits)","Undergrad","https://secure.oregonstate.edu/ap/cps/documents/view/132777","No Sustainability Content"]
[null,"ED","ED",471,"ED 471","MULTILINGUAL LINGUISTICS. (3 Credits)","Undergrad","https://secure.oregonstate.edu/ap/cps/documents/view/132776 ","No Sustainability Content"]
[null,"ED","ED",472,"ED 472","FOUNDATIONS OF ESOL EDUCATION","Undergrad","https://catalog.oregonstate.edu/search/?P=ED%20472","No Sustainability Content"]
[null,"ED","ED",473,"ED 473","INSTRUCTIONAL APPROACHES ESOL","Undergrad","https://catalog.oregonstate.edu/search/?P=ED%20473","No Sustainability Content"]
[null,"ED","ED",474,"ED 474","PROJECT-BASED MATHEMATICS. (3 Credits)","Undergrad","https://secure.oregonstate.edu/ap/cps/documents/view/133248","No Sustainability Content"]
[null,"ED","ED",475,"ED 475","INTEGRATED STEM. (3 Credits)","Undergrad","https://secure.oregonstate.edu/ap/cps/documents/view/134053","No Sustainability Content"]
[null,"ED","ED",477,"ED 477","DIFFERENTIATION FOR STUDENTS WITH SPECIAL NEEDS. (3 Credits)","Undergrad","https://secure.oregonstate.edu/ap/cps/documents/view/134054","No Sustainability Content"]
[null,"ED","ED",478,{"$f":"TRIM(C2148)&\" \"&TRIM(D2148)","v":"ED 478"},"SPED LAW RIGHTS & REGULATIONS","Undergrad","https://secure.oregonstate.edu/ap/cps/documents/view/129472","No Sustainability Content"]
[null,"ED","ED",479,"ED 479","LINGUISTICS FOR TEACHERS","Undergrad","https://catalog.oregonstate.edu/search/?P=ED%20479","No Sustainability Content"]
[null,"ED","ED",480,{"$f":"TRIM(C2150)&\" \"&TRIM(D2150)","v":"ED 480"},"TEACHING MATH IN CONTEXT","Undergrad","https://secure.oregonstate.edu/ap/cps/documents/view/128504","No Sustainability Content"]
[null,"ED","ED",481,{"$f":"TRIM(C2151)&\" \"&TRIM(D2151)","v":"ED 481"},"TEACH LITERACY IN CONTEXT","Undergrad","https://secure.oregonstate.edu/ap/cps/documents/view/128506","No Sustainability Content"]
[null,"ED","ED",484,{"$f":"TRIM(C2152)&\" \"&TRIM(D2152)","v":"ED 484"},"INTRO TO CAREER & TECH EDUC","Undergrad","https://secure.oregonstate.edu/ap/cps/documents/view/128335","No Sustainability Content"]
[null,"ED","ED",492,"ED 492","TECHNOLOGY TOOLS FOR TEACHING. (2 Credits)","Undergrad","https://secure.oregonstate.edu/ap/cps/documents/view/133204","No Sustainability Content"]
[null,"ED","ED",496,"ED 496","TECHNOLOGY FOR EDUCATORS. (3 Credits)","Undergrad","https://secure.oregonstate.edu/ap/cps/documents/view/13195","Unavailable syllabus"]
[null,"ED","ED",513,"ED 513","LEARNING ENVIRONMENTS I","Grad","https://secure.oregonstate.edu/ap/cps/documents/view/119945","No Sustainability Content"]
[null,"ED","ED",514,"ED 514","LEARNING ENVIRONMENTS II","Grad","https://secure.oregonstate.edu/ap/cps/documents/view/120981","No Sustainability Content"]
[null,"ED","ED",515,"ED 515","LEARNING ENVIRONMENTS III","Grad","https://secure.oregonstate.edu/ap/cps/documents/view/121489","No Sustainability Content"]
[null,"ED","ED",519,"ED 519","TEACHING AS A PROFESSION","Grad","https://secure.oregonstate.edu/ap/cps/documents/view/121993","No Sustainability Content"]
[null,"ED","ED",520,{"$f":"TRIM(C2159)&\" \"&TRIM(D2159)","v":"ED 520"},"CLASSROOM MANAGEMENT","Grad","https://secure.oregonstate.edu/ap/cps/documents/view/129044","Unavailable syllabus"]
[null,"ED","ED",521,{"$f":"TRIM(C2160)&\" \"&TRIM(D2160)","v":"ED 521"},"FUNDS OF KNOWLEDGE IN EDUC","Grad","https://secure.oregonstate.edu/ap/cps/documents/view/129574","No Sustainability Content"]
[null,"ED","ED",531,"ED 531","SCIENCE METHODS I: INQUIRY &","Grad","https://secure.oregonstate.edu/ap/cps/documents/view/119929","No Sustainability Content"]
[null,"ED","ED",532,"ED 532","SCIENCE METHODS II: SUPPORTING","Grad","https://secure.oregonstate.edu/ap/cps/documents/view/119946","No Sustainability Content"]
[null,"ED","ED",537,"ED 537","MATHEMATICAL METHODS I:","Grad","https://secure.oregonstate.edu/ap/cps/documents/view/119930","No Sustainability Content"]
[null,"ED","ED",538,"ED 538","MATHEMATICAL METHODS II: CYCLE","Grad","https://secure.oregonstate.edu/ap/cps/documents/view/119947","No Sustainability Content"]
[null,"ED","ED",540,{"$f":"TRIM(C2165)&\" \"&TRIM(D2165)","v":"ED 540"},"PSYCHOLOGY OF THE ADOLESCENT","Grad","https://secure.oregonstate.edu/ap/cps/documents/view/130090 ","No Sustainability Content"]
[null,"ED","ED",548,"ED 548","STUDENTS WITH SPECIAL NEEDS","Grad","https://secure.oregonstate.edu/ap/cps/documents/view/122111","No Sustainability Content"]
[null,"ED","ED",551,"ED 551","EFFECTIVE TEACHING CYCLE II:","Grad","https://secure.oregonstate.edu/ap/cps/documents/view/119948","No Sustainability Content"]
[null,"ED","ED",552,"ED 552","EFFECTIVE TEACHING CYCLE III","Grad","https://secure.oregonstate.edu/ap/cps/documents/view/120985","No Sustainability Content"]
[null,"ED","ED",559,"ED 559","STRATEGIES TEACHING HUMANITIES","Grad","https://secure.oregonstate.edu/ap/cps/documents/view/122221","No Sustainability Content"]
[null,"ED","ED",560,"ED 560","CHANGES IN ESOL EDUCATION. (3 Credits)","Grad","https://secure.oregonstate.edu/ap/cps/documents/view/132794","No Sustainability Content"]
[null,"ED","ED",565,"ED 565","ELEMENTARY METHODS: LITERACY","Grad","https://secure.oregonstate.edu/ap/cps/documents/view/121063","No Sustainability Content"]
[null,"ED","ED",566,"ED 566","ELEMENTARY METHODS: MATH","Grad","https://secure.oregonstate.edu/ap/cps/documents/view/121061","No Sustainability Content"]
[null,"ED","ED",567,"ED 567","ELEM METHODS: NAT & SOCIAL SCI","Grad","https://secure.oregonstate.edu/ap/cps/documents/view/120979","No Sustainability Content"]
[null,"ED","ED",570,"ED 570","BILITERACY INSTRUCTION. (3 Credits)","Grad","https://secure.oregonstate.edu/ap/cps/documents/view/132777","No Sustainability Content"]
[null,"ED","ED",571,"ED 571","MULTILINGUAL LINGUISTICS. (3 Credits)","Grad","https://secure.oregonstate.edu/ap/cps/documents/view/132776 ","No Sustainability Content"]
[null,"ED","ED",572,"ED 572","FOUNDATIONS OF ESOL EDUCATION","Grad","https://catalog.oregonstate.edu/search/?P=ED%20572","No Sustainability Content"]
[null,"ED","ED",573,"ED 573","INSTRUCTIONAL APPROACHES ESOL","Grad","https://catalog.oregonstate.edu/search/?P=ED%20573","No Sustainability Content"]
[null,"ED","ED",574,"ED 574","PROJECT-BASED MATHEMATICS. (3 Credits)",{"$f":"IF(D2178>499,\"Grad\", \"Undergrad\")","v":"Grad"},"https://secure.oregonstate.edu/ap/cps/documents/view/133248","No Sustainability Content"]
[null,"ED","ED",575,"ED 575","INTEGRATED STEM. (3 Credits)","Grad","https://secure.oregonstate.edu/ap/cps/documents/view/134053","No Sustainability Content"]
[null,"ED","ED",577,"ED 577","DIFFERENTIATION FOR STUDENTS WITH SPECIAL NEEDS. (3 Credits)","Grad","https://secure.oregonstate.edu/ap/cps/documents/view/134054","No Sustainability Content"]
[null,"ED","ED",578,"ED 578","SPECIAL EDUCATION LAW RIGHTS AND REGULATIONS. (3 Credits)","Grad","https://secure.oregonstate.edu/ap/cps/documents/view/129472","No Sustainability Content"]
[null,"ED","ED",579,"ED 579","LINGUISTICS FOR TEACHERS","Grad","https://catalog.oregonstate.edu/search/?P=ED%20579","No Sustainability Content"]
[null,"ED","ED",582,"ED 582","STRATEGIES DEVELOPING LITERACY","Grad","https://secure.oregonstate.edu/ap/cps/documents/view/122222","No Sustainability Content"]
[null,"ED","ED",584,"ED 584","LANGUAGE ARTS METHODS I:","Grad","https://secure.oregonstate.edu/ap/cps/documents/view/119934","No Sustainability Content"]
[null,"ED","ED",585,"ED 585","LANGUAGE ARTS METHODS II","Grad","https://secure.oregonstate.edu/ap/cps/documents/view/119952","No Sustainability Content"]
[null,"ED","ED",587,"ED 587","SOCIAL STUDIES METHODS I:","Grad","https://secure.oregonstate.edu/ap/cps/documents/view/119935","No Sustainability Content"]
[null,"ED","ED",588,"ED 588","SOCIAL STUDIES METHODS II","Grad","https://secure.oregonstate.edu/ap/cps/documents/view/119953","No Sustainability Content"]
[null,"ED","ED",589,"ED 589","SOCIAL STUDIES METHODS III","Grad","https://secure.oregonstate.edu/ap/cps/documents/view/121062","No Sustainability Content"]
[null,"ED","ED",592,"ED 592","TECHNOLOGY TOOLS FOR TEACHING","Grad","https://secure.oregonstate.edu/ap/cps/documents/view/119942","No Sustainability Content"]
[null,"ED","ED",594,"ED 594","DIFFERENTIATION","Grad","https://secure.oregonstate.edu/ap/cps/documents/view/119944","No Sustainability Content"]
[null,"ED","ED",595,"ED 595","EDUCATIONAL DEVELOPMENT. (2 Credits)","Grad","https://secure.oregonstate.edu/ap/cps/documents/view/132658","No Sustainability Content"]
[null,"ED","ED",596,{"$f":"TRIM(C2192)&\" \"&TRIM(D2192)","v":"ED 596"},"TECHNOLOGY FOR EDUCATORS","Grad","https://secure.oregonstate.edu/ap/cps/documents/view/13195","Unavailable syllabus"]
[null,"ED","ED",653,"ED 653","DISCOURSE, IDENTITY AND EDUCATION. (3 Credits)","Grad","https://secure.oregonstate.edu/ap/cps/documents/view/122168","No Sustainability Content"]
[null,"EECS","EECS",161,"EECS 161","Introduction to Programming I ","Undergrad","https://secure.oregonstate.edu/ap/cps/documents/view/110939","No Sustainability Content"]
[null,"EECS","EECS",162,"EECS 162","Introduction to Programming II","Undergrad","https://secure.oregonstate.edu/ap/cps/documents/view/110940","No Sustainability Content"]
[null,"EECS","EECS",261,"EECS 261"," Data Structures","Undergrad","https://secure.oregonstate.edu/ap/cps/documents/view/110189","No Sustainability Content"]
[null,"EECS","EECS",372,"EECS 372","Introduction to Computer Networks","Undergrad","https://secure.oregonstate.edu/ap/cps/documents/view/112942","No Sustainability Content"]
[null,"SWLF","ENG",106,"ENG 106","*INTRO TO LITERATURE: POETRY","Undergrad","https://secure.oregonstate.edu/ap/cps/documents/view/121655","No Sustainability Content"]
[null,"SWLF","ENG",107,"ENG 107","*INTRO TO LIT: CNF","Undergrad","https://secure.oregonstate.edu/ap/cps/documents/view/109238","No Sustainability Content"]
[null,"SWLF","ENG",201,"ENG 201","*SHAKESPEARE","Undergrad","https://secure.oregonstate.edu/ap/cps/documents/view/99796","No Sustainability Content"]
[null,"SWLF","ENG",202,"ENG 202","*SHAKESPEARE","Undergrad","https://secure.oregonstate.edu/ap/cps/documents/view/99797","No Sustainability Content"]
[null,"SWLF","ENG",205,"ENG 205","*SURV BRIT LIT: REST/ROMANTIC","Undergrad","https://secure.oregonstate.edu/ap/cps/documents/view/99800","No Sustainability Content"]
[null,"SWLF","ENG",207,"ENG 207","*LIT OF WESTERN CIV: CLASSIC","Undergrad","https://secure.oregonstate.edu/ap/cps/documents/view/99805","No Sustainability Content"]
[null,"SWLF","ENG",210,"ENG 210","*LITS OF THE WORLD: ASIA","Undergrad","https://secure.oregonstate.edu/ap/cps/documents/view/99810","No Sustainability Content"]
[null,"SWLF","ENG",212,"ENG 212","*LITERATURES OF THE WORLD: MESO/SOUTH AMERICA, CARIBBEAN. (4 Credits)","Undergrad","https://secure.oregonstate.edu/ap/cps/documents/view/99812","No Sustainability Content"]
[null,"SWLF","ENG",213,"ENG 213","*LITS OF THE WORLD: MIDEAST","Undergrad","https://secure.oregonstate.edu/ap/cps/documents/view/99813","No Sustainability Content"]
[null,"SWLF","ENG",214,"ENG 214","*LITERATURE OF WORLD: EUROPE","Undergrad","https://secure.oregonstate.edu/ap/cps/documents/view/124240","No Sustainability Content"]
[null,"SWLF","ENG",222,"ENG 222","CHILDREN'S LITERATURE. (4 Credits)","Undergrad","https://secure.oregonstate.edu/ap/cps/documents/view/133438","No Sustainability Content"]
[null,"SWLF","ENG",253,"ENG 253","*SURV OF AMER LIT: COL-1900","Undergrad","https://secure.oregonstate.edu/ap/cps/documents/view/99821","No Sustainability Content"]
[null,"SWLF","ENG",254,"ENG 254","*SURV AMER LIT: 1900-PRESENT","Undergrad","https://secure.oregonstate.edu/ap/cps/documents/view/99822","No Sustainability Content"]
[null,"SWLF","ENG",275,"ENG 275","*THE BIBLE AS LITERATURE","Undergrad","https://secure.oregonstate.edu/ap/cps/documents/view/99826","No Sustainability Content"]
[null,"SWLF","ENG",300,"ENG 300","The Holocaust in Literature and Film","Undergrad","https://secure.oregonstate.edu/ap/cps/documents/view/105171","No Sustainability Content"]
[null,"SWLF","ENG",311,"ENG 311","^STUDIES IN BRITISH PROSE","Undergrad","https://secure.oregonstate.edu/ap/cps/documents/view/99827","No Sustainability Content"]
[null,"SWLF","ENG",312,"ENG 312","^STUDIES IN BRITISH DRAMA. (4 Credits)","Undergrad","https://secure.oregonstate.edu/ap/cps/documents/view/99828","No Sustainability Content"]
[null,"SWLF","ENG",313,"ENG 313","^STUDIES IN BRITISH POETRY. (4 Credits)","Undergrad","https://secure.oregonstate.edu/ap/cps/documents/view/99829","No Sustainability Content"]
[null,"SWLF","ENG",317,"ENG 317","*AMERICAN NOVEL: BEG TO CHOPIN","Undergrad","https://secure.oregonstate.edu/ap/cps/documents/view/99830","No Sustainability Content"]
[null,"SWLF","ENG",318,"ENG 318","*AMERICAN NOVEL: MODERNIST","Undergrad","https://secure.oregonstate.edu/ap/cps/documents/view/99831","No Sustainability Content"]
[null,"SWLF","ENG",319,"ENG 319","*AMERICAN NOVEL: POST-WWII","Undergrad","https://secure.oregonstate.edu/ap/cps/documents/view/99832","No Sustainability Content"]
[null,"SWLF","ENG",320,"ENG 320","*STUDIES-PAGE, STAGE, SCREEN","Undergrad","https://secure.oregonstate.edu/ap/cps/documents/view/99833","No Sustainability Content"]
[null,"SWLF","ENG",321,"ENG 321","*STUDIES- WORD, OBJECT, IMAGE","Undergrad","https://secure.oregonstate.edu/ap/cps/documents/view/106261","No Sustainability Content"]
[null,"SWLF","ENG",322,"ENG 322","*STUDIES GLOBE TEXT EVENT","Undergrad","https://secure.oregonstate.edu/ap/cps/documents/view/119549","No Sustainability Content"]
[null,"SWLF","ENG",345,"ENG 345","INTRO LIT CRITICISM & THEORY","Undergrad","https://secure.oregonstate.edu/ap/cps/documents/view/99834","No Sustainability Content"]
[null,"SWLF","ENG",355,"ENG 355","Continental European Literature: 19th Century","Undergrad","https://secure.oregonstate.edu/ap/cps/documents/view/99835","No Sustainability Content"]
[null,"SWLF","ENG",356,"ENG 356","CONTINENTAL EUROPEAN LITERATURE: 20th/21st Century","Undergrad","https://secure.oregonstate.edu/ap/cps/documents/view/99836","No Sustainability Content"]
[null,"SWLF","ENG",360,"ENG 360","*NATIVE AMERICAN LITERATURE","Undergrad","https://secure.oregonstate.edu/ap/cps/documents/view/99837","No Sustainability Content"]
[null,"SWLF","ENG",362,"ENG 362","*AMERICAN WOMEN WRITERS","Undergrad","https://secure.oregonstate.edu/ap/cps/documents/view/99838","No Sustainability Content"]
[null,"SWLF","ENG",374,"ENG 374","*MODERN SHORT STORY","Undergrad","https://secure.oregonstate.edu/ap/cps/documents/view/99839","No Sustainability Content"]
[null,"SWLF","ENG",375,"ENG 375","CHILDREN'S LITERATURE","Undergrad","https://secure.oregonstate.edu/ap/cps/documents/view/102913","No Sustainability Content"]
[null,"SWLF","ENG",386,"ENG 386","A CULTURAL HISTORY OF AMERICAN ART AND LITERATURE: PART I. (4 Credits)","Undergrad","https://secure.oregonstate.edu/ap/cps/documents/view/99840","No Sustainability Content"]
[null,"SWLF","ENG",387,"ENG 387","A CULTURAL HISTORY OF AMERICAN ART AND LITERATURE: PART II. (4 Credits)","Undergrad","https://secure.oregonstate.edu/ap/cps/documents/view/99841","No Sustainability Content"]
[null,"SWLF","ENG",388,"ENG 388","A CULTURAL HISTORY OF AMERICAN ART AND LITERATURE: PART III. (4 Credits)","Undergrad","https://secure.oregonstate.edu/ap/cps/documents/view/99842","No Sustainability Content"]
[null,"SWLF","ENG",416,"ENG 416","*POWER AND REPRESENTATION","Undergrad","https://catalog.oregonstate.edu/search/?P=ENG%20416","No Sustainability Content"]
[null,"SWLF","ENG",417,"ENG 417","THE ENGLISH NOVEL: DEFOE THROUGH SCOTT. (4 Credits)","Undergrad","https://catalog.oregonstate.edu/search/?P=ENG%20417","No Sustainability Content"]
[null,"SWLF","ENG",418,"ENG 418","THE ENGLISH NOVEL: VICTORIAN PERIOD. (4 Credits)","Undergrad","https://catalog.oregonstate.edu/search/?P=ENG%20418","No Sustainability Content"]
[null,"SWLF","ENG",419,"ENG 419","THE ENGLISH NOVEL: 20TH CENTURY. (4 Credits)","Undergrad","https://catalog.oregonstate.edu/search/?P=ENG%20419","No Sustainability Content"]
[null,"SWLF","ENG",420,"ENG 420","STUDIES IN DIFFERENCE, POWER, AND DISCRIMINATION. (4 Credits)","Undergrad","https://catalog.oregonstate.edu/search/?P=ENG%20420","No Sustainability Content"]
[null,"SWLF","ENG",425,"ENG 425","STUDIES IN MEDIEVAL LITERATURE. (4 Credits)","Undergrad","https://catalog.oregonstate.edu/search/?P=ENG%20425","No Sustainability Content"]
[null,"SWLF","ENG",426,"ENG 426","STUDIES IN CHAUCER. (4 Credits)","Undergrad","https://catalog.oregonstate.edu/search/?P=ENG%20426","No Sustainability Content"]
[null,"SWLF","ENG",430,"ENG 430","STUDIES IN EARLY MODERN LITERATURE. (4 Credits)","Undergrad","https://catalog.oregonstate.edu/search/?P=ENG%20430","No Sustainability Content"]
[null,"SWLF","ENG",433,"ENG 433","STUDIES IN THE LONG EIGHTEENTH CENTURY. (4 Credits)","Undergrad","https://catalog.oregonstate.edu/search/?P=ENG%20433","No Sustainability Content"]
[null,"SWLF","ENG",434,"ENG 434","STUDIES IN ROMANTICISM. (4 Credits)","Undergrad","https://catalog.oregonstate.edu/search/?P=ENG%20434","No Sustainability Content"]
[null,"SWLF","ENG",436,"ENG 436","STUDIES IN VICTORIAN LITERATURE. (4 Credits)",{"$f":"IF(D2242>499,\"Grad\", \"Undergrad\")","v":"Undergrad"},"https://catalog.oregonstate.edu/search/?P=ENG%20436","No Sustainability Content"]
[null,"SWLF","ENG",454,"ENG 454","MAJOR AUTHORS","Undergrad","https://catalog.oregonstate.edu/search/?P=ENG%20454","No Sustainability Content"]
[null,"SWLF","ENG",457,"ENG 457","Comparative Literature: Colonialism","Undergrad","https://secure.oregonstate.edu/ap/cps/documents/view/100476","No Sustainability Content"]
[null,"SWLF","ENG",458,"ENG 458","Comparative Literature: Postcolonialism","Undergrad","https://secure.oregonstate.edu/ap/cps/documents/view/99877","No Sustainability Content"]
[null,"SWLF","ENG",460,"ENG 460","STUDIES IN DRAMA","Undergrad","https://catalog.oregonstate.edu/search/?P=ENG%20460","No Sustainability Content"]
[null,"SWLF","ENG",465,"ENG 465","STUDIES IN THE NOVEL. (4 Credits)","Undergrad","https://secure.oregonstate.edu/ap/cps/documents/view/99878","No Sustainability Content"]
[null,"SWLF","ENG",470,"ENG 470","^STUDIES IN POETRY. (4 Credits)","Undergrad","https://catalog.oregonstate.edu/search/?P=ENG%20470","No Sustainability Content"]
[null,"SWLF","ENG",475,"ENG 475","STUDIES IN CRITICISM. (4 Credits)","Undergrad","https://catalog.oregonstate.edu/search/?P=ENG%20475","No Sustainability Content"]
[null,"SWLF","ENG",480,"ENG 480","STUDIES IN LITERATURE, CULTURE AND SOCIETY. (4 Credits)","Undergrad","https://catalog.oregonstate.edu/search/?P=ENG%20480","No Sustainability Content"]
[null,"SWLF","ENG",485,"ENG 485","^STUDIES IN AMERICAN LITERATUR","Undergrad","https://catalog.oregonstate.edu/search/?P=ENG%20485","No Sustainability Content"]
[null,"SWLF","ENG",489,"ENG 489","WRITING, LITERATURE AND MEDICINE. (4 Credits)","Undergrad","https://catalog.oregonstate.edu/search/?P=ENG%20489","No Sustainability Content"]
[null,"SWLF","ENG",490,"ENG 490","HISTORY OF ENGLISH LANGUAGE","Undergrad","https://catalog.oregonstate.edu/search/?P=ENG%20490","No Sustainability Content"]
[null,"SWLF","ENG",495,"ENG 495","Language, Technology, and Culture","Undergrad","https://secure.oregonstate.edu/ap/cps/documents/view/99888","No Sustainability Content"]
[null,"SWLF","ENG",510,"ENG 510","GRADUATE INTERNSHIP IN ENGLISH","Grad","https://secure.oregonstate.edu/ap/cps/documents/view/96190","No Sustainability Content"]
[null,"SWLF","ENG",514,"ENG 514","INTRO TO GRADUATE STUDIES","Grad","https://secure.oregonstate.edu/ap/cps/documents/view/100958","No Sustainability Content"]
[null,"SWLF","ENG",516,"ENG 516","POWER AND REPRESENTATION. (4 Credits)","Grad","https://catalog.oregonstate.edu/search/?P=ENG%20516","No Sustainability Content"]
[null,"SWLF","ENG",517,"ENG 517","THE ENGLISH NOVEL: DEFOE THROUGH SCOTT. (4 Credits)","Grad","https://catalog.oregonstate.edu/search/?P=ENG%20517","No Sustainability Content"]
[null,"SWLF","ENG",518,"ENG 518","THE ENGLISH NOVEL: VICTORIAN PERIOD. (4 Credits)","Grad","https://catalog.oregonstate.edu/search/?P=ENG%20518","No Sustainability Content"]
[null,"SWLF","ENG",519,"ENG 519","THE ENGLISH NOVEL: 20TH CENTURY. (4 Credits)","Grad","https://catalog.oregonstate.edu/search/?P=ENG%20519","No Sustainability Content"]
[null,"SWLF","ENG",520,"ENG 520","STUDIES IN DIFFERENCE, POWER, AND DISCRIMINATION. (4 Credits)","Grad","https://catalog.oregonstate.edu/search/?P=ENG%20520","No Sustainability Content"]
[null,"SWLF","ENG",525,"ENG 525","STUDIES IN MEDIEVAL LITERATURE","Grad","https://catalog.oregonstate.edu/search/?P=ENG%20525","No Sustainability Content"]
[null,"SWLF","ENG",526,"ENG 526","STUDIES IN CHAUCER. (4 Credits)","Grad","https://catalog.oregonstate.edu/search/?P=ENG%20526","No Sustainability Content"]
[null,"SWLF","ENG",530,"ENG 530","STUDIES IN EARLY MODERN LITERATURE. (4 Credits)","Grad","https://catalog.oregonstate.edu/search/?P=ENG%20530","No Sustainability Content"]
[null,"SWLF","ENG",533,"ENG 533","STUDIES IN THE LONG EIGHTEENTH CENTURY. (4 Credits)","Grad","https://catalog.oregonstate.edu/search/?P=ENG%20533","No Sustainability Content"]
[null,"SWLF","ENG",534,"ENG 534","STUDIES IN ROMANTICISM","Grad","https://catalog.oregonstate.edu/search/?P=ENG%20534","No Sustainability Content"]
[null,"SWLF","ENG",536,"ENG 536","STUDIES IN VICTORIAN LIT","Grad","https://catalog.oregonstate.edu/search/?P=ENG%20536","No Sustainability Content"]
[null,"SWLF","ENG",554,"ENG 554","MAJOR AUTHORS","Grad","https://catalog.oregonstate.edu/search/?P=ENG%20554","No Sustainability Content"]
[null,"SWLF","ENG",557,"ENG 557","Comparative Literature: Colonialism","Grad","https://secure.oregonstate.edu/ap/cps/documents/view/100476","No Sustainability Content"]
[null,"SWLF","ENG",558,"ENG 558","Comparative Literature: Postcolonialism","Grad","https://secure.oregonstate.edu/ap/cps/documents/view/99877","No Sustainability Content"]
[null,"SWLF","ENG",560,"ENG 560","STUDIES IN DRAMA","Grad","https://catalog.oregonstate.edu/search/?P=ENG%20560","No Sustainability Content"]
[null,"SWLF","ENG",565,"ENG 565","STUDIES IN THE NOVEL. (4 Credits)","Grad","https://secure.oregonstate.edu/ap/cps/documents/view/99879","No Sustainability Content"]
[null,"SWLF","ENG",570,"ENG 570","STUDIES IN POETRY","Grad","https://catalog.oregonstate.edu/search/?P=ENG%20570","No Sustainability Content"]
[null,"SWLF","ENG",575,"ENG 575","STUDIES IN CRITICISM","Grad","https://catalog.oregonstate.edu/search/?P=ENG%20575","No Sustainability Content"]
[null,"SWLF","ENG",580,"ENG 580","STUDIES IN LIT, CULT & SOCIETY","Grad","https://catalog.oregonstate.edu/search/?P=ENG%20580","No Sustainability Content"]
[null,"SWLF","ENG",585,"ENG 585","STUDIES IN AMERICAN LITERATURE","Grad","https://catalog.oregonstate.edu/search/?P=ENG%20585","No Sustainability Content"]
[null,"SWLF","ENG",589,"ENG 589","WRITING, LITERATURE AND MEDICINE. (4 Credits)","Grad","https://catalog.oregonstate.edu/search/?P=ENG%20589","No Sustainability Content"]
[null,"SWLF","ENG",590,"ENG 590","HISTORY OF ENGLISH LANGUAGE","Grad","https://catalog.oregonstate.edu/search/?P=ENG%20590","No Sustainability Content"]
[null,"SWLF","ENG",595,"ENG 595","LANGUAGE, TECHNOLOGY, AND CULTURE. (4 Credits)","Grad","https://catalog.oregonstate.edu/search/?P=ENG%20595","No Sustainability Content"]
[null,"ENGR","ENGR",101,"ENGR 101","DESIGN OF COFFEE. (2 Credits)","Undergrad","https://secure.oregonstate.edu/ap/cps/documents/view/130873","No Sustainability Content"]
[null,"ENGR","ENGR",112,"ENGR 112","INTRO TO ENGINEERING COMPUTING","Undergrad","https://secure.oregonstate.edu/ap/cps/documents/view/111911","No Sustainability Content"]
[null,"ENGR","ENGR",201,"ENGR 201","ELECTRICAL FUNDAMENTALS I","Undergrad","https://secure.oregonstate.edu/ap/cps/documents/view/6936","No Sustainability Content"]
[null,"ENGR","ENGR",202,{"$f":"TRIM(C2283)&\" \"&TRIM(D2283)","v":"ENGR 202"},"ELECTRICAL FUNDAMENTALS II","Undergrad","https://secure.oregonstate.edu/ap/cps/documents/view/127629","No Sustainability Content"]
[null,"ENGR","ENGR",203,"ENGR 203","ELECTRICAL FUNDAMENTALS III","Undergrad","https://secure.oregonstate.edu/ap/cps/documents/view/114378","No Sustainability Content"]
[null,"ENGR","ENGR",211,"ENGR 211","STATICS","Undergrad","https://secure.oregonstate.edu/ap/cps/documents/view/9114","No Sustainability Content"]
[null,"ENGR","ENGR",212,{"$f":"TRIM(C2286)&\" \"&TRIM(D2286)","v":"ENGR 212"},"DYNAMICS","Undergrad","https://secure.oregonstate.edu/ap/cps/documents/view/127630","No Sustainability Content"]
[null,"ENGR","ENGR",213,"ENGR 213","STRENGTH OF MATERIALS","Undergrad","https://secure.oregonstate.edu/ap/cps/documents/view/105116","No Sustainability Content"]
[null,"ENGR","ENGR",221,"ENGR 221","NANOTECHNOLOGY","Undergrad","https://secure.oregonstate.edu/ap/cps/documents/view/5900","No Sustainability Content"]
[null,"ENGR","ENGR",231,"ENGR 231","Understanding Energy","Undergrad","https://secure.oregonstate.edu/ap/cps/documents/view/101155","No Sustainability Content"]
[null,"ENGR","ENGR",321,"ENGR 321","INTRODUCTION TO MATERIALS SCIENCE. (4 Credits)","Undergrad","https://secure.oregonstate.edu/ap/cps/documents/view/115866","No Sustainability Content"]
[null,"ENGR","ENGR",322,"ENGR 322","MECHANICAL PROPERTIES OF MATERIALS. (3 Credits)","Undergrad","https://secure.oregonstate.edu/ap/cps/documents/view/6489","No Sustainability Content"]
[null,"ENGR","ENGR",391,"ENGR 391","ENGINEERING ECON & PROJ MGMT","Undergrad","https://secure.oregonstate.edu/ap/cps/documents/view/10267","No Sustainability Content"]
[null,"ENGR","ENGR",455,"ENGR 455","Foundations of Engineering Education Research and Practice","Undergrad","https://secure.oregonstate.edu/ap/cps/documents/view/114572","No Sustainability Content"]
[null,"ENGR","ENGR",550,"ENGR 550","PROFESSIONAL PREPARATION FOR ENGINEERS. (1 Credit)","Grad","https://secure.oregonstate.edu/ap/cps/documents/view/132669","No Sustainability Content"]
[null,"ENGR","ENGR",555,"ENGR 555","FOUNDATIONS OF ENGR ED","Grad","https://catalog.oregonstate.edu/search/?P=ENGR%20555","No Sustainability Content"]
[null,"ENT","ENT",101,{"$f":"TRIM(C2296)&\" \"&TRIM(D2296)","v":"ENT 101"},"INTRO TO CROP, SOIL, INSECT","Undergrad","https://secure.oregonstate.edu/ap/cps/documents/view/132080","No Sustainability Content"]
[null,"ENT","ENT",300,{"$f":"TRIM(C2297)&\" \"&TRIM(D2297)","v":"ENT 300"},"*PLAGUES, PESTS, AND POLITICS","Undergrad","https://secure.oregonstate.edu/ap/cps/documents/view/127073","No Sustainability Content"]
[null,"ENT","ENT",311,"ENT 311","INTRO TO INSECT PEST MGMT","Undergrad","https://secure.oregonstate.edu/ap/cps/documents/view/108780","No Sustainability Content"]
[null,"ENT","ENT",403,"ENT 403","THESIS. (1-16 Credits)","Undergrad","https://secure.oregonstate.edu/ap/cps/documents/view/111581","No Sustainability Content"]
[null,"ENT","ENT",440,"ENT 440","ISSUES IN INSECT TOXICOLOGY","Undergrad","https://secure.oregonstate.edu/ap/cps/documents/view/108394","No Sustainability Content"]
[null,"ENT","ENT",540,{"$f":"TRIM(C2301)&\" \"&TRIM(D2301)","v":"ENT 540"},"ISSUES IN INSECT TOXICOLOGY","Grad","https://secure.oregonstate.edu/ap/cps/documents/view/108394","No Sustainability Content"]
[null,"CBE","ENVE",415,"ENVE 415","ENVIRONMENTAL ENGINEERING LAB","Undergrad","https://secure.oregonstate.edu/ap/cps/documents/view/102027","No Sustainability Content"]
[null,"CBE","ENVE",457,"ENVE 457","BIOREACTORS. (3 Credits)","Undergrad","https://secure.oregonstate.edu/ap/cps/documents/view/134138","No Sustainability Content"]
[null,"CBE","ENVE",532,"ENVE 532","AQUATIC CHEMISTRY","Grad","https://catalog.oregonstate.edu/search/?P=ENVE%20532","No Sustainability Content"]
[null,"CBE","ENVE",535,{"$f":"TRIM(C2305)&\" \"&TRIM(D2305)","v":"ENVE 535"},"PHY & CHEM TREATMENT PROCESSES","Grad","https://secure.oregonstate.edu/ap/cps/documents/view/134117","No Sustainability Content"]
[null,"CBE","ENVE",545,"ENVE 545","MICROBIAL METHODS IN ENVIRONMENTAL ENGINEERING. (3 Credits)",{"$f":"IF(D2306>499,\"Grad\", \"Undergrad\")","v":"Grad"},"https://secure.oregonstate.edu/ap/cps/documents/view/131459","No Sustainability Content"]
[null,"SLCS","ES",159,"ES 159","*LANGUAGE, RACE AND RACISM IN THE US: AN INTRODUCTION. (4 Credits)","Undergrad","https://secure.oregonstate.edu/ap/cps/documents/view/123545","No Sustainability Content"]
[null,"SLCS","ES",211,"ES 211","INTRODUCTION TO LATINO/A STUDIES. (4 Credits)","Undergrad","https://secure.oregonstate.edu/ap/cps/documents/view/131919","No Sustainability Content"]
[null,"SLCS","ES",223,"ES 223","*SURVEY OF AFRICAN AMERICAN STUDIES II. (4 Credits)","Undergrad","https://secure.oregonstate.edu/ap/cps/documents/view/121731","No Sustainability Content"]
[null,"SLCS","ES",231,"ES 231","*INTRO ASIAN AMERICAN STUDIES","Undergrad","https://secure.oregonstate.edu/ap/cps/documents/view/121731","No Sustainability Content"]
[null,"SLCS","ES",243,"ES 243","*NATIVE AMERICAN ASSIMILATION AND ACTIVISM. (4 Credits)","Undergrad","https://secure.oregonstate.edu/ap/cps/documents/view/116232","No Sustainability Content"]
[null,"SLCS","ES",321,"ES 321","AFRICAN AMERICAN POLITICAL AND SOCIAL THOUGHT: 20TH CENTURY. (4 Credits)","Undergrad","https://secure.oregonstate.edu/ap/cps/documents/view/115091","No Sustainability Content"]
[null,"SLCS","ES",332,"ES 332","ASIAN PACIFIC AMER & THE MEDIA","Undergrad","https://secure.oregonstate.edu/ap/cps/documents/view/115040","No Sustainability Content"]
[null,"SLCS","ES",334,"ES 334","*ASIAN PACIFIC AMERICAN LIT","Undergrad","https://secure.oregonstate.edu/ap/cps/documents/view/116463","No Sustainability Content"]
[null,"SLCS","ES",354,"ES 354","^LITERATURE OF ETHNIC MINORITIES IN THE UNITED STATES. (4 Credits)","Undergrad","https://secure.oregonstate.edu/ap/cps/documents/view/117479","No Sustainability Content"]
[null,"SLCS","ES",361,{"$f":"TRIM(C2316)&\" \"&TRIM(D2316)","v":"ES 361"},"(RE)FRAMING RACE FILM PROD","Undergrad","https://secure.oregonstate.edu/ap/cps/documents/view/129197","No Sustainability Content"]
[null,"SLCS","ES",377,"ES 377","*HEALTH AND SOCIAL JUSTICE. (4 Credits)","Undergrad","https://secure.oregonstate.edu/ap/cps/documents/view/133499","No Sustainability Content"]
[null,"SLCS","ES",416,{"$f":"TRIM(C2318)&\" \"&TRIM(D2318)","v":"ES 416"},"MIGRANT HEALTH","Undergrad","https://secure.oregonstate.edu/ap/cps/documents/view/127384 ","No Sustainability Content"]
[null,"SLCS","ES",431,"ES 431","*QUEER OF COLOR CRITIQUES. (4 Credits)","Undergrad","https://catalog.oregonstate.edu/search/?P=ES%20431","No Sustainability Content"]
[null,"SLCS","ES",444,"ES 444","NATIVE AMERICAN LAW: TRIBES, TREATIES, AND THE UNITED STATES. (4 Credits)","Undergrad","https://catalog.oregonstate.edu/search/?P=ES%20444","No Sustainability Content"]
[null,"SLCS","ES",452,"ES 452","*ETHNICITY IN FILM","Undergrad","https://catalog.oregonstate.edu/search/?P=ES%20452","No Sustainability Content"]
[null,"SLCS","ES",455,"ES 455","INTERNSHIP SEMINAR. (1 Credit)","Undergrad","https://secure.oregonstate.edu/ap/cps/documents/view/6005","No Sustainability Content"]
[null,"SLCS","ES",459,"ES 459","ADV STUDY LANG/RACE/RACISM IN","Undergrad","https://catalog.oregonstate.edu/search/?P=ES%20459","No Sustainability Content"]
[null,"SLCS","ES",515,{"$f":"TRIM(C2324)&\" \"&TRIM(D2324)","v":"ES 515"},"ADV RESEARCH LITERATURE REVIEW","Grad","https://secure.oregonstate.edu/ap/cps/documents/view/130003","No Sustainability Content"]
[null,"SLCS","ES",516,{"$f":"TRIM(C2325)&\" \"&TRIM(D2325)","v":"ES 516"},"MIGRANT HEALTH","Grad","https://secure.oregonstate.edu/ap/cps/documents/view/127384 ","No Sustainability Content"]
[null,"SLCS","ES",531,"ES 531","QUEER OF COLOR CRITIQUES. (4 Credits)","Grad","https://catalog.oregonstate.edu/search/?P=ES%20531","No Sustainability Content"]
[null,"SLCS","ES",544,"ES 544","NATIVE AMERICAN LAW: TRIBES, TREATIES, AND THE U.S.. (4 Credits)","Grad","https://catalog.oregonstate.edu/search/?P=ES%20544","No Sustainability Content"]
[null,"SLCS","ES",552,"ES 552","ETHNICITY IN FILM","Grad","https://catalog.oregonstate.edu/search/?P=ES%20552","No Sustainability Content"]
[null,"SLCS","ES",559,"ES 559","ADV STUDY LANG/RACE/RACISM IN","Grad","https://catalog.oregonstate.edu/search/?P=ES%20559","No Sustainability Content"]
[null,"SLCS","ES",569,"ES 569","TOPICS IN JOTERIA STUDIES. (3 Credits)","Grad","https://secure.oregonstate.edu/ap/cps/documents/view/106681","No Sustainability Content"]
[null,"MIME","ESE",330,"ESE 330","MODELING AND ANALYSIS OF DYNAMIC SYSTEMS. (4 Credits)","Undergrad","https://secure.oregonstate.edu/ap/cps/documents/view/132815","No Sustainability Content"]
[null,"MIME","ESE",430,"ESE 430","FEEDBACK CONTROL SYSTEMS. (4 Credits)","Undergrad","https://secure.oregonstate.edu/ap/cps/documents/view/132641  ","No Sustainability Content"]
[null,"MIME","ESE",470,"ESE 470","ENERGY DISTRIBUTION SYSTEMS","Undergrad","https://secure.oregonstate.edu/ap/cps/documents/view/112357","No Sustainability Content"]
[null,"BPHS","EXSS",131,"EXSS 131","INTRODUCTION TO KINESIOLOGY ","Undergrad","https://secure.oregonstate.edu/ap/cps/documents/view/119545","No Sustainability Content"]
[null,"BPHS","EXSS",132,"EXSS 132","Introduction to the Allied Health Professions","Undergrad","https://secure.oregonstate.edu/ap/cps/documents/view/4384","No Sustainability Content"]
[null,"BPHS","EXSS",158,"EXSS 158","Care and Prevention of Athletic Injuries","Undergrad","https://secure.oregonstate.edu/ap/cps/documents/view/4846","No Sustainability Content"]
[null,"BPHS","EXSS",159,"EXSS 159","Directed Observation in Athletic Training","Undergrad","https://secure.oregonstate.edu/ap/cps/documents/view/5932","No Sustainability Content"]
[null,"BPHS","EXSS",160,"EXSS 160","Introduction to Injury Management for the Physically Active","Undergrad","https://secure.oregonstate.edu/ap/cps/documents/view/119313","No Sustainability Content"]
[null,"BPHS","EXSS",230,"EXSS 230","Introduction to Adventure Programs","Undergrad","https://secure.oregonstate.edu/ap/cps/documents/view/107986","No Sustainability Content"]
[null,"BPHS","EXSS",231,"EXSS 231","Human Group Dynamics","Undergrad","https://secure.oregonstate.edu/ap/cps/documents/view/119452","No Sustainability Content"]
[null,"BPHS","EXSS",232,"EXSS 232","Backcountry Leadership","Undergrad","https://secure.oregonstate.edu/ap/cps/documents/view/119444","No Sustainability Content"]
[null,"BPHS","EXSS",233,"EXSS 233","Teaching Techniques for Outdoor Activities","Undergrad","https://secure.oregonstate.edu/ap/cps/documents/view/119453","No Sustainability Content"]
[null,"BPHS","EXSS",311,"EXSS 311","Motor Behavior","Undergrad","https://secure.oregonstate.edu/ap/cps/documents/view/114979","No Sustainability Content"]
[null,"BPHS","EXSS",321,"EXSS 321","Biomechanics of Human Movement","Undergrad","https://secure.oregonstate.edu/ap/cps/documents/view/114975","No Sustainability Content"]
[null,"BPHS","EXSS",325,"EXSS 325","Fitness Assessment and Exercise Prescription","Undergrad","https://secure.oregonstate.edu/ap/cps/documents/view/108129","No Sustainability Content"]
[null,"BPHS","EXSS",343,"EXSS 343","Pre-Therapy/Allied Health Seminar","Undergrad","https://secure.oregonstate.edu/ap/cps/documents/view/107924","No Sustainability Content"]
[null,"BPHS","EXSS",344,"EXSS 344","Pre-Therapy/Allied Health Practicum","Undergrad","https://secure.oregonstate.edu/ap/cps/documents/view/108171","No Sustainability Content"]
[null,"BPHS","EXSS",345,"EXSS 345","Pre-Therapy/Allied Health Practicum II and III","Undergrad","https://secure.oregonstate.edu/ap/cps/documents/view/6680","No Sustainability Content"]
[null,"BPHS","EXSS",350,"EXSS 350","Orthopedic Assessment of Upper Extremity Injuries","Undergrad","https://secure.oregonstate.edu/ap/cps/documents/view/100101","No Sustainability Content"]
[null,"BPHS","EXSS",351,"EXSS 351","Orthopedic Assessment of Lower Extremity Injuries","Undergrad","https://secure.oregonstate.edu/ap/cps/documents/view/100100","No Sustainability Content"]
[null,"BPHS","EXSS",362,"EXSS 362","Sport Skill Analysis III","Undergrad","https://secure.oregonstate.edu/ap/cps/documents/view/107523","No Sustainability Content"]
[null,"BPHS","EXSS",371,"EXSS 371","MEASUREMENT AND DATA ANALYSIS IN EXERCISE SCIENCE","Undergrad","https://secure.oregonstate.edu/ap/cps/documents/view/100560","No Sustainability Content"]
[null,"BPHS","EXSS",380,"EXSS 380","Therapeutic Modalities","Undergrad","https://secure.oregonstate.edu/ap/cps/documents/view/117454","No Sustainability Content"]
[null,"BPHS","EXSS",381,"EXSS 381","ANALYSIS OF CRITICAL ISSUES IN KINESIOLOGY ","Undergrad","https://secure.oregonstate.edu/ap/cps/documents/view/119546","No Sustainability Content"]
[null,"BPHS","EXSS",385,"EXSS 385","Therapeutic Exercise","Undergrad","https://secure.oregonstate.edu/ap/cps/documents/view/115972","No Sustainability Content"]
[null,"BPHS","EXSS",423,"EXSS 423","Qualitative Movement Analysis","Undergrad","https://secure.oregonstate.edu/ap/cps/documents/view/119324","No Sustainability Content"]
[null,"BPHS","EXSS",432,"EXSS 432","Physical Activity Assessment","Undergrad","https://secure.oregonstate.edu/ap/cps/documents/view/119564","No Sustainability Content"]
[null,"BPHS","EXSS",434,"EXSS 434","Applied Muscle Physiology","Undergrad","https://secure.oregonstate.edu/ap/cps/documents/view/108122","No Sustainability Content"]
[null,"BPHS","EXSS",435,"EXSS 435","Physical Activity Promotion","Undergrad","https://secure.oregonstate.edu/ap/cps/documents/view/7592","No Sustainability Content"]
[null,"BPHS","EXSS",436,"EXSS 436","Exercise Management for Chronic Disease","Undergrad","https://secure.oregonstate.edu/ap/cps/documents/view/100098","No Sustainability Content"]
[null,"BPHS","EXSS",437,"EXSS 437","Physical Activity, Aging, and Chronic Disease","Undergrad","https://secure.oregonstate.edu/ap/cps/documents/view/119323","No Sustainability Content"]
[null,"BPHS","EXSS",452,"EXSS 452","Athletic Training Program Management","Undergrad","https://secure.oregonstate.edu/ap/cps/documents/view/107742","No Sustainability Content"]
[null,"BPHS","EXSS",455,"EXSS 455","Pharmacology in Athletic Training","Undergrad","https://secure.oregonstate.edu/ap/cps/documents/view/111587","No Sustainability Content"]
[null,"BPHS","EXSS",474,"EXSS 474","Exercise Physiology Lab Methods","Undergrad","https://secure.oregonstate.edu/ap/cps/documents/view/116377","No Sustainability Content"]
[null,"BPHS","EXSS",483,"EXSS 483","Tissue Injury and Repair","Undergrad","https://secure.oregonstate.edu/ap/cps/documents/view/119469","No Sustainability Content"]
[null,"BPHS","EXSS",525,"EXSS 525","BIOMECHANICS OF MUSCULOSKELETAL INJURIES","Grad","https://secure.oregonstate.edu/ap/cps/documents/view/8426","No Sustainability Content"]
[null,"BPHS","EXSS",531,"EXSS 531","Orthopedic Sports Medicine: Lumbar Spine Injuries ","Grad","https://secure.oregonstate.edu/ap/cps/documents/view/95900","No Sustainability Content"]
[null,"BPHS","EXSS",532,"EXSS 532","Physical Activity Assessment","Grad","https://secure.oregonstate.edu/ap/cps/documents/view/119564","No Sustainability Content"]
[null,"BPHS","EXSS",536,"EXSS 536","Exercise Management for Chronic Disease","Grad","https://secure.oregonstate.edu/ap/cps/documents/view/100098","No Sustainability Content"]
[null,"BPHS","EXSS",547,"EXSS 547","Inclusion in Physical Activity",{"$f":"IF(D2370>499,\"Grad\", \"Undergrad\")","v":"Grad"},"https://secure.oregonstate.edu/ap/cps/documents/view/7029","No Sustainability Content"]
[null,"BPHS","EXSS",549,"EXSS 549","PHYSICAL ACTIVITY FOR PERSONS WITH \nSEVERE DISABILITIES","Grad","https://secure.oregonstate.edu/ap/cps/documents/view/98510","No Sustainability Content"]
[null,"BPHS","EXSS",550,"EXSS 550","Health Promotion for People with Disabilities","Grad","https://secure.oregonstate.edu/ap/cps/documents/view/108125","No Sustainability Content"]
[null,"BPHS","EXSS",555,"EXSS 555","Skill Analysis and Assessment in K-12","Grad","https://secure.oregonstate.edu/ap/cps/documents/view/114977","No Sustainability Content"]
[null,"BPHS","EXSS",647,"EXSS 647","Current Topics & Research in Adapted Physical Activity","Grad","https://secure.oregonstate.edu/ap/cps/documents/view/119111","No Sustainability Content"]
[null,"SLCS","FCSJ",444,"FCSJ 444","NUTRITIONAL ANTHROPOLOGY. (4 Credits)","Undergrad","https://catalog.oregonstate.edu/search/?P=FCSJ%20444","No Sustainability Content"]
[null,"SLCS","FCSJ",544,"FCSJ 544","NUTRITIONAL ANTHROPOLOGY. (4 Credits)","Grad","https://catalog.oregonstate.edu/search/?P=FCSJ%20544","No Sustainability Content"]
[null,"FERM","FE",208,"FE 208","FOREST SURVEYING","Undergrad","https://secure.oregonstate.edu/ap/cps/documents/view/116660","No Sustainability Content"]
[null,"FERM","FE",209,"FE 209","FOR PHOTOGMTRY & REMOTE SENS","Undergrad","https://secure.oregonstate.edu/ap/cps/documents/view/109952","No Sustainability Content"]
[null,"FERM","FE",310,"FE 310","FOREST ROUTE SURVEYING","Undergrad","https://secure.oregonstate.edu/ap/cps/documents/view/123567","No Sustainability Content"]
[null,"FERM","FE",411,"FE 411","COOP ED MENTORED WORK EXPER","Undergrad","https://catalog.oregonstate.edu/search/?P=FE%20411","No Sustainability Content"]
[null,"FERM","FE",415,"FE 415","FOREST ROAD ENGINEERING","Undergrad","https://catalog.oregonstate.edu/search/?P=FE%20415","No Sustainability Content"]
[null,"FERM","FE",422,"FE 422","RESEARCH METHODS IN SOCIAL SCIENCE","Undergrad","https://secure.oregonstate.edu/ap/cps/documents/view/108774","No Sustainability Content"]
[null,"FERM","FE",423,"FE 423","UAS REMOTE SENSING","Undergrad","https://catalog.oregonstate.edu/search/?P=FE%20423","No Sustainability Content"]
[null,"FERM","FE",444,"FE 444","FOREST REMOTE SENSING AND PHOTOGRAMMETRY. (4 Credits)","Undergrad","https://secure.oregonstate.edu/ap/cps/documents/view/133973","No Sustainability Content"]
[null,"FERM","FE",472,{"$f":"TRIM(C2385)&\" \"&TRIM(D2385)","v":"FE 472"},"MECH HARVEST & SIMULATION","Undergrad","https://secure.oregonstate.edu/ap/cps/documents/view/130575","No Sustainability Content"]
[null,"FERM","FE",479,"FE 479","SLOPE AND EMBANKMENT DESIGN","Undergrad","https://catalog.oregonstate.edu/search/?P=FE%20479","No Sustainability Content"]
[null,"FERM","FE",515,"FE 515","FOREST ROAD ENGINEERING","Grad","https://catalog.oregonstate.edu/search/?P=FE%20515","No Sustainability Content"]
[null,"FERM","FE",523,"FE 523","UAS REMOTE SENSING","Grad","https://catalog.oregonstate.edu/search/?P=FE%20523","No Sustainability Content"]
[null,"FERM","FE",536,"FE 536","FOREST DISTURBANCE HYDROLOGY","Grad","https://secure.oregonstate.edu/ap/cps/documents/view/108982","No Sustainability Content"]
[null,"FERM","FE",544,"FE 544","FOREST REMOTE SENSING AND PHOTOGRAMMETRY. (4 Credits)","Grad","https://secure.oregonstate.edu/ap/cps/documents/view/133973","No Sustainability Content"]
[null,"FERM","FE",545,"FE 545","SEDIMENT TRANSPORT","Grad","https://secure.oregonstate.edu/ap/cps/documents/view/121957","No Sustainability Content"]
[null,"FERM","FE",555,"FE 555","FOREST SUPPLY CHAIN MGMT","Grad","https://secure.oregonstate.edu/ap/cps/documents/view/102296","No Sustainability Content"]
[null,"FERM","FE",579,"FE 579","SLOPE AND EMBANKMENT DESIGN","Grad","https://catalog.oregonstate.edu/search/?P=FE%20579","No Sustainability Content"]
[null,"FES","FES",241,{"$f":"TRIM(C2394)&\" \"&TRIM(D2394)","v":"FES 241"},"DENDROLOGY","Undergrad","https://secure.oregonstate.edu/ap/cps/documents/view/123973","Unavailable syllabus"]
[null,"FES","FES",242,"FES 242","FOREST PLANTS OF THE PACIFIC NORTHWEST. (3 Credits)","Undergrad","https://secure.oregonstate.edu/ap/cps/documents/view/114920","No Sustainability Content"]
[null,"FES","FES",422,"FES 422","RESEARCH METHODS SOCIAL SCI","Undergrad","https://secure.oregonstate.edu/ap/cps/documents/view/112327","No Sustainability Content"]
[null,"FES","FES",522,"FES 522","RESEARCH METHODS SOCIAL SCI","Grad","https://secure.oregonstate.edu/ap/cps/documents/view/112545","No Sustainability Content"]
[null,"FES","FES",524,"FES 524","NATURAL RESOURCE DATA ANALYSIS","Grad","https://secure.oregonstate.edu/ap/cps/documents/view/113354","No Sustainability Content"]
[null,"FES","FES",580,"FES 580","WRITING SCIENTIFIC MANUSCRIPTS","Grad","https://secure.oregonstate.edu/ap/cps/documents/view/121029","No Sustainability Content"]
[null,"SWLF","FILM",255,"FILM 255","*WORLD CINEMA I: ORIGINS-1968","Undergrad","https://secure.oregonstate.edu/ap/cps/documents/view/110271","No Sustainability Content"]
[null,"SWLF","FILM",310,"FILM 310","*FILM THEORY AND CRITICISM. (4 Credits)","Undergrad","https://secure.oregonstate.edu/ap/cps/documents/view/131896","No Sustainability Content"]
[null,"SWLF","FILM",360,"FILM 360","INTERNATIONAL FILM FESTIVAL. (3 Credits)","Undergrad","https://secure.oregonstate.edu/ap/cps/documents/view/116337","No Sustainability Content"]
[null,"SWLF","FILM",445,"FILM 445","DOCUMENTARY FILM STUDIES. (4 Credits)","Undergrad","https://catalog.oregonstate.edu/search/?P=FILM%20445","No Sustainability Content"]
[null,"SWLF","FILM",480,"FILM 480","STUDIES IN FILM, CULT & SOCTY","Undergrad","https://catalog.oregonstate.edu/search/?P=FILM%20480","No Sustainability Content"]
[null,"SWLF","FILM",545,"FILM 545","DOCUMENTARY FILM STUDIES. (4 Credits)","Grad","https://catalog.oregonstate.edu/search/?P=FILM%20545","No Sustainability Content"]
[null,"SWLF","FILM",580,"FILM 580","STUDIES IN FILM, CULT & SOCTY","Grad","https://catalog.oregonstate.edu/search/?P=FILM%20580","No Sustainability Content"]
[null,"BA","FIN",341,{"$f":"TRIM(C2407)&\" \"&TRIM(D2407)","v":"FIN 341"},"INVESTMENTS","Undergrad","https://secure.oregonstate.edu/ap/cps/documents/view/133843","No Sustainability Content"]
[null,"BA","FIN",342,{"$f":"TRIM(C2408)&\" \"&TRIM(D2408)","v":"FIN 342"},"ADVANCED FINANCIAL MANAGEMENT","Undergrad","https://secure.oregonstate.edu/ap/cps/documents/view/133090","No Sustainability Content"]
[null,"BA","FIN",440,"FIN 440","FIXED INCOME SECURITIES","Undergrad","https://secure.oregonstate.edu/ap/cps/documents/view/125133","No Sustainability Content"]
[null,"BA","FIN",441,"FIN 441","FINANCIAL INSTITUTIONS","Undergrad","https://secure.oregonstate.edu/ap/cps/documents/view/116011","No Sustainability Content"]
[null,"BA","FIN",442,"FIN 442","FINANCIAL STATEMENT ANALYSIS","Undergrad","https://secure.oregonstate.edu/ap/cps/documents/view/115981","No Sustainability Content"]
[null,"BA","FIN",443,"FIN 443","PORTFOLIO MANAGEMENT","Undergrad","https://catalog.oregonstate.edu/search/?P=FIN%20443","No Sustainability Content"]
[null,"BA","FIN",444,"FIN 444","FINANCIAL RISK MANAGEMENT","Undergrad","https://catalog.oregonstate.edu/search/?P=FIN%20444","No Sustainability Content"]
[null,"BA","FIN",445,{"$f":"TRIM(C2414)&\" \"&TRIM(D2414)","v":"FIN 445"},"INTERNATIONAL FINANCIAL MGMT","Undergrad","https://secure.oregonstate.edu/ap/cps/documents/view/134062","No Sustainability Content"]
[null,"BA","FIN",542,"FIN 542","INVESTMENTS","Grad","https://secure.oregonstate.edu/ap/cps/documents/view/111708","No Sustainability Content"]
[null,"BA","FIN",543,"FIN 543","PORTFOLIO MANAGEMENT. (4 Credits)","Grad","https://catalog.oregonstate.edu/search/?P=FIN%20543","No Sustainability Content"]
[null,"BA","FIN",544,"FIN 544","FINANCIAL RISK MANAGEMENT","Grad","https://catalog.oregonstate.edu/search/?P=FIN%20544","No Sustainability Content"]
[null,"BA","FIN",545,"FIN 545","INTERNATIONAL FINANCIAL MGMT","Grad","https://secure.oregonstate.edu/ap/cps/documents/view/125319","No Sustainability Content"]
[null,"BA","FIN",546,"FIN 546","ADVANCED CORPORATE FINANCE","Grad","https://secure.oregonstate.edu/ap/cps/documents/view/125145","No Sustainability Content"]
[null,"BA","FIN",549,"FIN 549","MERGERS AND ACQUISITIONS","Grad","https://secure.oregonstate.edu/ap/cps/documents/view/125146","No Sustainability Content"]
[null,"BA","FIN",550,{"$f":"TRIM(C2421)&\" \"&TRIM(D2421)","v":"FIN 550"},"FUND OF FINANCIAL PLANNING","Grad","https://secure.oregonstate.edu/ap/cps/documents/view/127396","No Sustainability Content"]
[null,"BA","FIN",551,"FIN 551","INSURANCE PLANNING AND TAX PLANNING. (4 Credits)","Grad","https://secure.oregonstate.edu/ap/cps/documents/view/111812","No Sustainability Content"]
[null,"BA","FIN",552,"FIN 552","FINANCIAL PLANNING II. (3 Credits)","Grad","https://secure.oregonstate.edu/ap/cps/documents/view/112085","No Sustainability Content"]
[null,"BA","FIN",553,"FIN 553","FINANCIAL PLANNING III. (6 Credits)","Grad","https://secure.oregonstate.edu/ap/cps/documents/view/111817","No Sustainability Content"]
[null,"BA","FIN",640,"FIN 640","FOUNDATIONS FINANCIAL RESEARCH","Grad","https://secure.oregonstate.edu/ap/cps/documents/view/113539","No Sustainability Content"]
[null,"BA","FIN",641,"FIN 641","CORPORATE FINANCE SEMINAR","Grad","https://secure.oregonstate.edu/ap/cps/documents/view/113540","No Sustainability Content"]
[null,"BA","FIN",642,"FIN 642","CAPITAL MARKETS","Grad","https://secure.oregonstate.edu/ap/cps/documents/view/113852","No Sustainability Content"]
[null,"FERM","FOR",112,"FOR 112","COMPUTING APPL IN FORESTRY","Undergrad","https://secure.oregonstate.edu/ap/cps/documents/view/101604","No Sustainability Content"]
[null,"FERM","FOR",207,"FOR 207","CAREER DEVELOPMENT","Undergrad","https://secure.oregonstate.edu/ap/cps/documents/view/8574","No Sustainability Content"]
[null,"FERM","FOR",322,"FOR 322","FOREST MODELS","Undergrad","https://secure.oregonstate.edu/ap/cps/documents/view/121996  ","No Sustainability Content"]
[null,"FERM","FOR",372,"FOR 372","Ethics in Adventure Leadership","Undergrad","https://secure.oregonstate.edu/ap/cps/documents/view/99896","No Sustainability Content"]
[null,"FERM","FOR",373,"FOR 373","Wilderness and Adventure Education","Undergrad","https://secure.oregonstate.edu/ap/cps/documents/view/99919","No Sustainability Content"]
[null,"FERM","FOR",375,"FOR 375","Principles and Methods of Experiential Education","Undergrad","https://secure.oregonstate.edu/ap/cps/documents/view/100176","No Sustainability Content"]
[null,"FERM","FOR",377,"FOR 377","Expeditions I",{"$f":"IF(D2434>499,\"Grad\", \"Undergrad\")","v":"Undergrad"},"https://secure.oregonstate.edu/ap/cps/documents/view/99990","No Sustainability Content"]
[null,"FERM","FOR",378,"FOR 378","Tourism and Recreation Data Analysis","Undergrad","https://secure.oregonstate.edu/ap/cps/documents/view/6667","No Sustainability Content"]
[null,"FERM","FOR",379,"FOR 379","Expeditions II","Undergrad","https://secure.oregonstate.edu/ap/cps/documents/view/111310","No Sustainability Content"]
[null,"FERM","FOR",411,"FOR 411","COOP ED MENTORED WORK EXPER","Undergrad","https://catalog.oregonstate.edu/search/?P=FOR%20411","No Sustainability Content"]
[null,"FERM","FOR",422,"FOR 422","METHODS IN SOCIAL SCIENCE","Undergrad","https://secure.oregonstate.edu/ap/cps/documents/view/101741","No Sustainability Content"]
[null,"FERM","FOR",436,"FOR 436","WILDLAND FIRE SCIENCE & MGMT","Undergrad","https://catalog.oregonstate.edu/search/?P=FOR%20436","No Sustainability Content"]
[null,"FERM","FOR",443,"FOR 443","SILVICULTURAL PRACTICES","Undergrad","https://secure.oregonstate.edu/ap/cps/documents/view/123682","No Sustainability Content"]
[null,"FERM","FOR",474,"FOR 474","Sustainability in Tourism and Outdoor Leadership","Undergrad","https://secure.oregonstate.edu/ap/cps/documents/view/99920","No Sustainability Content"]
[null,"FERM","FOR",476,"FOR 476","Management in Tourism and Outdoor Leadership","Undergrad","https://secure.oregonstate.edu/ap/cps/documents/view/100474","No Sustainability Content"]
[null,"FERM","FOR",477,"FOR 477","Adventure Therapy","Undergrad","https://secure.oregonstate.edu/ap/cps/documents/view/6596","No Sustainability Content"]
[null,"FERM","FOR",518,"FOR 518","MANAGING FOREST NUTRITION","Grad","https://secure.oregonstate.edu/ap/cps/documents/view/116856","No Sustainability Content"]
[null,"FERM","FOR",520,"FOR 520","GEOSPATIAL DATA ANALYSIS WITH MATLAB. (3 Credits)","Grad","https://secure.oregonstate.edu/ap/cps/documents/view/117003","No Sustainability Content"]
[null,"FERM","FOR",522,"FOR 522","RESEARCH METHODS IN SOCIAL SCIENCE","Grad","https://secure.oregonstate.edu/ap/cps/documents/view/108773","No Sustainability Content"]
[null,"FERM","FOR",523,"FOR 523","Quantitative Analysis in Social Science","Grad","https://secure.oregonstate.edu/ap/cps/documents/view/5936","No Sustainability Content"]
[null,"FERM","FOR",536,"FOR 536","WILDLAND FIRE SCIENCE & MGMT","Grad","https://catalog.oregonstate.edu/search/?P=FOR%20536","No Sustainability Content"]
[null,"FERM","FOR",542,{"$f":"TRIM(C2449)&\" \"&TRIM(D2449)","v":"FOR 542"},"INTERNL INTENSIVE SILVICULTURE","Grad","https://secure.oregonstate.edu/ap/cps/documents/view/128745","No Sustainability Content"]
[null,"SLCS","FR",121,"FR 121","SURVIVAL FRENCH FOR STUDENTS AND TRAVELERS. (3 Credits)","Undergrad","https://secure.oregonstate.edu/ap/cps/documents/view/7743","No Sustainability Content"]
[null,"SLCS","FR",322,"FR 322","FRENCH CONVERSATION FOR ADVANCED SPEAKERS II. (1 Credit)","Undergrad","https://secure.oregonstate.edu/ap/cps/documents/view/118828","No Sustainability Content"]
[null,"SLCS","FR",323,"FR 323","FRENCH CONVERSATION FOR ADVANCED SPEAKERS III. (1 Credit)","Undergrad","https://secure.oregonstate.edu/ap/cps/documents/view/118829","No Sustainability Content"]
[null,"SLCS","FR",329,"FR 329","Francophone Cultures in Film ","Undergrad","https://secure.oregonstate.edu/ap/cps/documents/view/107665","No Sustainability Content"]
[null,"SLCS","FR",334,"FR 334","GENDER AND SEXUAL IDENTITIES IN THE FRANCOPHONE WORLD. (3 Credits)","Undergrad","https://secure.oregonstate.edu/ap/cps/documents/view/114228","No Sustainability Content"]
[null,"SLCS","FR",336,"FR 336","QUEBEC: TEXTS AND CONTEXTS. (3 Credits)","Undergrad","https://secure.oregonstate.edu/ap/cps/documents/view/118291","No Sustainability Content"]
[null,"SLCS","FR",338,"FR 338","FRENCH FASHION AND GLAMOUR","Undergrad","https://secure.oregonstate.edu/ap/cps/documents/view/116586","No Sustainability Content"]
[null,"SLCS","FR",343,"FR 343","THE SHORT STORY: WOMEN IN THE FRANCOPHONE WORLD. (3 Credits)","Undergrad","https://secure.oregonstate.edu/ap/cps/documents/view/117864","No Sustainability Content"]
[null,"SLCS","FR",345,"FR 345","MULTIMODAL LITERACIES: FRENCH","Undergrad","https://secure.oregonstate.edu/ap/cps/documents/view/113938","No Sustainability Content"]
[null,"SLCS","FR",365,"FR 365","MIGRANT NARRATIVES: FRENCH. (2 Credits)","Undergrad","https://secure.oregonstate.edu/ap/cps/documents/view/121710","No Sustainability Content"]
[null,"SLCS","FR",375,"FR 375","LITERATURES OF POWER AND RESISTANCE: FRENCH. (2 Credits)","Undergrad","https://secure.oregonstate.edu/ap/cps/documents/view/121718","No Sustainability Content"]
[null,"SLCS","FR",376,"FR 376","EMPIRES AND GLOBALIZATION: FRENCH. (2 Credits)","Undergrad","https://secure.oregonstate.edu/ap/cps/documents/view/121708","No Sustainability Content"]
[null,"SLCS","FR",422,"FR 422","FRENCH CONVERSATIONS FOR ADVANCED SPEAKERS V. (1 Credit)","Undergrad","https://secure.oregonstate.edu/ap/cps/documents/view/118836","No Sustainability Content"]
[null,"SLCS","FR",423,"FR 423","FRENCH CONVERSATION FOR ADVANCED SPEAKERS VI. (1 Credit)","Undergrad","https://secure.oregonstate.edu/ap/cps/documents/view/120978","No Sustainability Content"]
[null,"SLCS","FR",429,"FR 429","French Society Through Cinema","Undergrad","https://secure.oregonstate.edu/ap/cps/documents/view/116261","No Sustainability Content"]
[null,"FST","FST",315,{"$f":"TRIM(C2465)&\" \"&TRIM(D2465)","v":"FST 315"},"PILOT PLANT EXPERIENCES","Undergrad","https://secure.oregonstate.edu/ap/cps/documents/view/127418","No Sustainability Content"]
[null,"FST","FST",360,"FST 360","FOOD SAFETY AND SANITATION","Undergrad","https://secure.oregonstate.edu/ap/cps/documents/view/108534","No Sustainability Content"]
[null,"FST","FST",370,"FST 370","INDUSTRY PREPARATION/HACCP","Undergrad","https://secure.oregonstate.edu/ap/cps/documents/view/112247","No Sustainability Content"]
[null,"FST","FST",385,"FST 385","^COMMUNICATING FOOD & FERM SCI","Undergrad","https://secure.oregonstate.edu/ap/cps/documents/view/117656","No Sustainability Content"]
[null,"FST","FST",420,"FST 420","SENSORY EVALUATION OF FOOD","Undergrad","https://catalog.oregonstate.edu/search/?P=FST%20420","No Sustainability Content"]
[null,"FST","FST",422,"FST 422","FOOD CHEMISTRY FUNDAMENTALS","Undergrad","https://catalog.oregonstate.edu/search/?P=FST%20422","No Sustainability Content"]
[null,"FST","FST",425,"FST 425","FOOD SYSTEMS CHEMISTRY","Undergrad","https://catalog.oregonstate.edu/search/?P=FST%20425","No Sustainability Content"]
[null,"FST","FST",430,"FST 430","INNOVATION AND FOOD PRODUCT DEVELOPMENT. (4 Credits)","Undergrad","https://secure.oregonstate.edu/ap/cps/documents/view/113139","Course that includes sustainability "]
[null,"FST","FST",460,"FST 460","BREWING SCIENCE","Undergrad","https://catalog.oregonstate.edu/search/?P=FST%20460","No Sustainability Content"]
[null,"FST","FST",461,"FST 461","BREWING ANALYSIS","Undergrad","https://catalog.oregonstate.edu/search/?P=FST%20461","No Sustainability Content"]
[null,"FST","FST",479,"FST 479","FERMENTATION MICROBIOLOGY","Undergrad","https://catalog.oregonstate.edu/search/?P=FST%20479","No Sustainability Content"]
[null,"FST","FST",490,"FST 490","FOOD PROCESSING CALCULATIONS. (2 Credits)","Undergrad","https://catalog.oregonstate.edu/search/?P=FST%20490","No Sustainability Content"]
[null,"FST","FST",491,"FST 491","FOOD PROCESSING CALCULATIONS LABORATORY. (1 Credit)","Undergrad","https://catalog.oregonstate.edu/search/?P=FST%20491","No Sustainability Content"]
[null,"FST","FST",520,"FST 520","SENSORY EVALUATION OF FOOD","Grad","https://catalog.oregonstate.edu/search/?P=FST%20520","No Sustainability Content"]
[null,"FST","FST",522,"FST 522","FOOD CHEMISTRY FUNDAMENTALS","Grad","https://catalog.oregonstate.edu/search/?P=FST%20522","No Sustainability Content"]
[null,"FST","FST",525,"FST 525","FOOD SYSTEMS CHEMISTRY","Grad","https://catalog.oregonstate.edu/search/?P=FST%20525","No Sustainability Content"]
[null,"FST","FST",560,"FST 560","BREWING SCIENCE","Grad","https://catalog.oregonstate.edu/search/?P=FST%20560","No Sustainability Content"]
[null,"FST","FST",561,"FST 561","BREWING ANALYSIS","Grad","https://catalog.oregonstate.edu/search/?P=FST%20561","No Sustainability Content"]
[null,"FST","FST",579,"FST 579","FERMENTATION MICROBIOLOGY","Grad","https://catalog.oregonstate.edu/search/?P=FST%20579","No Sustainability Content"]
[null,"FST","FST",590,"FST 590","Food Processing Calculations ","Grad","https://secure.oregonstate.edu/ap/cps/documents/view/10200","No Sustainability Content"]
[null,"FST","FST",591,"FST 591","Food Processing Calculations Laboratory ","Grad","https://secure.oregonstate.edu/ap/cps/documents/view/7693","No Sustainability Content"]
[null,"FST","FST",620,"FST 620","ADVANCED TOPICS IN SENSORY SCIENCE. (2 Credits)","Grad","https://secure.oregonstate.edu/ap/cps/documents/view/101166","No Sustainability Content"]
[null,"FST","FST",639,"FST 639","FOOD POLYMER SCIENCE. (3 Credits)","Grad","https://secure.oregonstate.edu/ap/cps/documents/view/107682","No Sustainability Content"]
[null,"FST","FST",641,"FST 641","PROCESSING WHEAT & OTHER GRAIN","Grad","https://secure.oregonstate.edu/ap/cps/documents/view/101182","No Sustainability Content"]
[null,"FST","FST",666,"FST 666","ADVANCED TOPICS IN ENOLOGY. (3 Credits)","Grad","https://secure.oregonstate.edu/ap/cps/documents/view/113462","No Sustainability Content"]
[null,"FW","FW",209,"FW 209","CAREER SKILLS IN F&W SCIENCES","Undergrad","https://secure.oregonstate.edu/ap/cps/documents/view/122846","No Sustainability Content"]
[null,"FW","FW",251,"FW 251","PRINCIPLES OF F&W CONSERVATION","Undergrad","https://secure.oregonstate.edu/ap/cps/documents/view/110375\nhttps://secure.oregonstate.edu/ap/cps/documents/view/110377","No Sustainability Content"]
[null,"FW","FW",307,"FW 307","SPECIALIZATION DEVELOPMENT","Undergrad","https://secure.oregonstate.edu/ap/cps/documents/view/113791","No Sustainability Content"]
[null,"FW","FW",315,"FW 315","ICHTHYOLOGY","Undergrad","https://secure.oregonstate.edu/ap/cps/documents/view/9344","No Sustainability Content"]
[null,"FW","FW",316,"FW 316","SYSTEMATICS OF FISHES","Undergrad","https://secure.oregonstate.edu/ap/cps/documents/view/120986","No Sustainability Content"]
[null,"FW","FW",328,{"$f":"TRIM(C2495)&\" \"&TRIM(D2495)","v":"FW 328"},"WILDLIFE CAPTURE & IMMOBILIZAT","Undergrad","https://secure.oregonstate.edu/ap/cps/documents/view/8239","No Sustainability Content"]
[null,"FW","FW",370,"FW 370","CONSERVATION GENETICS","Undergrad","https://secure.oregonstate.edu/ap/cps/documents/view/121036","No Sustainability Content"]
[null,"FW","FW",454,"FW 454","^FISHERY BIOLOGY","Undergrad","https://catalog.oregonstate.edu/search/?P=FW%20454","No Sustainability Content"]
[null,"FW","FW",469,"FW 469","PHYS/BEHAV MARINE MEGAFAUNA",{"$f":"IF(D2498>499,\"Grad\", \"Undergrad\")","v":"Undergrad"},"https://secure.oregonstate.edu/ap/cps/documents/view/124450","No Sustainability Content"]
[null,"FW","FW",476,"FW 476","FISH PHYSIOLOGY","Undergrad","https://catalog.oregonstate.edu/search/?P=FW%20476","No Sustainability Content"]
[null,"FW","FW",477,"FW 477","AGE AND GROWTH OF FISH. (3 Credits)","Undergrad","https://catalog.oregonstate.edu/search/?P=FW%20477","No Sustainability Content"]
[null,"FW","FW",493,"FW 493","FIELD METHODS FOR MARINE RES","Undergrad","https://secure.oregonstate.edu/ap/cps/documents/view/118295","No Sustainability Content"]
[null,"FW","FW",496,"FW 496","FISH DISEASES IN CONSERVATION BIOLOGY AND AQUACULTURE LAB. (2 Credits)","Undergrad","https://catalog.oregonstate.edu/search/?P=FW%20496","No Sustainability Content"]
[null,"FW","FW",502,"FW 502","TEACHING METHODS IN FW","Grad","https://secure.oregonstate.edu/ap/cps/documents/view/116806","No Sustainability Content"]
[null,"FW","FW",506,"FW 506","PROJECTS","Grad","https://secure.oregonstate.edu/ap/cps/documents/view/103858","No Sustainability Content"]
[null,"FW","FW",514,"FW 514","PROF DEVELOPMENT: MEETING COMM","Grad","https://secure.oregonstate.edu/ap/cps/documents/view/105459","No Sustainability Content"]
[null,"FW","FW",516,"FW 516","Laboratory Methods for Ageing Fish  ","Grad","https://secure.oregonstate.edu/ap/cps/documents/view/115403","No Sustainability Content"]
[null,"FW","FW",518,"FW 518","Animal Population Dynamics","Grad","https://secure.oregonstate.edu/ap/cps/documents/view/5720","No Sustainability Content"]
[null,"FW","FW",528,"FW 528","DIVERSITY AND IDENTIFICATION OF LARVAL FISHES. (3 Credits)","Grad","https://secure.oregonstate.edu/ap/cps/documents/view/130119 ","No Sustainability Content"]
[null,"FW","FW",529,"FW 529","ICHTHYOPLANKTON IDENTIFICATION LABORATORY. (2 Credits)","Grad","https://secure.oregonstate.edu/ap/cps/documents/view/130114","No Sustainability Content"]
[null,"FW","FW",540,"FW 540","VERTEBRATE POPULATION DYNAMICS. (4 Credits)","Grad","https://secure.oregonstate.edu/ap/cps/documents/view/106566","No Sustainability Content"]
[null,"FW","FW",554,"FW 554","FISHERY BIOLOGY","Grad","https://catalog.oregonstate.edu/search/?P=FW%20554","No Sustainability Content"]
[null,"FW","FW",569,{"$f":"TRIM(C2512)&\" \"&TRIM(D2512)","v":"FW 569"},"PHYS/BEHAV MARINE MEGAFAUNA","Grad","https://secure.oregonstate.edu/ap/cps/documents/view/127284","No Sustainability Content"]
[null,"FW","FW",576,"FW 576","FISH PHYSIOLOGY","Grad","https://catalog.oregonstate.edu/search/?P=FW%20576","No Sustainability Content"]
[null,"FW","FW",577,"FW 577","Age and Growth of Fish ","Grad","https://secure.oregonstate.edu/ap/cps/documents/view/114082","No Sustainability Content"]
[null,"FW","FW",596,"FW 596","FISH DISEASES IN CONSERVATION BIOLOGY AND AQUACULTURE LAB. (2 Credits)","Grad","https://catalog.oregonstate.edu/search/?P=FW%20596","No Sustainability Content"]
[null,"SAC","GD",121,"GD 121","ADOBE SOFTWARE BASICS. (3 Credits)","Undergrad","https://secure.oregonstate.edu/ap/cps/documents/view/120770","No Sustainability Content"]
[null,"SAC","GD",126,"GD 126","GRAPHIC DESIGN PRO APPLICATION","Undergrad","https://secure.oregonstate.edu/ap/cps/documents/view/119400","No Sustainability Content"]
[null,"SAC","GD",200,"GD 200","GRAPHIC DESIGN TECHNOLOGY AND PRODUCTION 1. (4 Credits)","Undergrad","https://secure.oregonstate.edu/ap/cps/documents/view/128931","No Sustainability Content"]
[null,"SAC","GD",220,{"$f":"TRIM(C2519)&\" \"&TRIM(D2519)","v":"GD 220"},"TECHNOLOGY & PRODUCTION 2","Undergrad","https://secure.oregonstate.edu/ap/cps/documents/view/128932","No Sustainability Content"]
[null,"SAC","GD",224,"GD 224","INTERACTIVE DESIGN 1","Undergrad","https://secure.oregonstate.edu/ap/cps/documents/view/117849","No Sustainability Content"]
[null,"SAC","GD",226,"GD 226","TYPOGRAPHY 1","Undergrad","https://secure.oregonstate.edu/ap/cps/documents/view/123702","No Sustainability Content"]
[null,"SAC","GD",227,"GD 227","Drawing for Graphic Design","Undergrad","https://secure.oregonstate.edu/ap/cps/documents/view/120858","No Sustainability Content"]
[null,"SAC","GD",228,"GD 228","PROCESS: MAKING AND MEANING","Undergrad","https://secure.oregonstate.edu/ap/cps/documents/view/123646","No Sustainability Content"]
[null,"SAC","GD",230,"GD 230","GRAPHIC DESIGN PROFESSIONAL DEVELOPMENT. (2 Credits)","Undergrad","https://secure.oregonstate.edu/ap/cps/documents/view/129216","No Sustainability Content"]
[null,"SAC","GD",312,"GD 312","^CONTEMPORARY ISSUES IN DESIGN","Undergrad","https://secure.oregonstate.edu/ap/cps/documents/view/122341","No Sustainability Content"]
[null,"SAC","GD",326,"GD 326","TYPOGRAPHY 2","Undergrad","https://secure.oregonstate.edu/ap/cps/documents/view/123711","No Sustainability Content"]
[null,"SAC","GD",328,"GD 328","INTERACTIVE 2","Undergrad","https://secure.oregonstate.edu/ap/cps/documents/view/123703","No Sustainability Content"]
[null,"SAC","GD",419,{"$f":"TRIM(C2528)&\" \"&TRIM(D2528)","v":"GD 419"},"PORTFOLIO REVIEW","Undergrad","https://secure.oregonstate.edu/ap/cps/documents/view/129123","No Sustainability Content"]
[null,"SAC","GD",420,"GD 420","PROFESSIONAL PRACTICES","Undergrad","https://secure.oregonstate.edu/ap/cps/documents/view/120859","No Sustainability Content"]
[null,"SAC","GD",424,"GD 424","BRAND IDENTITY SYSTEMS","Undergrad","https://secure.oregonstate.edu/ap/cps/documents/view/123756","No Sustainability Content"]
[null,"SAC","GD",426,"GD 426","GRAPHIC DESIGN CAPSTONE 1","Undergrad","https://secure.oregonstate.edu/ap/cps/documents/view/120335","No Sustainability Content"]
[null,"SAC","GD",427,"GD 427","CAPSTONE 2","Undergrad","https://secure.oregonstate.edu/ap/cps/documents/view/120768","No Sustainability Content"]
[null,"SAC","GD",430,{"$f":"TRIM(C2533)&\" \"&TRIM(D2533)","v":"GD 430"},"GRAPHIC DESIGN PRACTICUM","Undergrad","https://secure.oregonstate.edu/ap/cps/documents/view/128923","No Sustainability Content"]
[null,"CBE","GEN",554,"GEN 554","Genome Organization, Structure, and Maintenance.","Grad","https://secure.oregonstate.edu/ap/cps/documents/view/4856","No Sustainability Content"]
[null,"CBE","GEN",555,"GEN 555","Genome Expression and Regulation","Grad","https://secure.oregonstate.edu/ap/cps/documents/view/5951","No Sustainability Content"]
[null,"CBE","GEN",556,"GEN 556","CELL AND DEVELOPMENTAL BIOLOGY   ","Grad","https://secure.oregonstate.edu/ap/cps/documents/view/7587","No Sustainability Content"]
[null,"GEO","GEO",100,"GEO 100","*NATURAL DISASTERS","Undergrad","https://secure.oregonstate.edu/ap/cps/documents/view/121810","No Sustainability Content"]
[null,"GEO","GEO",295,"GEO 295","INTRODUCTION TO FIELD GEOLOGY","Undergrad","https://secure.oregonstate.edu/ap/cps/documents/view/123387","No Sustainability Content"]
[null,"GEO","GEO",310,"GEO 310","EARTH MATERIALS I: MINERALOGY","Undergrad","https://secure.oregonstate.edu/ap/cps/documents/view/115034","No Sustainability Content"]
[null,"GEO","GEO",322,"GEO 322","SURFACE PROCESSES","Undergrad","https://secure.oregonstate.edu/ap/cps/documents/view/121695","No Sustainability Content"]
[null,"GEO","GEO",352,"GEO 352","*OREGON: GEOLOGY, PLACE, AND LIFE ON THE RING OF FIRE. (4 Credits)","Undergrad","https://secure.oregonstate.edu/ap/cps/documents/view/5757","No Sustainability Content"]
[null,"GEO","GEO",370,"GEO 370","STRATIGRAPHY AND SEDIMENTOLOGY","Undergrad","https://secure.oregonstate.edu/ap/cps/documents/view/9115","No Sustainability Content"]
[null,"GEO","GEO",415,"GEO 415","EARTH MATERIALS III: PETROG","Undergrad","https://secure.oregonstate.edu/ap/cps/documents/view/112715","No Sustainability Content"]
[null,"GEO","GEO",430,"GEO 430","GEOCHEMISTRY","Undergrad","https://catalog.oregonstate.edu/search/?P=GEO%20430","No Sustainability Content"]
[null,"GEO","GEO",431,"GEO 431","ENVIRONMENTAL GEOCHEMISTRY","Undergrad","https://catalog.oregonstate.edu/search/?P=GEO%20431","No Sustainability Content"]
[null,"GEO","GEO",484,"GEO 484","INTRO TO BIOGEOCHEMISTRY","Undergrad","https://secure.oregonstate.edu/ap/cps/documents/view/109905","No Sustainability Content"]
[null,"GEO","GEO",516,"GEO 516","INTERPRET OF GEOLOGIC MAPS","Grad","https://secure.oregonstate.edu/ap/cps/documents/view/120158","No Sustainability Content"]
[null,"GEO","GEO",518,"GEO 518","GEOSCIENCE COMMUNICATION","Grad","https://secure.oregonstate.edu/ap/cps/documents/view/5462","No Sustainability Content"]
[null,"GEO","GEO",530,"GEO 530","GEOCHEMISTRY","Grad","https://catalog.oregonstate.edu/search/?P=GEO%20530","No Sustainability Content"]
[null,"GEO","GEO",531,"GEO 531","ENVIRONMENTAL GEOCHEMISTRY","Grad","https://catalog.oregonstate.edu/search/?P=GEO%20531","No Sustainability Content"]
[null,"GEO","GEO",535,"GEO 535","GEOCHEMICAL ANALYSIS TECHNIQUES. (3 Credits)","Grad","https://secure.oregonstate.edu/ap/cps/documents/view/7821","Unavailable syllabus"]
[null,"GEO","GEO",568,"GEO 568","Interactive Cartography and Geovisualization","Grad","https://secure.oregonstate.edu/ap/cps/documents/view/114135","No Sustainability Content"]
[null,"GEO","GEO",577,"GEO 577","Algorithms for Geographic Information Science","Grad","https://secure.oregonstate.edu/ap/cps/documents/view/116582","No Sustainability Content"]
[null,"GEO","GEO",584,"GEO 584","Advanced spatial statistics and GIScience","Grad","https://secure.oregonstate.edu/ap/cps/documents/view/122444","No Sustainability Content"]
[null,"GEO","GEO",646,"GEO 646","Topics in Ore Genesis:  “The Role of Magmatic Volatiles in Forming Mineral Deposits”","Grad","https://secure.oregonstate.edu/ap/cps/documents/view/5318","No Sustainability Content"]
[null,"GEO","GEO",694,"GEO 694","TOPICS IN ORE GENESIS. (1-3 Credits)","Grad","https://catalog.oregonstate.edu/search/?P=GEO%20694","No Sustainability Content"]
[null,"GEO","GEOG",201,"GEOG 201","*GEOSPATIAL SCIENCE AND GIS","Undergrad","https://secure.oregonstate.edu/ap/cps/documents/view/124288","No Sustainability Content"]
[null,"GEO","GEOG",295,"GEOG 295","GEOGRAPHIC FIELD RESEARCH","Undergrad","https://secure.oregonstate.edu/ap/cps/documents/view/124887","No Sustainability Content"]
[null,"GEO","GEOG",311,"GEOG 311","*GEOGRAPHY OF AFRICA","Undergrad","https://secure.oregonstate.edu/ap/cps/documents/view/122868","No Sustainability Content"]
[null,"GEO","GEOG",314,"GEOG 314","*GEOGRAPHY OF LATIN AMERICA. (3 Credits)","Undergrad","https://secure.oregonstate.edu/ap/cps/documents/view/122448","No Sustainability Content"]
[null,"GEO","GEOG",360,"GEOG 360","GIS: GEOG INFO SYST & THEORY","Undergrad","https://secure.oregonstate.edu/ap/cps/documents/view/124736","No Sustainability Content"]
[null,"GEO","GEOG",361,"GEOG 361","GIS II: ANALYSIS & APPLICATION",{"$f":"IF(D2562>499,\"Grad\", \"Undergrad\")","v":"Undergrad"},"https://secure.oregonstate.edu/ap/cps/documents/view/124906","No Sustainability Content"]
[null,"GEO","GEOG",370,"GEOG 370","GEOVISUALIZATION: CARTOGRAPHY","Undergrad","https://secure.oregonstate.edu/ap/cps/documents/view/124129","No Sustainability Content"]
[null,"GEO","GEOG",371,"GEOG 371","GEOVISUALIZATION: WEB MAPPING","Undergrad","https://secure.oregonstate.edu/ap/cps/documents/view/124265","No Sustainability Content"]
[null,"GEO","GEOG",424,"GEOG 424","HYDROLOGY FOR WATER RES MGMT","Undergrad","https://catalog.oregonstate.edu/search/?P=GEOG%20424","No Sustainability Content"]
[null,"GEO","GEOG",462,"GEOG 462","GIS III: GEOSPATIAL ANALYSIS","Undergrad","https://catalog.oregonstate.edu/search/?P=GEOG%20462","No Sustainability Content"]
[null,"GEO","GEOG",472,"GEOG 472","GEOVIS: GEOVIS ANALYTICS","Undergrad","https://catalog.oregonstate.edu/search/?P=GEOG%20472","No Sustainability Content"]
[null,"GEO","GEOG",480,"GEOG 480","REMOTE SENSING I: PRIN & APPS","Undergrad","https://catalog.oregonstate.edu/search/?P=GEOG%20480","No Sustainability Content"]
[null,"GEO","GEOG",481,"GEOG 481","DIGITAL IMAGE PROCESSING","Undergrad","https://catalog.oregonstate.edu/search/?P=GEOG%20481","No Sustainability Content"]
[null,"GEO","GEOG",495,"GEOG 495","FIELD GEOGRAPHY OF OREGON I","Undergrad","https://secure.oregonstate.edu/ap/cps/documents/view/125403","No Sustainability Content"]
[null,"GEO","GEOG",524,"GEOG 524","HYDROLOGY FOR WATER RES MGMT","Grad","https://catalog.oregonstate.edu/search/?P=GEOG%20524","No Sustainability Content"]
[null,"GEO","GEOG",560,"GEOG 560","GIS I: INTRO GEOG INFO SCIENCE","Grad","https://secure.oregonstate.edu/ap/cps/documents/view/124125","No Sustainability Content"]
[null,"GEO","GEOG",562,"GEOG 562","GIS III: GEOSPATIAL ANALYSIS","Grad","https://catalog.oregonstate.edu/search/?P=GEOG%20562","No Sustainability Content"]
[null,"GEO","GEOG",566,"GEOG 566","ADV SPATIAL STATISTICS & GIS","Grad","https://secure.oregonstate.edu/ap/cps/documents/view/124269","No Sustainability Content"]
[null,"GEO","GEOG",571,"GEOG 571","GEOVISUALIZATION: WEB MAPPING. (4 Credits)","Grad","https://secure.oregonstate.edu/ap/cps/documents/view/125442","No Sustainability Content"]
[null,"GEO","GEOG",572,"GEOG 572","GEOVIS: GEOVIS ANALYTICS","Grad","https://catalog.oregonstate.edu/search/?P=GEOG%20572","No Sustainability Content"]
[null,"GEO","GEOG",580,"GEOG 580","REMOTE SENSING I: PRIN & APPS","Grad","https://catalog.oregonstate.edu/search/?P=GEOG%20580","No Sustainability Content"]
[null,"GEO","GEOG",581,"GEOG 581","DIGITAL IMAGE PROCESSING","Grad","https://catalog.oregonstate.edu/search/?P=GEOG%20581","No Sustainability Content"]
[null,"GEO","GEOG",595,"GEOG 595","FIELD GEOGRAPHY OF OREGON II","Grad","https://secure.oregonstate.edu/ap/cps/documents/view/122467","No Sustainability Content"]
[null,"SLCS","GER",231,"GER 231","German Dictatorships: Nazis and Communists","Undergrad","https://secure.oregonstate.edu/ap/cps/documents/view/109170","No Sustainability Content"]
[null,"SLCS","GER",241,"GER 241","Grimms’ Fairy Tales","Undergrad","https://secure.oregonstate.edu/ap/cps/documents/view/115415","No Sustainability Content"]
[null,"SLCS","GER",261,"GER 261","MASTERPIECES OF GERMAN CINEMA","Undergrad","https://secure.oregonstate.edu/ap/cps/documents/view/102097","No Sustainability Content"]
[null,"SLCS","GER",345,"GER 345","MULTIMODAL LITERACIES: GERMAN","Undergrad","https://secure.oregonstate.edu/ap/cps/documents/view/113939","No Sustainability Content"]
[null,"SLCS","GER",355,"GER 355","TRANSLATION. (3 Credits)","Undergrad","https://secure.oregonstate.edu/ap/cps/documents/view/101424","No Sustainability Content"]
[null,"SLCS","GER",361,"GER 361","CRITICAL ISSUES OF GERMAN CINEMA. (3 Credits)","Undergrad","https://secure.oregonstate.edu/ap/cps/documents/view/103264","No Sustainability Content"]
[null,"SLCS","GER",363,"GER 363","CONTEMPORARY GERMAN CINEMA","Undergrad","https://secure.oregonstate.edu/ap/cps/documents/view/100525","No Sustainability Content"]
[null,"SLCS","GER",421,"GER 421","GERMAN LANGUAGE TANDEM. (1 Credit)","Undergrad","https://secure.oregonstate.edu/ap/cps/documents/view/105335","No Sustainability Content"]
[null,"OC","GPH",640,"GPH 640","GEODESY. (4 Credits)","Grad","https://secure.oregonstate.edu/ap/cps/documents/view/10210","No Sustainability Content"]
[null,"OC","GPH",651,{"$f":"TRIM(C2589)&\" \"&TRIM(D2589)","v":"GPH 651"},"GEODYNAMICS I","Grad","https://secure.oregonstate.edu/ap/cps/documents/view/132038","No Sustainability Content"]
[null,"GRAD","GRAD",430,"GRAD 430","INTRO TO SCIENTIFIC DIVING","Undergrad","https://catalog.oregonstate.edu/search/?P=GRAD%20430","No Sustainability Content"]
[null,"GRAD","GRAD",511,"GRAD 511","DESIGNING A PATH FOR SUCCESS","Grad","https://secure.oregonstate.edu/ap/cps/documents/view/112728","No Sustainability Content"]
[null,"GRAD","GRAD",512,"GRAD 512","CURRENT ISSUES IN HIGHER ED","Grad","https://secure.oregonstate.edu/ap/cps/documents/view/116287","No Sustainability Content"]
[null,"GRAD","GRAD",513,{"$f":"TRIM(C2593)&\" \"&TRIM(D2593)","v":"GRAD 513"},"PRODEV COLLEGE & UNIV TEACHING","Grad","https://secure.oregonstate.edu/ap/cps/documents/view/129313","No Sustainability Content"]
[null,"GRAD","GRAD",520,{"$f":"TRIM(C2594)&\" \"&TRIM(D2594)","v":"GRAD 520"},"RESPONSIBLE CONDUCT RESEARCH","Grad","https://secure.oregonstate.edu/ap/cps/documents/view/129387","No Sustainability Content"]
[null,"GRAD","GRAD",521,"GRAD 521","RESEARCH DATA MANAGEMENT","Grad","https://secure.oregonstate.edu/ap/cps/documents/view/112083","No Sustainability Content"]
[null,"GRAD","GRAD",522,"GRAD 522","PREPARING AN IRB SUBMISSION","Grad","https://secure.oregonstate.edu/ap/cps/documents/view/117019","No Sustainability Content"]
[null,"GRAD","GRAD",530,"GRAD 530","INTRO TO SCIENTIFIC DIVING","Grad","https://catalog.oregonstate.edu/search/?P=GRAD%20530","No Sustainability Content"]
[null,"GRAD","GRAD",550,"GRAD 550","INTRO ONLINE COURSE DEVELOPMNT","Grad","https://secure.oregonstate.edu/ap/cps/documents/view/113041","No Sustainability Content"]
[null,"GRAD","GRAD",560,"GRAD 560","THEORIES TEACHING AND LEARNING","Grad","https://secure.oregonstate.edu/ap/cps/documents/view/117279","No Sustainability Content"]
[null,"GRAD","GRAD",561,"GRAD 561","COURSE DESIGN AND METHODS","Grad","https://secure.oregonstate.edu/ap/cps/documents/view/117227","No Sustainability Content"]
[null,"GRAD","GRAD",570,{"$f":"TRIM(C2601)&\" \"&TRIM(D2601)","v":"GRAD 570"},"TRANSLATING RESEARCH TO INNOVA","Grad","https://secure.oregonstate.edu/ap/cps/documents/view/130095","No Sustainability Content"]
[null,"GRAD","GRAD",571,"GRAD 571","TRANSLATING INNOVATION TO MARKET I. (4 Credits)","Grad","https://secure.oregonstate.edu/ap/cps/documents/view/131580","No Sustainability Content"]
[null,"SBHS","H",210,"H 210","*INTRO TO HEALTH CARE SYSTEM","Undergrad","https://secure.oregonstate.edu/ap/cps/documents/view/100110","No Sustainability Content"]
[null,"SBHS","H",220,"H 220","INTRO TO HEALTH DATA ANALYSIS","Undergrad","https://secure.oregonstate.edu/ap/cps/documents/view/107429","No Sustainability Content"]
[null,"SBHS","H",225,"H 225","*SOCIAL AND INDIVIDUAL HEALTH","Undergrad","https://secure.oregonstate.edu/ap/cps/documents/view/8062","No Sustainability Content"]
[null,"SBHS","H",310,"H 310","HEALTH FIELD EXPERIENCES","Undergrad","https://secure.oregonstate.edu/ap/cps/documents/view/5713","No Sustainability Content"]
[null,"SBHS","H",319,"H 319","INTRODUCTION TO HEALTH POLICY","Undergrad","https://secure.oregonstate.edu/ap/cps/documents/view/125272","No Sustainability Content"]
[null,"SBHS","H",320,{"$f":"TRIM(C2608)&\" \"&TRIM(D2608)","v":"H 320"},"INTRODUCTION TO HUMAN DISEASE","Undergrad","https://secure.oregonstate.edu/ap/cps/documents/view/110966","Unavailable syllabus"]
[null,"SBHS","H",407,"H 407","SEMINAR","Undergrad","https://secure.oregonstate.edu/ap/cps/documents/view/107748","No Sustainability Content"]
[null,"SBHS","H",410,"H 410","INTERNSHIP","Undergrad","https://secure.oregonstate.edu/ap/cps/documents/view/117541","No Sustainability Content"]
[null,"SBHS","H",432,"H 432","ECON ISSUES IN HLTH & MED CARE","Undergrad","https://secure.oregonstate.edu/ap/cps/documents/view/123891","No Sustainability Content"]
[null,"SBHS","H",434,"H 434","^HEALTH CARE LAW & REGULATION","Undergrad","https://secure.oregonstate.edu/ap/cps/documents/view/105407","No Sustainability Content"]
[null,"SBHS","H",436,"H 436","ADV TOPICS IN HEALTH CARE MGMT","Undergrad","https://secure.oregonstate.edu/ap/cps/documents/view/101623","No Sustainability Content"]
[null,"SBHS","H",448,"H 448","PUBLIC HEALTH TOXICOLOGY","Undergrad","https://secure.oregonstate.edu/ap/cps/documents/view/117451","No Sustainability Content"]
[null,"SBHS","H",449,"H 449","MASS MEDIA AND HEALTH","Undergrad","https://secure.oregonstate.edu/ap/cps/documents/view/102005","No Sustainability Content"]
[null,"SBHS","H",457,"H 457","FIN MGMT OF HLTH CARE ORGANIZ","Undergrad","https://catalog.oregonstate.edu/search/?P=H%20457","No Sustainability Content"]
[null,"SBHS","H",467,"H 467","LONG-TERM CARE ALTERNATIVES. (3 Credits)","Undergrad","https://catalog.oregonstate.edu/search/?P=H%20467","No Sustainability Content"]
[null,"SBHS","H",476,"H 476","^HEALTH PROGRAM PLANNING","Undergrad","https://secure.oregonstate.edu/ap/cps/documents/view/104690","No Sustainability Content"]
[null,"SBHS","H",494,"H 494","APPLIED ERGONOMICS. (3 Credits)","Undergrad","https://catalog.oregonstate.edu/search/?P=H%20494","No Sustainability Content"]
[null,"SBHS","H",510,{"$f":"TRIM(C2620)&\" \"&TRIM(D2620)","v":"H 510"},"INTERNSHIP","Grad","https://secure.oregonstate.edu/ap/cps/documents/view/132754","No Sustainability Content"]
[null,"SBHS","H",515,"H 515","RESEARCH METH IN SOC & BEH","Grad","https://secure.oregonstate.edu/ap/cps/documents/view/107600","No Sustainability Content"]
[null,"SBHS","H",516,"H 516","RESEARCH METHODS IN GLBL HLTH","Grad","https://secure.oregonstate.edu/ap/cps/documents/view/116158","No Sustainability Content"]
[null,"SBHS","H",518,"H 518","PUBLIC HEALTH ETHICS AND ISSUES. (3 Credits)","Grad","https://secure.oregonstate.edu/ap/cps/documents/view/131881","No Sustainability Content"]
[null,"SBHS","H",524,"H 524","INTRODUCTION TO BIOSTATISTICS","Grad","https://secure.oregonstate.edu/ap/cps/documents/view/4406","No Sustainability Content"]
[null,"SBHS","H",525,"H 525","EPIDEMIOLOGICAL METHODS I","Grad","https://secure.oregonstate.edu/ap/cps/documents/view/106835","No Sustainability Content"]
[null,"SBHS","H",526,{"$f":"TRIM(C2626)&\" \"&TRIM(D2626)","v":"H 526"},"EPIDEMIOLOGIC METHODS II",{"$f":"IF(D2626>499,\"Grad\", \"Undergrad\")","v":"Grad"},"https://secure.oregonstate.edu/ap/cps/documents/view/129103","No Sustainability Content"]
[null,"SBHS","H",530,{"$f":"TRIM(C2627)&\" \"&TRIM(D2627)","v":"H 530"},"HEALTH POL ANALYSIS & POLITICS","Grad","https://secure.oregonstate.edu/ap/cps/documents/view/130461","No Sustainability Content"]
[null,"SBHS","H",535,{"$f":"TRIM(C2628)&\" \"&TRIM(D2628)","v":"H 535"},"INTERPRETING EPI EVIDENCE","Grad","https://secure.oregonstate.edu/ap/cps/documents/view/128219 ","No Sustainability Content"]
[null,"SBHS","H",536,{"$f":"TRIM(C2629)&\" \"&TRIM(D2629)","v":"H 536"},"HLTHCRE ORG LDRSP THRY & BEHAV","Grad","https://secure.oregonstate.edu/ap/cps/documents/view/130761  ","No Sustainability Content"]
[null,"SBHS","H",542,"H 542","HUMAN HEALTH RISK ASSESSMENT","Grad","https://secure.oregonstate.edu/ap/cps/documents/view/118168","No Sustainability Content"]
[null,"SBHS","H",543,"H 543","EXPOSURE SCIENCE I","Grad","https://secure.oregonstate.edu/ap/cps/documents/view/116283","No Sustainability Content"]
[null,"SBHS","H",545,"H 545","OCCUPATIONAL HEALTH","Grad","https://secure.oregonstate.edu/ap/cps/documents/view/108760","No Sustainability Content"]
[null,"SBHS","H",547,"H 547","GIS AND PUBLIC HEALTH","Grad","https://secure.oregonstate.edu/ap/cps/documents/view/116039","No Sustainability Content"]
[null,"SBHS","H",548,"H 548","PUBLIC HEALTH TOXICOLOGY","Grad","https://secure.oregonstate.edu/ap/cps/documents/view/117451","No Sustainability Content"]
[null,"SBHS","H",549,"H 549","MASS MEDIA AND HEALTH","Grad","https://secure.oregonstate.edu/ap/cps/documents/view/100077","No Sustainability Content"]
[null,"SBHS","H",551,"H 551","APP EPI ANLYS OF SECONDRY DATA","Grad","https://secure.oregonstate.edu/ap/cps/documents/view/120511","No Sustainability Content"]
[null,"SBHS","H",554,"H 554","EPIDEMIOLOGY OF AGING. (3 Credits)","Grad","https://secure.oregonstate.edu/ap/cps/documents/view/108501","No Sustainability Content"]
[null,"SBHS","H",555,"H 555","CANCER EPIDEMIOLOGY","Grad","https://secure.oregonstate.edu/ap/cps/documents/view/105121","No Sustainability Content"]
[null,"SBHS","H",557,"H 557","FINANCIAL MANAGEMENT OF HEALTH CARE ORGANIZATIONS. (3 Credits)","Grad","https://catalog.oregonstate.edu/search/?P=H%20557","No Sustainability Content"]
[null,"SBHS","H",559,"H 559","Contracts and Negotiation","Grad","https://secure.oregonstate.edu/ap/cps/documents/view/102360","No Sustainability Content"]
[null,"SBHS","H",562,{"$f":"TRIM(C2641)&\" \"&TRIM(D2641)","v":"H 562"},"INFECT DISEASE EPIDEMIOLOGY","Grad","https://secure.oregonstate.edu/ap/cps/documents/view/133721","No Sustainability Content"]
[null,"SBHS","H",563,"H 563","PHYSICAL ACTIVITY EPIDEMIOLOGY","Grad","https://secure.oregonstate.edu/ap/cps/documents/view/123329","No Sustainability Content"]
[null,"SBHS","H",564,"H 564","COMPUTING TOOLS & HEALTH DATA","Grad","https://secure.oregonstate.edu/ap/cps/documents/view/103055","No Sustainability Content"]
[null,"SBHS","H",566,"H 566","DATA MINING IN PUBLIC HEALTH. (3 Credits)","Grad","https://secure.oregonstate.edu/ap/cps/documents/view/103860","No Sustainability Content"]
[null,"SBHS","H",567,"H 567","LONG-TERM CARE ALTERNATIVES. (3 Credits)","Grad","https://catalog.oregonstate.edu/search/?P=H%20567","No Sustainability Content"]
[null,"SBHS","H",570,"H 570","Workflow of Data Analysis","Grad","https://secure.oregonstate.edu/ap/cps/documents/view/100871","No Sustainability Content"]
[null,"SBHS","H",573,"H 573","MULTILEVEL/HIERARCHICAL MODELS","Grad","https://secure.oregonstate.edu/ap/cps/documents/view/103060","No Sustainability Content"]
[null,"SBHS","H",575,"H 575","EVAL/HLTH PROMO & EDUC PROGRMS","Grad","https://secure.oregonstate.edu/ap/cps/documents/view/8468","No Sustainability Content"]
[null,"SBHS","H",578,"H 578","INTRODUCTION TO MOLECULAR EPIDEMIOLOGY I. (3 Credits)","Grad","https://secure.oregonstate.edu/ap/cps/documents/view/103056","No Sustainability Content"]
[null,"SBHS","H",579,"H 579","Introduction to Molecular Epidemiology II","Grad","https://secure.oregonstate.edu/ap/cps/documents/view/103067","No Sustainability Content"]
[null,"SBHS","H",580,"H 580","LINEAR REGRESSION & ANALYSIS","Grad","https://secure.oregonstate.edu/ap/cps/documents/view/103057","No Sustainability Content"]
[null,"SBHS","H",581,"H 581","GENERALIZED LINEAR MODELS AND CATEGORICAL DATA ANALYSIS. (4 Credits)","Grad","https://secure.oregonstate.edu/ap/cps/documents/view/103058","No Sustainability Content"]
[null,"SBHS","H",582,"H 582","ANALYSIS CORRELATED HLTH DATA","Grad","https://secure.oregonstate.edu/ap/cps/documents/view/103068","No Sustainability Content"]
[null,"SBHS","H",584,"H 584","ANALYSIS INTERVENTION STUDIES","Grad","https://secure.oregonstate.edu/ap/cps/documents/view/103600","No Sustainability Content"]
[null,"SBHS","H",586,"H 586","BAYESIAN BIOSTATS IN PUBL HLTH","Grad","https://secure.oregonstate.edu/ap/cps/documents/view/103070","No Sustainability Content"]
[null,"SBHS","H",587,"H 587","TIME TO EVENT ANALYSIS OF HEALTH DATA. (3 Credits)","Grad","https://secure.oregonstate.edu/ap/cps/documents/view/103071","No Sustainability Content"]
[null,"SBHS","H",588,"H 588","APPLIED OCCUP SAFETY & HEALTH","Grad","https://secure.oregonstate.edu/ap/cps/documents/view/108813","No Sustainability Content"]
[null,"SBHS","H",590,"H 590","OCCUPATIONAL ERGONOMICS AND BIOMECHANICS. (3 Credits)","Grad","https://secure.oregonstate.edu/ap/cps/documents/view/132853","No Sustainability Content"]
[null,"SBHS","H",592,"H 592","SPATIAL EPIDEMIOLOGY. (3 Credits)","Grad","https://secure.oregonstate.edu/ap/cps/documents/view/117569","No Sustainability Content"]
[null,"SBHS","H",593,"H 593","REPRODUCTIVE EPIDEMIOLOGY","Grad","https://secure.oregonstate.edu/ap/cps/documents/view/119267","No Sustainability Content"]
[null,"SBHS","H",594,"H 594","APPLIED ERGONOMICS. (3 Credits)","Grad","https://catalog.oregonstate.edu/search/?P=H%20594","No Sustainability Content"]
[null,"SBHS","H",596,"H 596","HEALTHCARE EPIDEMIOLOGY","Grad","https://secure.oregonstate.edu/ap/cps/documents/view/124882","No Sustainability Content"]
[null,"SBHS","H",597,{"$f":"TRIM(C2663)&\" \"&TRIM(D2663)","v":"H 597"},"MTHDS FOODBRN DIS OUTBRK INVST","Grad","https://secure.oregonstate.edu/ap/cps/documents/view/133726","No Sustainability Content"]
[null,"SBHS","H",598,"H 598","HEALTH POLICY ANALYSIS METHODS. (3 Credits)","Grad","https://secure.oregonstate.edu/ap/cps/documents/view/130082","No Sustainability Content"]
[null,"SBHS","H",612,"H 612","DOCTORAL SEMINAR PUBLIC HEALTH","Grad","https://secure.oregonstate.edu/ap/cps/documents/view/8281","No Sustainability Content"]
[null,"SBHS","H",613,"H 613","INDEPENDENT RESEARCH PROJECT","Grad","https://secure.oregonstate.edu/ap/cps/documents/view/100762","No Sustainability Content"]
[null,"SBHS","H",614,"H 614","RESEARCH MANUSCRIPT","Grad","https://secure.oregonstate.edu/ap/cps/documents/view/100763","No Sustainability Content"]
[null,"SBHS","H",615,"H 615","ADV EVAL & RESEARCH DESIGN","Grad","https://secure.oregonstate.edu/ap/cps/documents/view/103589","No Sustainability Content"]
[null,"SBHS","H",630,"H 630","QUANT HEALTH POL RES METHODS I","Grad","https://secure.oregonstate.edu/ap/cps/documents/view/122686","No Sustainability Content"]
[null,"SBHS","H",635,"H 635","COST EFFECTIVENESS ANALYSIS IN HEALTH AND MEDICAL CARE. (3 Credits)","Grad","https://secure.oregonstate.edu/ap/cps/documents/view/102387","No Sustainability Content"]
[null,"SBHS","H",638,"H 638","PUBLIC AND PRIVATE HEALTH INSURANCE. (3 Credits)","Grad","https://secure.oregonstate.edu/ap/cps/documents/view/115148","No Sustainability Content"]
[null,"SBHS","H",639,"H 639","COMMUNITY-BASED PARTICIPATORY RESEARCH. (4 Credits)","Grad","https://secure.oregonstate.edu/ap/cps/documents/view/108373","No Sustainability Content"]
[null,"SBHS","H",650,"H 650","REPORT RESULTS: WRIT FOR EPI","Grad","https://secure.oregonstate.edu/ap/cps/documents/view/120516","No Sustainability Content"]
[null,"SBHS","H",651,"H 651","ADV EPIDEMIOLOGICAL METHODS","Grad","https://secure.oregonstate.edu/ap/cps/documents/view/121463","No Sustainability Content"]
[null,"SBHS","H",652,"H 652","CAUSAL INFERENCE IN EPIDEMIOLO","Grad","https://secure.oregonstate.edu/ap/cps/documents/view/120628","No Sustainability Content"]
[null,"SBHS","H",659,"H 659","QUANT HLTH POLICY RES MTHDS II","Grad","https://secure.oregonstate.edu/ap/cps/documents/view/122688","No Sustainability Content"]
[null,"SBHS","H",662,"H 662","ADVANCED METHODS IN INFECTIOUS DISEASE EPIDEMIOLOGY. (3 Credits)","Grad","https://secure.oregonstate.edu/ap/cps/documents/view/120496","No Sustainability Content"]
[null,"SBHS","H",671,"H 671","ADVANCED THEORIES OF HEALTH BEHAVIOR. (3 Credits)","Grad","https://secure.oregonstate.edu/ap/cps/documents/view/101791","No Sustainability Content"]
[null,"SBHS","H",672,"H 672","ADV QUAL METH IN HEALTH BEH","Grad","https://secure.oregonstate.edu/ap/cps/documents/view/102010","No Sustainability Content"]
[null,"SBHS","H",683,"H 683","ADV RESEARCH METHODS IN EOH","Grad","https://secure.oregonstate.edu/ap/cps/documents/view/120286","No Sustainability Content"]
[null,"SBHS","H",685,"H 685","RACE, CLASS, CULTURE & AGING","Grad","https://secure.oregonstate.edu/ap/cps/documents/view/107790","No Sustainability Content"]
[null,"HC","HC",199,{"$f":"TRIM(C2682)&\" \"&TRIM(D2682)","v":"HC 199"},"*HONORS WRITING","Undergrad","https://secure.oregonstate.edu/ap/cps/documents/view/132062","No Sustainability Content"]
[null,"SBHS","HDFS",107,"HDFS 107","INTRODUCTION TO HUMAN SERVICES","Undergrad","https://secure.oregonstate.edu/ap/cps/documents/view/120320","No Sustainability Content"]
[null,"SBHS","HDFS",209,"HDFS 209","HUMAN SERVICES PRACTICUM","Undergrad","https://secure.oregonstate.edu/ap/cps/documents/view/120321","No Sustainability Content"]
[null,"SBHS","HDFS",240,{"$f":"TRIM(C2685)&\" \"&TRIM(D2685)","v":"HDFS 240"},"*HUMAN SEXUALITY","Undergrad","https://secure.oregonstate.edu/ap/cps/documents/view/131210","No Sustainability Content"]
[null,"SBHS","HDFS",311,"HDFS 311","INFANT & CHILD DEVELOPMENT","Undergrad","https://secure.oregonstate.edu/ap/cps/documents/view/5826","No Sustainability Content"]
[null,"SBHS","HDFS",312,"HDFS 312","PARENTING RESEARCH & APPLIC","Undergrad","https://secure.oregonstate.edu/ap/cps/documents/view/10732","No Sustainability Content"]
[null,"SBHS","HDFS",313,"HDFS 313","ADOLESCENT DEVELOPMENT","Undergrad","https://secure.oregonstate.edu/ap/cps/documents/view/100439","No Sustainability Content"]
[null,"SBHS","HDFS",314,"HDFS 314","ADULT DEVELOPMENT AND AGING","Undergrad","https://secure.oregonstate.edu/ap/cps/documents/view/101933","No Sustainability Content"]
[null,"SBHS","HDFS",341,"HDFS 341","FAMILY STUDIES",{"$f":"IF(D2690>499,\"Grad\", \"Undergrad\")","v":"Undergrad"},"https://secure.oregonstate.edu/ap/cps/documents/view/5629","No Sustainability Content"]
[null,"SBHS","HDFS",360,"HDFS 360","CRITICAL THINKING IN HDFS","Undergrad","https://secure.oregonstate.edu/ap/cps/documents/view/5755","No Sustainability Content"]
[null,"SBHS","HDFS",361,"HDFS 361","APPLIED RESEARCH METHODS","Undergrad","https://secure.oregonstate.edu/ap/cps/documents/view/106676","No Sustainability Content"]
[null,"SBHS","HDFS",410,"HDFS 410","HUMAN SERVICES INTERNSHIP","Undergrad","https://secure.oregonstate.edu/ap/cps/documents/view/122927","No Sustainability Content"]
[null,"SBHS","HDFS",430,"HDFS 430","^STUDENT TEACHING: EARLY CHILD","Undergrad","https://secure.oregonstate.edu/ap/cps/documents/view/100473","No Sustainability Content"]
[null,"SBHS","HDFS",444,"HDFS 444","FAMILY VIOLENCE AND NEGLECT","Undergrad","https://secure.oregonstate.edu/ap/cps/documents/view/5931","No Sustainability Content"]
[null,"SBHS","HDFS",462,"HDFS 462","PROFESSIONAL HELPING SKILLS","Undergrad","https://secure.oregonstate.edu/ap/cps/documents/view/120371","No Sustainability Content"]
[null,"SBHS","HDFS",511,"HDFS 511","THEORIES OF HUMAN DEVELOPMENT","Grad","https://secure.oregonstate.edu/ap/cps/documents/view/99290","No Sustainability Content"]
[null,"SBHS","HDFS",516,"HDFS 516","CHILD DEVELOPMENT","Grad","https://secure.oregonstate.edu/ap/cps/documents/view/6052","No Sustainability Content"]
[null,"SBHS","HDFS",517,"HDFS 517","ADOLESCENT DEVELOPMENT","Grad","https://secure.oregonstate.edu/ap/cps/documents/view/6066","No Sustainability Content"]
[null,"SBHS","HDFS",518,"HDFS 518","ADULT DEVELOPMENT AND AGING. (4 Credits)","Grad","https://secure.oregonstate.edu/ap/cps/documents/view/6051","No Sustainability Content"]
[null,"SBHS","HDFS",519,"HDFS 519","THE LIFE COURSE. (4 Credits)","Grad","https://secure.oregonstate.edu/ap/cps/documents/view/99300","No Sustainability Content"]
[null,"SBHS","HDFS",529,{"$f":"TRIM(C2702)&\" \"&TRIM(D2702)","v":"HDFS 529"},"INTRO TO DATA ANALYSIS W/SAS","Grad","https://secure.oregonstate.edu/ap/cps/documents/view/128307","No Sustainability Content"]
[null,"SBHS","HDFS",531,"HDFS 531","APPLIED QUANT METHODS I: ANOVA","Grad","https://secure.oregonstate.edu/ap/cps/documents/view/10243","No Sustainability Content"]
[null,"SBHS","HDFS",532,{"$f":"TRIM(C2704)&\" \"&TRIM(D2704)","v":"HDFS 532"},"APP QUANT MTHDS II: LIN REGR","Grad","https://secure.oregonstate.edu/ap/cps/documents/view/127579","No Sustainability Content"]
[null,"SBHS","HDFS",534,"HDFS 534","SOCIAL PROGRAM & POLICY EVAL","Grad","https://secure.oregonstate.edu/ap/cps/documents/view/100992","No Sustainability Content"]
[null,"SBHS","HDFS",538,"HDFS 538","QUALITATIVE RESEARCH METHODS I","Grad","https://secure.oregonstate.edu/ap/cps/documents/view/6192","No Sustainability Content"]
[null,"SBHS","HDFS",539,"HDFS 539","QUALITATIVE METHODS II","Grad","https://secure.oregonstate.edu/ap/cps/documents/view/5684","No Sustainability Content"]
[null,"SBHS","HDFS",546,"HDFS 546","THEORIES OF FAMILY STUDIES. (4 Credits)","Grad","https://secure.oregonstate.edu/ap/cps/documents/view/10419","No Sustainability Content"]
[null,"SBHS","HDFS",630,{"$f":"TRIM(C2709)&\" \"&TRIM(D2709)","v":"HDFS 630"},"QUANT METH IN FAM/IND DEVELOP","Grad","https://secure.oregonstate.edu/ap/cps/documents/view/128132","No Sustainability Content"]
[null,"SBHS","HDFS",665,"HDFS 665","TEACHING IN HDFS","Grad","https://secure.oregonstate.edu/ap/cps/documents/view/107792","No Sustainability Content"]
[null,"SBHS","HDFS",685,"HDFS 685","RACE, CLASS, CULTURE & AGING","Grad","https://secure.oregonstate.edu/ap/cps/documents/view/107791","No Sustainability Content"]
[null,"SLCS","HEBR",111,"HEBR 111","INTRODUCTION TO HEBREW. (4 Credits)","Undergrad","https://secure.oregonstate.edu/ap/cps/documents/view/104737","No Sustainability Content"]
[null,"SLCS","HEBR",112,"HEBR 112","INTERMEDIATE HEBREW. (4 Credits)","Undergrad","https://secure.oregonstate.edu/ap/cps/documents/view/104739","No Sustainability Content"]
[null,"SLCS","HEBR",113,"HEBR 113","INTERMEDIATE HEBREW II. (4 Credits)","Undergrad","https://secure.oregonstate.edu/ap/cps/documents/view/104740","No Sustainability Content"]
[null,"SLCS","HEBR",211,"HEBR 211","SECOND-YEAR HEBREW I","Undergrad","https://secure.oregonstate.edu/ap/cps/documents/view/108120","No Sustainability Content"]
[null,"SLCS","HEBR",212,"HEBR 212","SECOND-YEAR HEBREW II","Undergrad","https://secure.oregonstate.edu/ap/cps/documents/view/108548","No Sustainability Content"]
[null,"SLCS","HEBR",231,"HEBR 231","Introduction to Jewish Culture","Undergrad","https://secure.oregonstate.edu/ap/cps/documents/view/108192","No Sustainability Content"]
[null,"ENGR","HEST",310,"HEST 310","*INTRO COMMUNITY ENGAGEMENT","Undergrad","https://secure.oregonstate.edu/ap/cps/documents/view/122340","No Sustainability Content"]
[null,"ENGR","HEST",320,{"$f":"TRIM(C2719)&\" \"&TRIM(D2719)","v":"HEST 320"},"*ENGR GLOBAL HEALTH SOLUTIONS","Undergrad","https://secure.oregonstate.edu/ap/cps/documents/view/127614","No Sustainability Content"]
[null,"ENGR","HEST",411,"HEST 411","ENGINEERING DESIGN FOR EMERGENCY & LOW-RESOURCE ENVIRONMENTS. (3 Credits)","Undergrad","https://catalog.oregonstate.edu/search/?P=HEST%20411","No Sustainability Content"]
[null,"ENGR","HEST",412,{"$f":"TRIM(C2721)&\" \"&TRIM(D2721)","v":"HEST 412"},"*CASE STUD HUM ENG, SCI & TECH","Undergrad","https://secure.oregonstate.edu/ap/cps/documents/view/126914","No Sustainability Content"]
[null,"ENGR","HEST",511,"HEST 511","ENGINEERING DESIGN FOR EMERGENCY & LOW-RESOURCE ENVIRONMENTS. (3 Credits)","Grad","https://catalog.oregonstate.edu/search/?P=HEST%20511","No Sustainability Content"]
[null,"ENGR","HEST",512,{"$f":"TRIM(C2723)&\" \"&TRIM(D2723)","v":"HEST 512"},"CASE STUD HUM ENG, SCI & TECH","Grad","https://secure.oregonstate.edu/ap/cps/documents/view/126914","No Sustainability Content"]
[null,"BPHS","HHS",231,"HHS 231","*LIFETIME FITNESS FOR HEALTH","Undergrad","https://secure.oregonstate.edu/ap/cps/documents/view/126187","No Sustainability Content"]
[null,"BPHS","HHS",517,"HHS 517","CASE STUDIES IN PUBLIC HEALTH PRACTICE. (3 Credits)","Grad","https://secure.oregonstate.edu/ap/cps/documents/view/130476 ","No Sustainability Content"]
[null,"BPHS","HHS",526,"HHS 526","LINEAR REGRESSION IN PUBLIC HEALTH. (2 Credits)","Grad","https://secure.oregonstate.edu/ap/cps/documents/view/133623","No Sustainability Content"]
[null,"BPHS","HHS",527,"HHS 527","LOGISTIC REGRESSION IN PUBLIC HEALTH. (2 Credits)","Grad","https://secure.oregonstate.edu/ap/cps/documents/view/133624","No Sustainability Content"]
[null,"BPHS","HHS",578,"HHS 578","EVIDENCE-BASED PUBLIC HEALTH I. (3 Credits)","Grad","https://secure.oregonstate.edu/ap/cps/documents/view/131889","No Sustainability Content"]
[null,"BPHS","HHS",579,"HHS 579","EVIDENCE-BASED PUBLIC HEALTH II. (3 Credits)","Grad","https://secure.oregonstate.edu/ap/cps/documents/view/130481","No Sustainability Content"]
[null,"BPHS","HHS",584,"HHS 584","SURVEILLANCE AND FIELD EPIDEMIOLOGY FOR PUBLIC HEALTH. (3 Credits)","Grad","https://secure.oregonstate.edu/ap/cps/documents/view/131886","No Sustainability Content"]
[null,"BPHS","HHS",590,"HHS 590","PUBLIC HEALTH LAW. (2 Credits)","Grad","https://secure.oregonstate.edu/ap/cps/documents/view/130483","No Sustainability Content"]
[null,"BA","HM",101,"HM 101","INTRODUCTION TO HOSPITALITY","Undergrad","https://secure.oregonstate.edu/ap/cps/documents/view/122326","No Sustainability Content"]
[null,"BA","HM",210,{"$f":"TRIM(C2733)&\" \"&TRIM(D2733)","v":"HM 210"},"HOSPITALITY INTERNSHIP","Undergrad","https://secure.oregonstate.edu/ap/cps/documents/view/125321","No Sustainability Content"]
[null,"BA","HM",235,{"$f":"TRIM(C2734)&\" \"&TRIM(D2734)","v":"HM 235"},"HOSPITALITY LAW","Undergrad","https://secure.oregonstate.edu/ap/cps/documents/view/127100 ","No Sustainability Content"]
[null,"BA","HM",240,{"$f":"TRIM(C2735)&\" \"&TRIM(D2735)","v":"HM 240"},"HOSPITALITY COST CONTROL","Undergrad","https://secure.oregonstate.edu/ap/cps/documents/view/127106 ","No Sustainability Content"]
[null,"BA","HM",320,{"$f":"TRIM(C2736)&\" \"&TRIM(D2736)","v":"HM 320"},"SERVICE AUTOMATION AND TECH","Undergrad","https://secure.oregonstate.edu/ap/cps/documents/view/127503","No Sustainability Content"]
[null,"BA","HM",321,{"$f":"TRIM(C2737)&\" \"&TRIM(D2737)","v":"HM 321"},"HOSPITALITY TECHNOLOGY LAB","Undergrad","https://secure.oregonstate.edu/ap/cps/documents/view/129310","No Sustainability Content"]
[null,"BA","HM",325,"HM 325","ONLINE MARKETING AND REPUTATION MANAGEMENT. (4 Credits)","Undergrad","https://secure.oregonstate.edu/ap/cps/documents/view/129314 ","No Sustainability Content"]
[null,"BA","HM",340,"HM 340","VACATION PROPERTY MANAGEMENT. (4 Credits)","Undergrad","https://secure.oregonstate.edu/ap/cps/documents/view/130386","No Sustainability Content"]
[null,"BA","HM",420,{"$f":"TRIM(C2740)&\" \"&TRIM(D2740)","v":"HM 420"},"REVENUE MANAGEMENT AND PRICING","Undergrad","https://secure.oregonstate.edu/ap/cps/documents/view/124895","No Sustainability Content"]
[null,"BA","HM",425,{"$f":"TRIM(C2741)&\" \"&TRIM(D2741)","v":"HM 425"},"ADV RESTAURANT MGT & OWNERSHIP","Undergrad","https://secure.oregonstate.edu/ap/cps/documents/view/127097 ","No Sustainability Content"]
[null,"BA","HM",430,{"$f":"TRIM(C2742)&\" \"&TRIM(D2742)","v":"HM 430"},"SERVICE MANAGEMENT","Undergrad","https://secure.oregonstate.edu/ap/cps/documents/view/129366","No Sustainability Content"]
[null,"BA","HM",470,"HM 470","^ADVANCED HOSPITALITY. (4 Credits)","Undergrad","https://secure.oregonstate.edu/ap/cps/documents/view/132397","No Sustainability Content"]
[null,"HORT","HORT",226,"HORT 226","LANDSCAPE PLANT MATERIALS I","Undergrad","https://secure.oregonstate.edu/ap/cps/documents/view/106659","No Sustainability Content"]
[null,"HORT","HORT",270,"HORT 270","INTRODUCTION TO THERAPEUTIC HORTICULTURE. (2 Credits)","Undergrad","https://secure.oregonstate.edu/ap/cps/documents/view/4710","No Sustainability Content"]
[null,"HORT","HORT",272,"HORT 272","BASIC THERAPEUTIC SKILLS I. (2 Credits)","Undergrad","https://secure.oregonstate.edu/ap/cps/documents/view/4712","No Sustainability Content"]
[null,"HORT","HORT",273,"HORT 273","BASIC THERAPEUTIC SKILLS II. (2 Credits)","Undergrad","https://secure.oregonstate.edu/ap/cps/documents/view/4713","No Sustainability Content"]
[null,"HORT","HORT",274,"HORT 274","THERAPEUTIC HORTICULTURAL PROGRAMS FOR OLDER ADULTS/CHILDREN. (2 Credits)","Undergrad","https://secure.oregonstate.edu/ap/cps/documents/view/4714","No Sustainability Content"]
[null,"HORT","HORT",286,"HORT 286","Permaculture Design and Theory Certification  ","Undergrad","https://secure.oregonstate.edu/ap/cps/documents/view/101128","No Sustainability Content"]
[null,"HORT","HORT",316,"HORT 316","PLANT NUTRITION","Undergrad","https://secure.oregonstate.edu/ap/cps/documents/view/101186","No Sustainability Content"]
[null,"HORT","HORT",330,{"$f":"TRIM(C2751)&\" \"&TRIM(D2751)","v":"HORT 330"},"*PLAGUES, PESTS, AND POLITICS","Undergrad","https://secure.oregonstate.edu/ap/cps/documents/view/127071","No Sustainability Content"]
[null,"HORT","HORT",351,"HORT 351","FLORICULTURE AND GREENHOUSE SYSTEMS. (4 Credits)","Undergrad","https://secure.oregonstate.edu/ap/cps/documents/view/9234","No Sustainability Content"]
[null,"HORT","HORT",358,"HORT 358","LANDSCAPE CONSTRUCTION TECHN","Undergrad","https://secure.oregonstate.edu/ap/cps/documents/view/9684","No Sustainability Content"]
[null,"HORT","HORT",360,"HORT 360","IRRIGATION AND DRAINAGE",{"$f":"IF(D2754>499,\"Grad\", \"Undergrad\")","v":"Undergrad"},"https://secure.oregonstate.edu/ap/cps/documents/view/120877","No Sustainability Content"]
[null,"HORT","HORT",407,"HORT 407","SEMINAR","Undergrad","https://secure.oregonstate.edu/ap/cps/documents/view/9823","No Sustainability Content"]
[null,"HORT","HORT",412,"HORT 412","CAREER EXPLORATION","Undergrad","https://secure.oregonstate.edu/ap/cps/documents/view/7024","No Sustainability Content"]
[null,"HORT","HORT",433,"HORT 433","SYST & ADAPT VEGETABLE CROPS","Undergrad","https://secure.oregonstate.edu/ap/cps/documents/view/8162","No Sustainability Content"]
[null,"HORT","HORT",453,"HORT 453","GRAPEVINE GROWTH & PHYSIOLOGY","Undergrad","https://secure.oregonstate.edu/ap/cps/documents/view/9058","No Sustainability Content"]
[null,"HORT","HORT",456,{"$f":"TRIM(C2759)&\" \"&TRIM(D2759)","v":"HORT 456"},"PHYSIOLOGY PROD BERRY CROPS","Undergrad","https://secure.oregonstate.edu/ap/cps/documents/view/129530","No Sustainability Content"]
[null,"HORT","HORT",485,"HORT 485","ADVANCED PERMACULTURE DESIGN","Undergrad","https://secure.oregonstate.edu/ap/cps/documents/view/105917","No Sustainability Content"]
[null,"HORT","HORT",519,"HORT 519","CURRENT TOPICS IN PBG","Grad","https://secure.oregonstate.edu/ap/cps/documents/view/109442","No Sustainability Content"]
[null,"HORT","HORT",520,"HORT 520","CURRENT TOPICS HORT RESEARCH","Grad","https://secure.oregonstate.edu/ap/cps/documents/view/108004","No Sustainability Content"]
[null,"HORT","HORT",556,{"$f":"TRIM(C2763)&\" \"&TRIM(D2763)","v":"HORT 556"},"PHYSIOLOGY PROD BERRY CROPS","Grad","https://secure.oregonstate.edu/ap/cps/documents/view/129530","No Sustainability Content"]
[null,"SHPR","HST",101,"HST 101","*HISTORY WESTERN CIVILIZATION","Undergrad","https://secure.oregonstate.edu/ap/cps/documents/view/8674","No Sustainability Content"]
[null,"SHPR","HST",102,"HST 102","*HISTORY WESTERN CIVILIZATION","Undergrad","https://secure.oregonstate.edu/ap/cps/documents/view/8678","No Sustainability Content"]
[null,"SHPR","HST",103,"HST 103","*HISTORY WESTERN CIVILIZATION","Undergrad","https://secure.oregonstate.edu/ap/cps/documents/view/8682","No Sustainability Content"]
[null,"SHPR","HST",104,"HST 104","*WORLD HIST I: ANCIENT CIVIL","Undergrad","https://secure.oregonstate.edu/ap/cps/documents/view/8686","No Sustainability Content"]
[null,"SHPR","HST",202,{"$f":"TRIM(C2768)&\" \"&TRIM(D2768)","v":"HST 202"},"*HISTORY OF THE UNITED STATES","Undergrad","https://secure.oregonstate.edu/ap/cps/documents/view/126783","No Sustainability Content"]
[null,"SHPR","HST",203,{"$f":"TRIM(C2769)&\" \"&TRIM(D2769)","v":"HST 203"},"*HISTORY OF THE UNITED STATES","Undergrad","https://secure.oregonstate.edu/ap/cps/documents/view/126784","No Sustainability Content"]
[null,"SHPR","HST",210,"HST 210","*RELIGION IN THE UNITED STATES","Undergrad","https://secure.oregonstate.edu/ap/cps/documents/view/109263","No Sustainability Content"]
[null,"SHPR","HST",215,"HST 215","*INTRO TO JEWISH TRADITIONS","Undergrad","https://secure.oregonstate.edu/ap/cps/documents/view/122220","No Sustainability Content"]
[null,"SHPR","HST",318,"HST 318","AMERICAN MILITARY 1865-PRESENT","Undergrad","https://secure.oregonstate.edu/ap/cps/documents/view/97850","No Sustainability Content"]
[null,"SHPR","HST",319,"HST 319","*THE HISTORY OF HUMAN RIGHTS IN THE MODERN WORLD. (4 Credits)","Undergrad","https://secure.oregonstate.edu/ap/cps/documents/view/130993","No Sustainability Content"]
[null,"SHPR","HST",324,"HST 324","*ANCIENT JEWISH HISTORY. (4 Credits)","Undergrad","https://catalog.oregonstate.edu/search/?P=HST%20324","No Sustainability Content"]
[null,"SHPR","HST",325,{"$f":"TRIM(C2775)&\" \"&TRIM(D2775)","v":"HST 325"},"*EARLY CHRISTIANITY: ORIGINS","Undergrad","https://secure.oregonstate.edu/ap/cps/documents/view/128353","No Sustainability Content"]
[null,"SHPR","HST",327,"HST 327","HISTORY OF MEDIEVAL EUROPE. (4 Credits)","Undergrad","https://catalog.oregonstate.edu/search/?P=HST%20327","No Sustainability Content"]
[null,"SHPR","HST",328,"HST 328","HISTORY OF MEDIEVAL EUROPE","Undergrad","https://catalog.oregonstate.edu/search/?P=HST%20328","No Sustainability Content"]
[null,"SHPR","HST",330,"HST 330","HISTORY OF EARLY MODERN EUROPE","Undergrad","https://catalog.oregonstate.edu/search/?P=HST%20330","No Sustainability Content"]
[null,"SHPR","HST",333,"HST 333","MEDIEVAL & EARLY MODERN SPAIN","Undergrad","https://catalog.oregonstate.edu/search/?P=HST%20333","No Sustainability Content"]
[null,"SHPR","HST",335,"HST 335","*NINETEENTH-CENTURY EUROPE. (4 Credits)","Undergrad","https://secure.oregonstate.edu/ap/cps/documents/view/126501","No Sustainability Content"]
[null,"SHPR","HST",338,"HST 338","*HITLER'S EUROPE","Undergrad","https://catalog.oregonstate.edu/search/?P=HST%20338","No Sustainability Content"]
[null,"SHPR","HST",348,"HST 348","*INDIGENOUS HISTORY OF LATIN AMERICA. (4 Credits)","Undergrad","https://secure.oregonstate.edu/ap/cps/documents/view/131034","No Sustainability Content"]
[null,"SHPR","HST",350,"HST 350","*MODERN LATIN AMERICA","Undergrad","https://catalog.oregonstate.edu/search/?P=HST%20350","No Sustainability Content"]
[null,"SHPR","HST",369,"HST 369","*^IMMIGRATION TO U.S. -- 1880","Undergrad","https://secure.oregonstate.edu/ap/cps/documents/view/101109","No Sustainability Content"]
[null,"SHPR","HST",370,"HST 370","*SOCIAL CHANGE & POPULAR MUSIC","Undergrad","https://secure.oregonstate.edu/ap/cps/documents/view/102925","No Sustainability Content"]
[null,"SHPR","HST",378,"HST 378","*RELIGION AND GENDER: A GLOBAL PERSPECTIVE. (4 Credits)","Undergrad","https://secure.oregonstate.edu/ap/cps/documents/view/132319","No Sustainability Content"]
[null,"SHPR","HST",385,"HST 385","*THE ARAB-ISRAELI CONFLICT","Undergrad","https://secure.oregonstate.edu/ap/cps/documents/view/7668","No Sustainability Content"]
[null,"SHPR","HST",387,"HST 387","*ISLAMIC CIVILIZATION","Undergrad","https://catalog.oregonstate.edu/search/?P=HST%20387","No Sustainability Content"]
[null,"SHPR","HST",388,"HST 388","*ISLAMIC CIVILIZATION","Undergrad","https://catalog.oregonstate.edu/search/?P=HST%20388","No Sustainability Content"]
[null,"SHPR","HST",391,"HST 391","*TRADITIONAL CHINA AND JAPAN. (4 Credits)","Undergrad","https://secure.oregonstate.edu/ap/cps/documents/view/104339","No Sustainability Content"]
[null,"SHPR","HST",413,"HST 413","The Development of Modern Science since the Eighteenth Century","Undergrad","https://secure.oregonstate.edu/ap/cps/documents/view/97510","No Sustainability Content"]
[null,"SHPR","HST",426,"HST 426","WORLD WAR I: A GLOBAL HISTORY. (4 Credits)","Undergrad","https://catalog.oregonstate.edu/search/?P=HST%20426","No Sustainability Content"]
[null,"SHPR","HST",431,{"$f":"TRIM(C2793)&\" \"&TRIM(D2793)","v":"HST 431"},"A HISTORY OF CHILDHOOD","Undergrad","https://secure.oregonstate.edu/ap/cps/documents/view/131129","No Sustainability Content"]
[null,"SHPR","HST",435,"HST 435","THE HISTORY OF EUROPEAN WOMEN FROM 1400 TO 1789. (4 Credits)","Undergrad","https://catalog.oregonstate.edu/search/?P=HST%20435","No Sustainability Content"]
[null,"SHPR","HST",438,"HST 438","The Will and the Self","Undergrad","https://secure.oregonstate.edu/ap/cps/documents/view/99783","No Sustainability Content"]
[null,"SHPR","HST",487,"HST 487","WORLD WAR II: A GLOBAL HISTORY","Undergrad","https://catalog.oregonstate.edu/search/?P=HST%20487","No Sustainability Content"]
[null,"SHPR","HST",488,"HST 488","THE US AND VIETNAM 1945-1995","Undergrad","https://catalog.oregonstate.edu/search/?P=HST%20488","No Sustainability Content"]
[null,"SHPR","HST",513,"HST 513","The Development of Modern Science since the Eighteenth Century","Grad","https://secure.oregonstate.edu/ap/cps/documents/view/97510","No Sustainability Content"]
[null,"SHPR","HST",526,"HST 526","WORLD WAR I: A GLOBAL HISTORY. (4 Credits)","Grad","https://catalog.oregonstate.edu/search/?P=HST%20526","No Sustainability Content"]
[null,"SHPR","HST",531,{"$f":"TRIM(C2800)&\" \"&TRIM(D2800)","v":"HST 531"},"A HISTORY OF CHILDHOOD","Grad","https://secure.oregonstate.edu/ap/cps/documents/view/131129","No Sustainability Content"]
[null,"SHPR","HST",535,"HST 535","THE HISTORY OF EUROPEAN WOMEN FROM 1400 TO 1789. (4 Credits)","Grad","https://catalog.oregonstate.edu/search/?P=HST%20535","No Sustainability Content"]
[null,"SHPR","HST",587,"HST 587","WORLD WAR II: A GLOBAL HISTORY. (4 Credits)","Grad","https://catalog.oregonstate.edu/search/?P=HST%20587","No Sustainability Content"]
[null,"SHPR","HST",588,"HST 588","THE US AND VIETNAM 1945-1995","Grad","https://catalog.oregonstate.edu/search/?P=HST%20588","No Sustainability Content"]
[null,"SHPR","HSTS",416,"HSTS 416","*HISTORY OF MEDICINE PRE-1800. (4 Credits)","Undergrad","https://catalog.oregonstate.edu/search/?P=HSTS%20416","No Sustainability Content"]
[null,"SHPR","HSTS",516,"HSTS 516","HISTORY OF MEDICINE PRE-1800. (4 Credits)","Grad","https://catalog.oregonstate.edu/search/?P=HSTS%20516","No Sustainability Content"]
[null,"INBI","IB",512,"IB 512","INTEGRATIVE BIOLOGY GTA TRAINING AND DEVELOPMENT. (1 Credit)","Grad","https://secure.oregonstate.edu/ap/cps/documents/view/133556","No Sustainability Content"]
[null,"INBI","IB",513,"IB 513","GRANT WRITING AND ETHICS. (3 Credits)","Grad","https://secure.oregonstate.edu/ap/cps/documents/view/131419","No Sustainability Content"]
[null,"INBI","IB",514,"IB 514","SCIENTIFIC WRITING AND ETHICS. (3 Credits)","Grad","https://secure.oregonstate.edu/ap/cps/documents/view/131460","No Sustainability Content"]
[null,"INBI","IB",531,"IB 531","VERTEBRATE PHYSIOLOGY I. (4 Credits)","Grad","https://secure.oregonstate.edu/ap/cps/documents/view/131570","No Sustainability Content"]
[null,"INBI","IB",532,"IB 532","VERTEBRATE PHYSIOLOGY II. (3 Credits)","Grad","https://secure.oregonstate.edu/ap/cps/documents/view/131140 ","No Sustainability Content"]
[null,"INBI","IB",590,"IB 590","STRATEGIC PLANNING IN ENGINEERING ORGANIZATIONS","Grad","https://secure.oregonstate.edu/ap/cps/documents/view/130841","No Sustainability Content"]
[null,"MIME","IE",212,"IE 212","COMPUTATIONAL METHODS FOR IE","Undergrad","https://secure.oregonstate.edu/ap/cps/documents/view/9385","No Sustainability Content"]
[null,"MIME","IE",255,"IE 255","INTRO ANALYSIS IND/MFG SYSTEMS","Undergrad","https://secure.oregonstate.edu/ap/cps/documents/view/121682","No Sustainability Content"]
[null,"MIME","IE",355,"IE 355","STATISTICAL QUALITY CONTROL","Undergrad","https://secure.oregonstate.edu/ap/cps/documents/view/106727","No Sustainability Content"]
[null,"MIME","IE",356,"IE 356","EXPTL DESIGN FOR IND PROCESSES","Undergrad","https://secure.oregonstate.edu/ap/cps/documents/view/106815","No Sustainability Content"]
[null,"MIME","IE",411,"IE 411","VISUAL PROGRAMMING FOR IND APP","Undergrad","https://catalog.oregonstate.edu/search/?P=IE%20411","No Sustainability Content"]
[null,"MIME","IE",415,"IE 415","SIM & DECISION SUPPORT SYSTEMS","Undergrad","https://catalog.oregonstate.edu/search/?P=IE%20415","No Sustainability Content"]
[null,"MIME","IE",418,"IE 418","TELECOMMUNICATION CONCEPTS. (3 Credits)",{"$f":"IF(D2818>499,\"Grad\", \"Undergrad\")","v":"Undergrad"},"https://catalog.oregonstate.edu/search/?P=IE%20418","No Sustainability Content"]
[null,"MIME","IE",425,"IE 425","INDUSTR SYSTEMS OPTIMIZATION","Undergrad","https://secure.oregonstate.edu/ap/cps/documents/view/125741","No Sustainability Content"]
[null,"MIME","IE",426,{"$f":"TRIM(C2820)&\" \"&TRIM(D2820)","v":"IE 426"},"STOCHASTIC MODELS OF IND SYST","Undergrad","https://secure.oregonstate.edu/ap/cps/documents/view/126522","No Sustainability Content"]
[null,"MIME","IE",471,"IE 471","PROJECT MGMT IN ENGINEERING","Undergrad","https://catalog.oregonstate.edu/search/?P=IE%20471","No Sustainability Content"]
[null,"MIME","IE",475,"IE 475","ADV MFG COSTING TECHNIQUES","Undergrad","https://secure.oregonstate.edu/ap/cps/documents/view/112874","No Sustainability Content"]
[null,"MIME","IE",511,"IE 511","VISUAL PROGRAMMING FOR IND APP","Grad","https://catalog.oregonstate.edu/search/?P=IE%20511","No Sustainability Content"]
[null,"MIME","IE",515,"IE 515","SIM & DECISION SUPPORT SYSTEMS","Grad","https://catalog.oregonstate.edu/search/?P=IE%20515","No Sustainability Content"]
[null,"MIME","IE",518,"IE 518","TELECOMMUNICATION CONCEPTS. (3 Credits)","Grad","https://catalog.oregonstate.edu/search/?P=IE%20518","No Sustainability Content"]
[null,"MIME","IE",545,"IE 545","HUMAN FACTORS ENGINEERING","Grad","https://secure.oregonstate.edu/ap/cps/documents/view/3732#requirements","No Sustainability Content"]
[null,"MIME","IE",552,"IE 552","DESIGN OF INDUSTRIAL EXPERI","Grad","https://secure.oregonstate.edu/ap/cps/documents/view/103314","No Sustainability Content"]
[null,"MIME","IE",553,"IE 553","DESIGN OF INDUSTRIAL EXPERIMENTS II. (3 Credits)","Grad","https://secure.oregonstate.edu/ap/cps/documents/view/107292","No Sustainability Content"]
[null,"MIME","IE",564,"IE 564","DES & SCHED OF CELL MANUF SYS","Grad","https://secure.oregonstate.edu/ap/cps/documents/view/3386","No Sustainability Content"]
[null,"MIME","IE",571,"IE 571","PROJECT MGMT IN ENGINEERING","Grad","https://catalog.oregonstate.edu/search/?P=IE%20571","No Sustainability Content"]
[null,"MIME","IE",575,"IE 575","SYSTEMS THINKING THEOR & PRACT","Grad","https://secure.oregonstate.edu/ap/cps/documents/view/120818","No Sustainability Content"]
[null,"MIME","IE",581,"IE 581","OPERATIONS MANAGEMENT","Grad","https://secure.oregonstate.edu/ap/cps/documents/view/112027","No Sustainability Content"]
[null,"MIME","IE",582,"IE 582","INTRO MANAGEMENT FOR ENGR SCI","Grad","https://secure.oregonstate.edu/ap/cps/documents/view/112028","No Sustainability Content"]
[null,"MIME","IE",583,"IE 583","ADV ENGINEERING ECON ANALYSIS","Grad","https://secure.oregonstate.edu/ap/cps/documents/view/112005 ","No Sustainability Content"]
[null,"MIME","IE",586,"IE 586","PROJECT RISK MANAGEMENT","Grad","https://secure.oregonstate.edu/ap/cps/documents/view/120167","No Sustainability Content"]
[null,"MIME","IE",587,{"$f":"TRIM(C2836)&\" \"&TRIM(D2836)","v":"IE 587"},"MGMT OF INFORMATION SYSTEMS","Grad","https://secure.oregonstate.edu/ap/cps/documents/view/126361","No Sustainability Content"]
[null,"MIME","IE",588,{"$f":"TRIM(C2837)&\" \"&TRIM(D2837)","v":"IE 588"},"MGMT OF NEW PRODUCT DEVELMNT","Grad","https://secure.oregonstate.edu/ap/cps/documents/view/129542","No Sustainability Content"]
[null,"MIME","IE",589,"IE 589","PROFESSIONAL ETHICS","Grad","https://secure.oregonstate.edu/ap/cps/documents/view/123165","No Sustainability Content"]
[null,"IST","IST",511,"IST 511","INTRO TO GRAD STUDIES","Grad","https://secure.oregonstate.edu/ap/cps/documents/view/4642","No Sustainability Content"]
[null,"IST","IST",512,"IST 512","APPLY INTERDISCIPL PERSPECTIVE","Grad","https://secure.oregonstate.edu/ap/cps/documents/view/4632","No Sustainability Content"]
[null,"IST","IST",513,"IST 513","INTERDISCIPLINARY RES COLL","Grad","https://secure.oregonstate.edu/ap/cps/documents/view/120265","No Sustainability Content"]
[null,"SLCS","IT",331,"IT 331","*ITALIAN CULTURE. (3 Credits)","Undergrad","https://secure.oregonstate.edu/ap/cps/documents/view/115847","No Sustainability Content"]
[null,"SLCS","IT",360,"IT 360","ITALIAN CINEMA. (3 Credits)","Undergrad","https://secure.oregonstate.edu/ap/cps/documents/view/114705","No Sustainability Content"]
[null,"SLCS","JPN",345,"JPN 345","MULTIMODAL LITERACIES:JAPANESE","Undergrad","https://secure.oregonstate.edu/ap/cps/documents/view/113940","No Sustainability Content"]
[null,"SLCS","JPN",411,"JPN 411","^FOURTH-YEAR JAPANESE. (3 Credits)","Undergrad","https://secure.oregonstate.edu/ap/cps/documents/view/117449","No Sustainability Content"]
[null,"BPHS","KIN",131,"KIN 131","INTRODUCTION TO KINESIOLOGY","Undergrad","https://secure.oregonstate.edu/ap/cps/documents/view/126179","No Sustainability Content"]
[null,"BPHS","KIN",232,{"$f":"TRIM(C2847)&\" \"&TRIM(D2847)","v":"KIN 232"},"BACKCOUNTRY LEADERSHIP","Undergrad","https://secure.oregonstate.edu/ap/cps/documents/view/132667","No Sustainability Content"]
[null,"BPHS","KIN",301,"KIN 301","RESEARCH AND SCHOLARSHIP","Undergrad","https://secure.oregonstate.edu/ap/cps/documents/view/126181","No Sustainability Content"]
[null,"BPHS","KIN",307,{"$f":"TRIM(C2849)&\" \"&TRIM(D2849)","v":"KIN 307"},"SEMINAR","Undergrad","https://secure.oregonstate.edu/ap/cps/documents/view/126196","No Sustainability Content"]
[null,"BPHS","KIN",311,"KIN 311","MOTOR BEHAVIOR","Undergrad","https://secure.oregonstate.edu/ap/cps/documents/view/126186","No Sustainability Content"]
[null,"BPHS","KIN",312,"KIN 312","*SOCIOCULT DIMN: PHYS ACTIVITY","Undergrad","https://secure.oregonstate.edu/ap/cps/documents/view/126182","No Sustainability Content"]
[null,"BPHS","KIN",321,{"$f":"TRIM(C2852)&\" \"&TRIM(D2852)","v":"KIN 321"},"BIOMECHANICS OF HUMAN MOVEMENT","Undergrad","https://secure.oregonstate.edu/ap/cps/documents/view/126880","No Sustainability Content"]
[null,"BPHS","KIN",324,"KIN 324","EXERCISE PHYSIOLOGY","Undergrad","https://secure.oregonstate.edu/ap/cps/documents/view/126180","No Sustainability Content"]
[null,"BPHS","KIN",325,{"$f":"TRIM(C2854)&\" \"&TRIM(D2854)","v":"KIN 325"},"FITNESS ASSESS & EXER PRESCR","Undergrad","https://secure.oregonstate.edu/ap/cps/documents/view/131657","No Sustainability Content"]
[null,"BPHS","KIN",333,"KIN 333","KINESIOLOGY PRACTICUM","Undergrad","https://secure.oregonstate.edu/ap/cps/documents/view/122756","No Sustainability Content"]
[null,"BPHS","KIN",334,"KIN 334","KINESIOLOGY PRACTICUM","Undergrad","https://secure.oregonstate.edu/ap/cps/documents/view/126183","No Sustainability Content"]
[null,"BPHS","KIN",335,"KIN 335","KINESIOLOGY PRACTICUM","Undergrad","https://secure.oregonstate.edu/ap/cps/documents/view/122758","No Sustainability Content"]
[null,"BPHS","KIN",343,{"$f":"TRIM(C2858)&\" \"&TRIM(D2858)","v":"KIN 343"},"PRE-THER/ALLIED HEALTH SEMINAR","Undergrad","https://secure.oregonstate.edu/ap/cps/documents/view/127616","No Sustainability Content"]
[null,"BPHS","KIN",344,{"$f":"TRIM(C2859)&\" \"&TRIM(D2859)","v":"KIN 344"},"PRE-THER/ALLIED HEALTH PRACTIC","Undergrad","https://secure.oregonstate.edu/ap/cps/documents/view/127646","No Sustainability Content"]
[null,"BPHS","KIN",353,"KIN 353","PHYSICAL ED TEACHER EDUCATION","Undergrad","https://secure.oregonstate.edu/ap/cps/documents/view/122567","No Sustainability Content"]
[null,"BPHS","KIN",360,"KIN 360","INJURY MANAGEMENT FOR THE PHYSICALLY ACTIVE. (3 Credits)","Undergrad","https://secure.oregonstate.edu/ap/cps/documents/view/131751","No Sustainability Content"]
[null,"BPHS","KIN",370,{"$f":"TRIM(C2862)&\" \"&TRIM(D2862)","v":"KIN 370"},"PSYCHOLOGY OF SPORT & PHYS ACT","Undergrad","https://secure.oregonstate.edu/ap/cps/documents/view/126337","No Sustainability Content"]
[null,"BPHS","KIN",385,{"$f":"TRIM(C2863)&\" \"&TRIM(D2863)","v":"KIN 385"},"THERAPEUTIC EXERCISE","Undergrad","https://secure.oregonstate.edu/ap/cps/documents/view/126197","No Sustainability Content"]
[null,"BPHS","KIN",394,{"$f":"TRIM(C2864)&\" \"&TRIM(D2864)","v":"KIN 394"},"PRO ACT: RESIST TRNG PROG DESI","Undergrad","https://secure.oregonstate.edu/ap/cps/documents/view/132087","No Sustainability Content"]
[null,"BPHS","KIN",395,{"$f":"TRIM(C2865)&\" \"&TRIM(D2865)","v":"KIN 395"},"PROF ACTIVITIES: GROUP FITNESS","Undergrad","https://secure.oregonstate.edu/ap/cps/documents/view/130382 ","No Sustainability Content"]
[null,"BPHS","KIN",396,{"$f":"TRIM(C2866)&\" \"&TRIM(D2866)","v":"KIN 396"},"PROF ACTIVITIES: AQUATICS","Undergrad","https://secure.oregonstate.edu/ap/cps/documents/view/130381","No Sustainability Content"]
[null,"BPHS","KIN",410,"KIN 410","INTERNSHIP","Undergrad","https://secure.oregonstate.edu/ap/cps/documents/view/126184","No Sustainability Content"]
[null,"BPHS","KIN",425,"KIN 425","ANATOMICAL KINESIOLOGY","Undergrad","https://secure.oregonstate.edu/ap/cps/documents/view/122674","No Sustainability Content"]
[null,"BPHS","KIN",434,{"$f":"TRIM(C2869)&\" \"&TRIM(D2869)","v":"KIN 434"},"APPLIED MUSCLE PHYSIOLOGY","Undergrad","https://secure.oregonstate.edu/ap/cps/documents/view/127473","No Sustainability Content"]
[null,"BPHS","KIN",437,"KIN 437","PHYS ACT, AGE & CHRONIC DISEAS","Undergrad","https://secure.oregonstate.edu/ap/cps/documents/view/126185","No Sustainability Content"]
[null,"BPHS","KIN",474,{"$f":"TRIM(C2871)&\" \"&TRIM(D2871)","v":"KIN 474"},"EXERCISE PHYSIO LAB METHODS","Undergrad","https://secure.oregonstate.edu/ap/cps/documents/view/130385","No Sustainability Content"]
[null,"BPHS","KIN",481,"KIN 481","^ANALYSIS OF CRIT ISSUES","Undergrad","https://secure.oregonstate.edu/ap/cps/documents/view/124168","No Sustainability Content"]
[null,"BPHS","KIN",483,{"$f":"TRIM(C2873)&\" \"&TRIM(D2873)","v":"KIN 483"},"TISSUE INJURY AND REPAIR","Undergrad","https://secure.oregonstate.edu/ap/cps/documents/view/127474","No Sustainability Content"]
[null,"BPHS","KIN",490,{"$f":"TRIM(C2874)&\" \"&TRIM(D2874)","v":"KIN 490"},"SCIENTIFIC INQUIRY IN KINESIOL","Undergrad","https://secure.oregonstate.edu/ap/cps/documents/view/127029","No Sustainability Content"]
[null,"BPHS","KIN",511,"KIN 511","INTRO TO ATHLETIC TRAINING","Grad","https://secure.oregonstate.edu/ap/cps/documents/view/122767","No Sustainability Content"]
[null,"BPHS","KIN",520,"KIN 520","ORTHO ASSESS OF UPPER EXTREM","Grad","https://secure.oregonstate.edu/ap/cps/documents/view/123669","No Sustainability Content"]
[null,"BPHS","KIN",521,"KIN 521","ORTHO ASSESSMNT LOWER EXTREM","Grad","https://secure.oregonstate.edu/ap/cps/documents/view/123670","No Sustainability Content"]
[null,"BPHS","KIN",522,"KIN 522","ORTHOPEDIC ASSESSMENT OF SPINE","Grad","https://secure.oregonstate.edu/ap/cps/documents/view/123671","No Sustainability Content"]
[null,"BPHS","KIN",531,"KIN 531","PHYSIOLOGY OF PHYSICAL ACTIVITY AND INACTIVITY. (3 Credits)","Grad","https://secure.oregonstate.edu/ap/cps/documents/view/126317","No Sustainability Content"]
[null,"BPHS","KIN",564,"KIN 564","PROGRAM CAPSTONE AND SYNTHESIS. (3 Credits)","Grad","https://secure.oregonstate.edu/ap/cps/documents/view/127176","No Sustainability Content"]
[null,"BPHS","KIN",565,"KIN 565","EMERGNCY MNGT SPORTS TRAUMA","Grad","https://secure.oregonstate.edu/ap/cps/documents/view/123672","No Sustainability Content"]
[null,"BPHS","KIN",566,"KIN 566","GENERAL MEDICAL ASSESSMENT",{"$f":"IF(D2882>499,\"Grad\", \"Undergrad\")","v":"Grad"},"https://secure.oregonstate.edu/ap/cps/documents/view/123673","No Sustainability Content"]
[null,"BPHS","KIN",567,"KIN 567","PHARMACOLOGY IN ATHLETIC TRAIN","Grad","https://secure.oregonstate.edu/ap/cps/documents/view/122779","No Sustainability Content"]
[null,"BPHS","KIN",568,"KIN 568","ATHLETIC TRAINING PRGRM MNGMT","Grad","https://secure.oregonstate.edu/ap/cps/documents/view/122781","No Sustainability Content"]
[null,"BPHS","KIN",569,"KIN 569","EVIDENCE-BASED PRACTICE","Grad","https://secure.oregonstate.edu/ap/cps/documents/view/122783","No Sustainability Content"]
[null,"BPHS","KIN",584,"KIN 584","THERAPEUTIC MODALITIES","Grad","https://secure.oregonstate.edu/ap/cps/documents/view/123474","No Sustainability Content"]
[null,"BPHS","KIN",585,"KIN 585","UPPER EXTREMITY THERAPEUTIC EX","Grad","https://secure.oregonstate.edu/ap/cps/documents/view/122788","No Sustainability Content"]
[null,"BPHS","KIN",586,"KIN 586","LOWER EXTREM THERAPEUTIC EXERC","Grad","https://secure.oregonstate.edu/ap/cps/documents/view/122862","No Sustainability Content"]
[null,"SLCS","KOR",111,"KOR 111","FIRST-YEAR KOREAN","Undergrad","https://secure.oregonstate.edu/ap/cps/documents/view/113472","No Sustainability Content"]
[null,"SLCS","KOR",112,"KOR 112","FIRST-YEAR KOREAN","Undergrad","https://secure.oregonstate.edu/ap/cps/documents/view/113473","No Sustainability Content"]
[null,"SLCS","KOR",113,"KOR 113","FIRST-YEAR KOREAN","Undergrad","https://secure.oregonstate.edu/ap/cps/documents/view/113955","No Sustainability Content"]
[null,"SLCS","KOR",211,"KOR 211","SECOND-YEAR KOREAN","Undergrad","https://secure.oregonstate.edu/ap/cps/documents/view/125138","No Sustainability Content"]
[null,"SLCS","KOR",212,{"$f":"TRIM(C2893)&\" \"&TRIM(D2893)","v":"KOR 212"},"SECOND-YEAR KOREAN","Undergrad","https://secure.oregonstate.edu/ap/cps/documents/view/125284 ","No Sustainability Content"]
[null,"SLCS","KOR",213,{"$f":"TRIM(C2894)&\" \"&TRIM(D2894)","v":"KOR 213"},"SECOND-YEAR KOREAN","Undergrad","https://secure.oregonstate.edu/ap/cps/documents/view/127285","No Sustainability Content"]
[null,"SLCS","LAT",111,"LAT 111","FIRST-YEAR LATIN. (4 Credits)","Undergrad","https://secure.oregonstate.edu/ap/cps/documents/view/113969","No Sustainability Content"]
[null,"SLCS","LAT",112,"LAT 112","FIRST-YEAR LATIN. (4 Credits)","Undergrad","https://secure.oregonstate.edu/ap/cps/documents/view/114002","No Sustainability Content"]
[null,"SLCS","LAT",113,"LAT 113","FIRST-YEAR LATIN. (4 Credits)","Undergrad","https://secure.oregonstate.edu/ap/cps/documents/view/114014","No Sustainability Content"]
[null,"SLCS","LING",111,"LING 111","LESS COMMON LANGUAGE-CLASSRM","Undergrad","https://catalog.oregonstate.edu/search/?P=LING%20111","No Sustainability Content"]
[null,"SLCS","LING",112,"LING 112","LESS COMMON LANGUAGE-CLASSRM","Undergrad","https://catalog.oregonstate.edu/search/?P=LING%20112","No Sustainability Content"]
[null,"SLCS","LING",113,"LING 113","CLASSROOM STUDY OF A LESS COMMONLY TAUGHT LANGUAGE. (4 Credits)","Undergrad","https://catalog.oregonstate.edu/search/?P=LING%20113","No Sustainability Content"]
[null,"SLCS","LING",114,"LING 114","MASTER/APPRENTICE STUDY OF A LESS COMMONLY TAUGHT LANGUAGE. (1-4 Credits)","Undergrad","https://catalog.oregonstate.edu/search/?P=LING%20114","No Sustainability Content"]
[null,"SLCS","LING",115,"LING 115","MASTER/APPRENTICE STUDY OF A LESS COMMONLY TAUGHT LANGUAGE. (1-4 Credits)","Undergrad","https://catalog.oregonstate.edu/search/?P=LING%20115","No Sustainability Content"]
[null,"SLCS","LING",116,"LING 116","LESS COMMON LANGUAGE-MENTOR","Undergrad","https://catalog.oregonstate.edu/search/?P=LING%20116","No Sustainability Content"]
[null,"MIME","MATS",445,"MATS 445","WELDING METALLURGY. (4 Credits)","Undergrad","https://secure.oregonstate.edu/ap/cps/documents/view/128994","No Sustainability Content"]
[null,"MIME","MATS",545,"MATS 545","WELDING METALLURGY. (4 Credits)","Grad","https://secure.oregonstate.edu/ap/cps/documents/view/128994","No Sustainability Content"]
[null,"MIME","MATS",582,"MATS 582","RATE PROCESSES IN MATERIALS","Grad","https://secure.oregonstate.edu/ap/cps/documents/view/100842","No Sustainability Content"]
[null,"MIME","MATS",584,"MATS 584","ADVANCED FRACTURE OF MATERIALS. (4 Credits)","Grad","https://secure.oregonstate.edu/ap/cps/documents/view/109177","No Sustainability Content"]
[null,"MIME","MATS",588,"MATS 588","COMPUTATIONAL METHODS MAT SCI","Grad","https://secure.oregonstate.edu/ap/cps/documents/view/113223","No Sustainability Content"]
[null,"MB","MB",201,"MB 201","LABORATORY SKILLS","Undergrad","https://secure.oregonstate.edu/ap/cps/documents/view/123436","No Sustainability Content"]
[null,"MB","MB",255,"MB 255","*ALLIED HEALTH MICROBIOLOGY. (4 Credits)","Undergrad","https://secure.oregonstate.edu/ap/cps/documents/view/131204","No Sustainability Content"]
[null,"MB","MB",302,{"$f":"TRIM(C2911)&\" \"&TRIM(D2911)","v":"MB 302"},"GENERAL MICROBIOLOGY","Undergrad","https://secure.oregonstate.edu/ap/cps/documents/view/110000","No Sustainability Content"]
[null,"MB","MB",310,"MB 310","BACTERIAL MOLECULAR GENETICS","Undergrad","https://secure.oregonstate.edu/ap/cps/documents/view/111747","No Sustainability Content"]
[null,"MB","MB",314,{"$f":"TRIM(C2913)&\" \"&TRIM(D2913)","v":"MB 314"},"AQUATIC MICROBIOLOGY","Undergrad","https://secure.oregonstate.edu/ap/cps/documents/view/127677","No Sustainability Content"]
[null,"MB","MB",340,"MB 340","HUMAN VIROLOGY. (4 Credits)","Undergrad","https://secure.oregonstate.edu/ap/cps/documents/view/131100","No Sustainability Content"]
[null,"MB","MB",416,"MB 416","IMMUNOLOGY","Undergrad","https://catalog.oregonstate.edu/search/?P=MB%20416","No Sustainability Content"]
[null,"MB","MB",417,"MB 417","IMMUNOLOGY LABORATORY","Undergrad","https://catalog.oregonstate.edu/search/?P=MB%20417","No Sustainability Content"]
[null,"MB","MB",420,"MB 420","MICROBIAL DIVERSITY","Undergrad","https://catalog.oregonstate.edu/search/?P=MB%20420","No Sustainability Content"]
[null,"MB","MB",422,{"$f":"TRIM(C2918)&\" \"&TRIM(D2918)","v":"MB 422"},"AQUATIC MICROBIOLOGY LAB","Undergrad","https://secure.oregonstate.edu/ap/cps/documents/view/130379","No Sustainability Content"]
[null,"MB","MB",430,"MB 430","BACTERIAL PATHOGENESIS","Undergrad","https://catalog.oregonstate.edu/search/?P=MB%20430","No Sustainability Content"]
[null,"MB","MB",434,"MB 434","VIROLOGY","Undergrad","https://catalog.oregonstate.edu/search/?P=MB%20434","No Sustainability Content"]
[null,"MB","MB",436,{"$f":"TRIM(C2921)&\" \"&TRIM(D2921)","v":"MB 436"},"THE HUMAN MICROBIOME","Undergrad","https://secure.oregonstate.edu/ap/cps/documents/view/126963","No Sustainability Content"]
[null,"MB","MB",440,"MB 440","FOOD MICROBIOLOGY","Undergrad","https://catalog.oregonstate.edu/search/?P=MB%20440","No Sustainability Content"]
[null,"MB","MB",456,"MB 456","MB GENETICS & BIOTECHNOLOGY","Undergrad","https://catalog.oregonstate.edu/search/?P=MB%20456","No Sustainability Content"]
[null,"MB","MB",490,"MB 490","MICROBIOLOGY CAPSTONE","Undergrad","https://secure.oregonstate.edu/ap/cps/documents/view/111823","No Sustainability Content"]
[null,"MB","MB",496,"MB 496","FISH DISEASES IN CONSERVATION BIOLOGY AND AQUACULTURE LAB. (2 Credits)","Undergrad","https://catalog.oregonstate.edu/search/?P=MB%20496","No Sustainability Content"]
[null,"MB","MB",511,"MB 511","SCIENTIFIC SKILLS","Grad","https://secure.oregonstate.edu/ap/cps/documents/view/111850","No Sustainability Content"]
[null,"MB","MB",512,"MB 512","HIGHLIGHTS OF MICROBIOLOGY","Grad","https://secure.oregonstate.edu/ap/cps/documents/view/111861","No Sustainability Content"]
[null,"MB","MB",516,"MB 516","IMMUNOLOGY","Grad","https://catalog.oregonstate.edu/search/?P=MB%20516","No Sustainability Content"]
[null,"MB","MB",517,"MB 517","IMMUNOLOGY LABORATORY","Grad","https://catalog.oregonstate.edu/search/?P=MB%20517","No Sustainability Content"]
[null,"MB","MB",520,"MB 520","MICROBIAL DIVERSITY","Grad","https://catalog.oregonstate.edu/search/?P=MB%20520","No Sustainability Content"]
[null,"MB","MB",530,"MB 530","BACTERIAL PATHOGENESIS","Grad","https://catalog.oregonstate.edu/search/?P=MB%20530","No Sustainability Content"]
[null,"MB","MB",534,"MB 534","VIROLOGY","Grad","https://catalog.oregonstate.edu/search/?P=MB%20534","No Sustainability Content"]
[null,"MB","MB",540,"MB 540","FOOD MICROBIOLOGY","Grad","https://catalog.oregonstate.edu/search/?P=MB%20540","No Sustainability Content"]
[null,"MB","MB",556,"MB 556","MB GENETICS & BIOTECHNOLOGY","Grad","https://catalog.oregonstate.edu/search/?P=MB%20556","No Sustainability Content"]
[null,"MB","MB",596,"MB 596","FISH DISEASES IN CONSERVATION BIOLOGY AND AQUACULTURE LAB. (2 Credits)","Grad","https://catalog.oregonstate.edu/search/?P=MB%20596","No Sustainability Content"]
[null,"MB","MB",668,"MB 668","MICROBIAL BIOINFORMATICS","Grad","https://secure.oregonstate.edu/ap/cps/documents/view/112321","No Sustainability Content"]
[null,"MB","MB",669,"MB 669","Bioinformatics and Genomics","Grad","https://secure.oregonstate.edu/ap/cps/documents/view/7444","No Sustainability Content"]
[null,"MCB","MCB",554,"MCB 554","GENOME ORG STRUCT MAINTENANCE","Grad","https://catalog.oregonstate.edu/search/?P=MCB%20554","No Sustainability Content"]
[null,"MCB","MCB",555,"MCB 555","GENOME EXPRESSION & REGULATION","Grad","https://catalog.oregonstate.edu/search/?P=MCB%20555","No Sustainability Content"]
[null,"MCB","MCB",556,"MCB 556","CELL AND DEVELOPMENTAL BIOLOGY. (4 Credits)","Grad","https://secure.oregonstate.edu/ap/cps/documents/view/7589","No Sustainability Content"]
[null,"MCB","MCB",557,"MCB 557","SCIENTIFIC SKILLS AND ETHICS","Grad","https://secure.oregonstate.edu/ap/cps/documents/view/113932","No Sustainability Content"]
[null,"MCB","MCB",563,"MCB 563","CANCER AND CHEMOPREVENTION","Grad","https://secure.oregonstate.edu/ap/cps/documents/view/100194","No Sustainability Content"]
[null,"MCB","MCB",575,"MCB 575","COMPARATIVE GENOMICS","Grad","https://secure.oregonstate.edu/ap/cps/documents/view/106029","No Sustainability Content"]
[null,"MCB","MCB",576,"MCB 576","COMPUTING IN LIFE SCIENCES","Grad","https://secure.oregonstate.edu/ap/cps/documents/view/114308","No Sustainability Content"]
[null,"MCB","MCB",637,"MCB 637","MOLECULAR HOST-MICROBE INTERAC","Grad","https://catalog.oregonstate.edu/search/?P=MCB%20637","No Sustainability Content"]
[null,"MCB","MCB",662,"MCB 662","HORMONE ACTION",{"$f":"IF(D2946>499,\"Grad\", \"Undergrad\")","v":"Grad"},"https://secure.oregonstate.edu/ap/cps/documents/view/109573","No Sustainability Content"]
[null,"MCB","MCB",671,"MCB 671","MOLECULAR TOOLS","Grad","https://catalog.oregonstate.edu/search/?P=MCB%20671","No Sustainability Content"]
[null,"MIME","ME",250,"ME 250","INTRO TO MANUFACTURING PROCESS","Undergrad","https://secure.oregonstate.edu/ap/cps/documents/view/104359","No Sustainability Content"]
[null,"MIME","ME",312,"ME 312","THERMODYNAMICS","Undergrad","https://secure.oregonstate.edu/ap/cps/documents/view/100909","No Sustainability Content"]
[null,"MIME","ME",317,"ME 317","INTERMEDIATE DYNAMICS","Undergrad","https://secure.oregonstate.edu/ap/cps/documents/view/97220","No Sustainability Content"]
[null,"MIME","ME",348,"ME 348","ADVANCED SOLID MODELING. (1 Credit)","Undergrad","https://secure.oregonstate.edu/ap/cps/documents/view/104530","No Sustainability Content"]
[null,"MIME","ME",373,"ME 373","MECHANICAL ENGINEERING METHODS","Undergrad","https://secure.oregonstate.edu/ap/cps/documents/view/104361","No Sustainability Content"]
[null,"MIME","ME",382,"ME 382","INTRODUCTION TO DESIGN","Undergrad","https://secure.oregonstate.edu/ap/cps/documents/view/115391","No Sustainability Content"]
[null,"MIME","ME",383,"ME 383","MECHANICAL COMPONENT DESIGN","Undergrad","https://secure.oregonstate.edu/ap/cps/documents/view/123720","No Sustainability Content"]
[null,"MIME","ME",411,"ME 411","AEROSPACE APPS IN MECH ENG","Undergrad","https://secure.oregonstate.edu/ap/cps/documents/view/121524","No Sustainability Content"]
[null,"MIME","ME",412,"ME 412","DESIGN OF MECHANISMS","Undergrad","https://catalog.oregonstate.edu/search/?P=ME%20412","No Sustainability Content"]
[null,"MIME","ME",413,"ME 413","CAD/CAM","Undergrad","https://secure.oregonstate.edu/ap/cps/documents/view/10300","No Sustainability Content"]
[null,"MIME","ME",418,"ME 418","SAE SENIOR DESIGN PROJECT","Undergrad","https://secure.oregonstate.edu/ap/cps/documents/view/6798","No Sustainability Content"]
[null,"MIME","ME",419,"ME 419","SAE SENIOR DESIGN PROJECT","Undergrad","https://secure.oregonstate.edu/ap/cps/documents/view/6798","No Sustainability Content"]
[null,"MIME","ME",420,"ME 420","APPLIED STRESS ANALYSIS","Undergrad","https://catalog.oregonstate.edu/search/?P=ME%20420","No Sustainability Content"]
[null,"MIME","ME",424,"ME 424","FINITE ELEM OF MECH ENGIN SYS","Undergrad","https://catalog.oregonstate.edu/search/?P=ME%20424","No Sustainability Content"]
[null,"MIME","ME",444,{"$f":"TRIM(C2962)&\" \"&TRIM(D2962)","v":"ME 444"},"THERMAL SYS DESIGN & ANALYSIS","Undergrad","https://secure.oregonstate.edu/ap/cps/documents/view/126529","No Sustainability Content"]
[null,"MIME","ME",445,"ME 445","INTRODUCTION TO COMBUSTION","Undergrad","https://catalog.oregonstate.edu/search/?P=ME%20445","No Sustainability Content"]
[null,"MIME","ME",450,"ME 450","APPLIED HEAT TRANSFER","Undergrad","https://catalog.oregonstate.edu/search/?P=ME%20450","No Sustainability Content"]
[null,"MIME","ME",451,"ME 451","INTRO TO MEASUREMENT SYSTEMS","Undergrad","https://secure.oregonstate.edu/ap/cps/documents/view/6797","No Sustainability Content"]
[null,"MIME","ME",452,"ME 452","THERMAL & FLUIDS SCIENCES LAB","Undergrad","https://secure.oregonstate.edu/ap/cps/documents/view/101835","No Sustainability Content"]
[null,"MIME","ME",455,"ME 455","Experimental Techniques in Materials Science","Undergrad","https://secure.oregonstate.edu/ap/cps/documents/view/101855","No Sustainability Content"]
[null,"MIME","ME",460,"ME 460","INTERMEDIATE FLUID MECHANICS","Undergrad","https://catalog.oregonstate.edu/search/?P=ME%20460","No Sustainability Content"]
[null,"MIME","ME",461,{"$f":"TRIM(C2969)&\" \"&TRIM(D2969)","v":"ME 461"},"GAS DYNAMICS","Undergrad","https://secure.oregonstate.edu/ap/cps/documents/view/106991","No Sustainability Content"]
[null,"MIME","ME",478,"ME 478","Thin Film Materials Characterization and Properties","Undergrad","https://secure.oregonstate.edu/ap/cps/documents/view/113495","No Sustainability Content"]
[null,"MIME","ME",484,"ME 484","FRACTURE OF MATERIALS","Undergrad","https://secure.oregonstate.edu/ap/cps/documents/view/4875","No Sustainability Content"]
[null,"MIME","ME",508,"ME 508","THERMAL FLUID SCIENCE SEMINAR. (1 Credit)","Grad","https://secure.oregonstate.edu/ap/cps/documents/view/5194","No Sustainability Content"]
[null,"MIME","ME",509,"ME 509","MATERIALS SCIENCE SEMINAR. (1 Credit)","Grad","https://secure.oregonstate.edu/ap/cps/documents/view/5723","No Sustainability Content"]
[null,"MIME","ME",511,"ME 511","PRECISION MACHINE DESIGN. (3 Credits)","Grad","https://secure.oregonstate.edu/ap/cps/documents/view/123167","No Sustainability Content"]
[null,"MIME","ME",512,"ME 512","DESIGN OF MECHANISMS","Grad","https://catalog.oregonstate.edu/search/?P=ME%20512","No Sustainability Content"]
[null,"MIME","ME",513,"ME 513","BIO-INSPIRED DESIGN","Grad","https://secure.oregonstate.edu/ap/cps/documents/view/115064","No Sustainability Content"]
[null,"MIME","ME",515,"ME 515","RISK AND RELIABILITY ANALYSIS IN ENGINEERING DESIGN. (4 Credits)","Grad","https://secure.oregonstate.edu/ap/cps/documents/view/8576","No Sustainability Content"]
[null,"MIME","ME",516,"ME 516","MODELING AND ANALYSIS OF COMPLEX SYSTEMS. (4 Credits)","Grad","https://secure.oregonstate.edu/ap/cps/documents/view/8575","No Sustainability Content"]
[null,"MIME","ME",517,"ME 517","OPTIMIZATION IN DESIGN","Grad","https://secure.oregonstate.edu/ap/cps/documents/view/124215","No Sustainability Content"]
[null,"MIME","ME",520,"ME 520","APPLIED STRESS ANALYSIS","Grad","https://catalog.oregonstate.edu/search/?P=ME%20520","No Sustainability Content"]
[null,"MIME","ME",521,"ME 521","LINEAR ELASTICITY","Grad","https://secure.oregonstate.edu/ap/cps/documents/view/121930","No Sustainability Content"]
[null,"MIME","ME",523,"ME 523","ADVANCED STRESS ANALYSIS. (4 Credits)","Grad","https://secure.oregonstate.edu/ap/cps/documents/view/125698","No Sustainability Content"]
[null,"MIME","ME",524,"ME 524","FINITE ELEMENT MODELING OF MECHANICAL ENGINEERING SYSTEMS. (3 Credits)","Grad","https://catalog.oregonstate.edu/search/?P=ME%20524","No Sustainability Content"]
[null,"MIME","ME",526,"ME 526","NUMERICAL METHS FOR ENGR ANL","Grad","https://secure.oregonstate.edu/ap/cps/documents/view/10245","No Sustainability Content"]
[null,"MIME","ME",531,"ME 531","LINEAR MULTIVARIABLE CONTROL SYSTEMS I. (4 Credits)","Grad","https://secure.oregonstate.edu/ap/cps/documents/view/8577","No Sustainability Content"]
[null,"MIME","ME",540,"ME 540","INTERMEDIATE THERMODYNAMICS. (4 Credits)","Grad","https://secure.oregonstate.edu/ap/cps/documents/view/126225","No Sustainability Content"]
[null,"MIME","ME",541,"ME 541","LIQUID-VAPOR PHASE CHANGE AND HEAT TRANSFER. (4 Credits)","Grad","https://secure.oregonstate.edu/ap/cps/documents/view/123388","No Sustainability Content"]
[null,"MIME","ME",545,"ME 545","INTRODUCTION TO COMBUSTION","Grad","https://catalog.oregonstate.edu/search/?P=ME%20545","No Sustainability Content"]
[null,"MIME","ME",550,"ME 550","APPLIED HEAT TRANSFER","Grad","https://catalog.oregonstate.edu/search/?P=ME%20550","No Sustainability Content"]
[null,"MIME","ME",555,"ME 555","Experimental Techniques in Materials Science","Grad","https://secure.oregonstate.edu/ap/cps/documents/view/101855","No Sustainability Content"]
[null,"MIME","ME",560,"ME 560","INTERMEDIATE FLUID MECHANICS","Grad","https://catalog.oregonstate.edu/search/?P=ME%20560","No Sustainability Content"]
[null,"MIME","ME",561,{"$f":"TRIM(C2992)&\" \"&TRIM(D2992)","v":"ME 561"},"GAS DYNAMICS","Grad","https://secure.oregonstate.edu/ap/cps/documents/view/106991","No Sustainability Content"]
[null,"MIME","ME",564,"ME 564","TURBULENCE MODELING. (3 Credits)","Grad","https://secure.oregonstate.edu/ap/cps/documents/view/119051","No Sustainability Content"]
[null,"MIME","ME",566,"ME 566","VISCOUS FLOW","Grad","https://secure.oregonstate.edu/ap/cps/documents/view/100853","No Sustainability Content"]
[null,"MIME","ME",568,"ME 568","TURBULENT FLOW DYNAMICS","Grad","https://secure.oregonstate.edu/ap/cps/documents/view/114904","No Sustainability Content"]
[null,"MIME","ME",570,"ME 570","STRUCTURE-PROPERTY RELATIONS IN MATERIALS. (4 Credits)","Grad","https://secure.oregonstate.edu/ap/cps/documents/view/6643","No Sustainability Content"]
[null,"MIME","ME",571,"ME 571","Electronic Properties of Materials","Grad","https://secure.oregonstate.edu/ap/cps/documents/view/9969","No Sustainability Content"]
[null,"MIME","ME",578,"ME 578","Thin Film Materials Characterization and Properties","Grad","https://secure.oregonstate.edu/ap/cps/documents/view/113495","No Sustainability Content"]
[null,"MIME","ME",581,"ME 581","THERMODYNAMICS OF SOLIDS","Grad","https://secure.oregonstate.edu/ap/cps/documents/view/7221","No Sustainability Content"]
[null,"MIME","ME",582,"ME 582","Rate Processes","Grad","https://secure.oregonstate.edu/ap/cps/documents/view/100841","No Sustainability Content"]
[null,"MIME","ME",584,"ME 584","ADVANCED FRACTURE OF MATERIALS","Grad","https://secure.oregonstate.edu/ap/cps/documents/view/109178","No Sustainability Content"]
[null,"MIME","ME",585,"ME 585","FATIGUE OF MATERIALS. (4 Credits)","Grad","https://secure.oregonstate.edu/ap/cps/documents/view/109179","No Sustainability Content"]
[null,"MIME","ME",587,"ME 587","“Dislocations, Deformation, and Creep”","Grad","https://secure.oregonstate.edu/ap/cps/documents/view/4874","No Sustainability Content"]
[null,"MIME","ME",588,"ME 588","COMPUTATIONAL METHODS MAT SCI","Grad","https://secure.oregonstate.edu/ap/cps/documents/view/112902","No Sustainability Content"]
[null,"MIME","ME",597,{"$f":"TRIM(C3005)&\" \"&TRIM(D3005)","v":"ME 597"},"PRECISION MOTION GENERATION","Grad","https://secure.oregonstate.edu/ap/cps/documents/view/127542","No Sustainability Content"]
[null,"MIME","ME",611,"ME 611","MODERN PRODUCT DESIGN","Grad","https://secure.oregonstate.edu/ap/cps/documents/view/100794","No Sustainability Content"]
[null,"MIME","ME",615,{"$f":"TRIM(C3007)&\" \"&TRIM(D3007)","v":"ME 615"},"DESIGN UNDER UNCERTAINTY","Grad","https://secure.oregonstate.edu/ap/cps/documents/view/125920","No Sustainability Content"]
[null,"MIME","ME",617,"ME 617","DESIGN AUTOMATION","Grad","https://secure.oregonstate.edu/ap/cps/documents/view/121830","No Sustainability Content"]
[null,"MIME","ME",671,"ME 671","Electronic Properties of Oxides ","Grad","https://secure.oregonstate.edu/ap/cps/documents/view/9970","No Sustainability Content"]
[null,"MIME","MFGE",285,"MFGE 285","INTRO TO IND/MFG ENGINEERING",{"$f":"IF(D3010>499,\"Grad\", \"Undergrad\")","v":"Undergrad"},"https://secure.oregonstate.edu/ap/cps/documents/view/107681","No Sustainability Content"]
[null,"MIME","MFGE",336,"MFGE 336","PRODUCTION ENGINEERING","Undergrad","https://secure.oregonstate.edu/ap/cps/documents/view/124653","No Sustainability Content"]
[null,"MIME","MFGE",436,"MFGE 436","LEAN MANUFACTURING SYSTEMS ENG","Undergrad","https://catalog.oregonstate.edu/search/?P=MFGE%20436","No Sustainability Content"]
[null,"MIME","MFGE",437,"MFGE 437","COMPUTER CTRL OF MFG PROCESSES","Undergrad","https://secure.oregonstate.edu/ap/cps/documents/view/122494","No Sustainability Content"]
[null,"MIME","MFGE",438,"MFGE 438","COMPOSITES MANUFACTURING","Undergrad","https://catalog.oregonstate.edu/search/?P=MFGE%20438","No Sustainability Content"]
[null,"MIME","MFGE",511,"MFGE 511","PRECISION MACHINE DESIGN. (3 Credits)","Grad","https://secure.oregonstate.edu/ap/cps/documents/view/122899","No Sustainability Content"]
[null,"MIME","MFGE",531,{"$f":"TRIM(C3016)&\" \"&TRIM(D3016)","v":"MFGE 531"},"MICROMANUFACTURING","Grad","https://secure.oregonstate.edu/ap/cps/documents/view/128587","No Sustainability Content"]
[null,"MIME","MFGE",536,"MFGE 536","LEAN MANUFACTURING SYSTEMS ENG","Grad","https://catalog.oregonstate.edu/search/?P=MFGE%20536","No Sustainability Content"]
[null,"MIME","MFGE",538,"MFGE 538","COMPOSITES MANUFACTURING","Grad","https://catalog.oregonstate.edu/search/?P=MFGE%20538","No Sustainability Content"]
[null,"BA","MGMT",364,{"$f":"TRIM(C3019)&\" \"&TRIM(D3019)","v":"MGMT 364"},"PROJECT MANAGEMENT","Undergrad","https://secure.oregonstate.edu/ap/cps/documents/view/133101","No Sustainability Content"]
[null,"BA","MGMT",446,"MGMT 446","CROSS-CULTURAL MANAGEMENT","Undergrad","https://secure.oregonstate.edu/ap/cps/documents/view/123928","No Sustainability Content"]
[null,"BA","MGMT",448,"MGMT 448","EMPLOYEE RECRUIT & SELECTION","Undergrad","https://secure.oregonstate.edu/ap/cps/documents/view/124226","No Sustainability Content"]
[null,"BA","MGMT",449,"MGMT 449","COMPENSATION MANAGEMENT. (4 Credits)","Undergrad","https://secure.oregonstate.edu/ap/cps/documents/view/133255","No Sustainability Content"]
[null,"BA","MGMT",452,{"$f":"TRIM(C3023)&\" \"&TRIM(D3023)","v":"MGMT 452"},"LEADERSHIP","Undergrad","https://secure.oregonstate.edu/ap/cps/documents/view/133097","No Sustainability Content"]
[null,"BA","MGMT",455,"MGMT 455","INFLUENCE AND NEGOTIATION","Undergrad","https://catalog.oregonstate.edu/search/?P=MGMT%20455","No Sustainability Content"]
[null,"BA","MGMT",457,{"$f":"TRIM(C3025)&\" \"&TRIM(D3025)","v":"MGMT 457"},"SUPPLY CHAIN STRATEGY","Undergrad","https://secure.oregonstate.edu/ap/cps/documents/view/133415","No Sustainability Content"]
[null,"BA","MGMT",549,"MGMT 549","COMPENSATION MANAGEMENT. (4 Credits)","Grad","https://secure.oregonstate.edu/ap/cps/documents/view/133255","No Sustainability Content"]
[null,"BA","MGMT",552,"MGMT 552","ORGANIZATIONAL BEHAVIOR. (3 Credits)","Grad","https://secure.oregonstate.edu/ap/cps/documents/view/133213","No Sustainability Content"]
[null,"BA","MGMT",555,"MGMT 555","INFLUENCE AND NEGOTIATION","Grad","https://catalog.oregonstate.edu/search/?P=MGMT%20555","No Sustainability Content"]
[null,"BA","MGMT",571,"MGMT 571","ETHICAL LEADERSHIP","Grad","https://secure.oregonstate.edu/ap/cps/documents/view/111802","No Sustainability Content"]
[null,"BA","MGMT",572,"MGMT 572","MANAGING HUMAN RESOURCES","Grad","https://secure.oregonstate.edu/ap/cps/documents/view/113155","No Sustainability Content"]
[null,"BA","MGMT",574,"MGMT 574","NEGOTIATIONS","Grad","https://secure.oregonstate.edu/ap/cps/documents/view/113178","No Sustainability Content"]
[null,"BA","MGMT",575,"MGMT 575","INTEGRATIVE CAPSTONE I","Grad","https://secure.oregonstate.edu/ap/cps/documents/view/116657","No Sustainability Content"]
[null,"BA","MGMT",576,"MGMT 576","INTEGRATIVE CAPSTONE II","Grad","https://secure.oregonstate.edu/ap/cps/documents/view/116662","No Sustainability Content"]
[null,"BA","MGMT",650,"MGMT 650","ORGANIZATIONAL BEHAVIOR","Grad","https://secure.oregonstate.edu/ap/cps/documents/view/113542","No Sustainability Content"]
[null,"MIME","MIME",101,"MIME 101","INTRODUCTION TO MIME","Undergrad","https://secure.oregonstate.edu/ap/cps/documents/view/113212","No Sustainability Content"]
[null,"SNSE","MP",517,"MP 517","RADIONUCLIDES IN LIFE SCIENCES","Grad","https://secure.oregonstate.edu/ap/cps/documents/view/10360","No Sustainability Content"]
[null,"SNSE","MP",531,"MP 531","RADIOPHYSICS","Grad","https://secure.oregonstate.edu/ap/cps/documents/view/109314","No Sustainability Content"]
[null,"SNSE","MP",535,"MP 535","RADIATION SHIELDING AND EXTERNAL DOSIMETRY ","Grad","https://secure.oregonstate.edu/ap/cps/documents/view/100207","No Sustainability Content"]
[null,"SNSE","MP",536,"MP 536","Advanced Radiation Detection and Measurement","Grad","https://secure.oregonstate.edu/ap/cps/documents/view/100298","No Sustainability Content"]
[null,"SNSE","MP",541,"MP 541","Diagnostic Imaging Physics I","Grad","https://secure.oregonstate.edu/ap/cps/documents/view/117659","No Sustainability Content"]
[null,"SNSE","MP",542,"MP 542","Diagnostic Imaging Physics II","Grad","https://secure.oregonstate.edu/ap/cps/documents/view/117669","No Sustainability Content"]
[null,"SNSE","MP",543,"MP 543","Advanced Diagnostic Imaging Physics","Grad","https://secure.oregonstate.edu/ap/cps/documents/view/117670","No Sustainability Content"]
[null,"SNSE","MP",544,"MP 544","Nuclear Medicine Imaging","Grad","https://secure.oregonstate.edu/ap/cps/documents/view/117671","No Sustainability Content"]
[null,"SNSE","MP",545,"MP 545","Diagnostic Imaging Physics Practicum","Grad","https://secure.oregonstate.edu/ap/cps/documents/view/117762","No Sustainability Content"]
[null,"SNSE","MP",562,"MP 562","Radiation Therapy","Grad","https://secure.oregonstate.edu/ap/cps/documents/view/97240","No Sustainability Content"]
[null,"SNSE","MP",563,"MP 563","Applied Radiation Therapy Physics Lab I","Grad","https://secure.oregonstate.edu/ap/cps/documents/view/115007","No Sustainability Content"]
[null,"SNSE","MP",564,"MP 564","Applied Radiation Therapy Physics Lab II","Grad","https://secure.oregonstate.edu/ap/cps/documents/view/115008","No Sustainability Content"]
[null,"SNSE","MP",582,"MP 582","Applied Radiation Safety ","Grad","https://secure.oregonstate.edu/ap/cps/documents/view/100297","No Sustainability Content"]
[null,"SNSE","MP",583,"MP 583","RADIATION BIOLOGY","Grad","https://secure.oregonstate.edu/ap/cps/documents/view/115675","No Sustainability Content"]
[null,"SNSE","MP",584,"MP 584","Radiation Biology II","Grad","https://secure.oregonstate.edu/ap/cps/documents/view/116291","No Sustainability Content"]
[null,"BA","MRKT",390,{"$f":"TRIM(C3051)&\" \"&TRIM(D3051)","v":"MRKT 390"},"BLD & MNG PROD, SRVC & BRAND","Undergrad","https://secure.oregonstate.edu/ap/cps/documents/view/133287","No Sustainability Content"]
[null,"BA","MRKT",396,{"$f":"TRIM(C3052)&\" \"&TRIM(D3052)","v":"MRKT 396"},"FUND OF MARKETING RESEARCH","Undergrad","https://secure.oregonstate.edu/ap/cps/documents/view/133113","No Sustainability Content"]
[null,"BA","MRKT",484,"MRKT 484","DIGITAL MEDIA AND MARKETING INTEGRATION. (4 Credits)","Undergrad","https://secure.oregonstate.edu/ap/cps/documents/view/133317","No Sustainability Content"]
[null,"BA","MRKT",485,"MRKT 485","SEARCH ENGINE MARKETING. (4 Credits)","Undergrad","https://secure.oregonstate.edu/ap/cps/documents/view/133313","No Sustainability Content"]
[null,"BA","MRKT",486,"MRKT 486","CUSTOMER RELATIONSHIP MGMT","Undergrad","https://secure.oregonstate.edu/ap/cps/documents/view/113618","No Sustainability Content"]
[null,"BA","MRKT",488,"MRKT 488","PERSONAL SELLING","Undergrad","https://catalog.oregonstate.edu/search/?P=MRKT%20488","No Sustainability Content"]
[null,"BA","MRKT",489,"MRKT 489","PERSONAL SELLING SKILLS & TECH","Undergrad","https://catalog.oregonstate.edu/search/?P=MRKT%20489","No Sustainability Content"]
[null,"BA","MRKT",492,{"$f":"TRIM(C3058)&\" \"&TRIM(D3058)","v":"MRKT 492"},"CONSUMER BEHAVIOR","Undergrad","https://secure.oregonstate.edu/ap/cps/documents/view/133120","No Sustainability Content"]
[null,"BA","MRKT",493,{"$f":"TRIM(C3059)&\" \"&TRIM(D3059)","v":"MRKT 493"},"INTEGRATED MARKETING COMM","Undergrad","https://secure.oregonstate.edu/ap/cps/documents/view/133121","No Sustainability Content"]
[null,"BA","MRKT",498,{"$f":"TRIM(C3060)&\" \"&TRIM(D3060)","v":"MRKT 498"},"SERVICES MARKETING","Undergrad","https://secure.oregonstate.edu/ap/cps/documents/view/133124","No Sustainability Content"]
[null,"BA","MRKT",499,{"$f":"TRIM(C3061)&\" \"&TRIM(D3061)","v":"MRKT 499"},"MARKETING STRATEGY","Undergrad","https://secure.oregonstate.edu/ap/cps/documents/view/128009","No Sustainability Content"]
[null,"BA","MRKT",581,"MRKT 581","APPLIED QUANTITATIVE MARKETING ANALYSIS. (4 Credits)","Grad","https://secure.oregonstate.edu/ap/cps/documents/view/110895","No Sustainability Content"]
[null,"BA","MRKT",582,"MRKT 582","APPLIED QUALITATIVE MARKETING ANALYSIS. (3 Credits)","Grad","https://secure.oregonstate.edu/ap/cps/documents/view/111231","No Sustainability Content"]
[null,"BA","MRKT",584,"MRKT 584","DIGITAL MEDIA AND MARKETING INTEGRATION. (4 Credits)","Grad","https://secure.oregonstate.edu/ap/cps/documents/view/133317","No Sustainability Content"]
[null,"BA","MRKT",585,"MRKT 585","SEARCH ENGINE MARKETING. (4 Credits)","Grad","https://secure.oregonstate.edu/ap/cps/documents/view/133313","No Sustainability Content"]
[null,"BA","MRKT",586,"MRKT 586","CUSTOMER RELATIONSHIP MANAGEMENT. (4 Credits)","Grad","https://secure.oregonstate.edu/ap/cps/documents/view/133316","No Sustainability Content"]
[null,"BA","MRKT",587,"MRKT 587","DESIGNING CUSTOMER EXPERIENCES. (3 Credits)","Grad","https://secure.oregonstate.edu/ap/cps/documents/view/129186","No Sustainability Content"]
[null,"BA","MRKT",588,"MRKT 588","PERSONAL SELLING","Grad","https://catalog.oregonstate.edu/search/?P=MRKT%20588","No Sustainability Content"]
[null,"BA","MRKT",589,"MRKT 589","PERSONAL SELLING SKILLS DEVEL","Grad","https://catalog.oregonstate.edu/search/?P=MRKT%20589","No Sustainability Content"]
[null,"BA","MRKT",592,{"$f":"TRIM(C3070)&\" \"&TRIM(D3070)","v":"MRKT 592"},"CONSUMER BEHAVIOR","Grad","https://secure.oregonstate.edu/ap/cps/documents/view/126706","No Sustainability Content"]
[null,"BA","MRKT",593,"MRKT 593","INTEGRATED MARKETING COMMUNICATIONS. (3 Credits)","Grad","https://secure.oregonstate.edu/ap/cps/documents/view/126707","No Sustainability Content"]
[null,"BA","MRKT",596,"MRKT 596","MARKETING RESEARCH DESIGN AND METHODS. (3 Credits)","Grad","https://secure.oregonstate.edu/ap/cps/documents/view/111560","No Sustainability Content"]
[null,"BA","MRKT",690,"MRKT 690","MARKETING & COMMERCIALIZATION","Grad","https://secure.oregonstate.edu/ap/cps/documents/view/114923","No Sustainability Content"]
[null,"OC","MRM",506,"MRM 506","PROJECTS",{"$f":"IF(D3074>499,\"Grad\", \"Undergrad\")","v":"Grad"},"https://secure.oregonstate.edu/ap/cps/documents/view/101516","No Sustainability Content"]
[null,"BA","MRKT",491,"MRKT 491","Qualitative Research Methods","Undergrad","https://secure.oregonstate.edu/ap/cps/documents/view/133118","No Sustainability Content"]
[null,"MS","MS",111,"MS 111","MIL SCI I: INTRO TO ROTC","Undergrad","https://secure.oregonstate.edu/ap/cps/documents/view/106222","No Sustainability Content"]
[null,"MS","MS",112,"MS 112","MIL SCI I: MILITARY SKILLS","Undergrad","https://secure.oregonstate.edu/ap/cps/documents/view/106948","No Sustainability Content"]
[null,"MS","MS",113,"MS 113","MIL SCI I: TACTICAL LEADERSHIP","Undergrad","https://secure.oregonstate.edu/ap/cps/documents/view/106880","No Sustainability Content"]
[null,"MS","MS",130,"MS 130","*MILITARY PHYSICAL CONDITION","Undergrad","https://secure.oregonstate.edu/ap/cps/documents/view/118857","No Sustainability Content"]
[null,"MS","MS",211,"MS 211","MIL SCI II: FUND OF LDRSHIP I","Undergrad","https://secure.oregonstate.edu/ap/cps/documents/view/106881","No Sustainability Content"]
[null,"MS","MS",212,"MS 212","MIL SCI II: FUND OF LDRSHIP II","Undergrad","https://secure.oregonstate.edu/ap/cps/documents/view/106883","No Sustainability Content"]
[null,"MS","MS",214,"MS 214","LEADER'S TRAINING COURSE (LTC)","Undergrad","https://secure.oregonstate.edu/ap/cps/documents/view/106577","No Sustainability Content"]
[null,"MS","MS",314,"MS 314","LEADER DEVMT & ASSMT COURSE","Undergrad","https://secure.oregonstate.edu/ap/cps/documents/view/106578","No Sustainability Content"]
[null,"MS","MS",411,"MS 411","MIL SCI IV: ADAPTIVE LDRSHIP","Undergrad","https://secure.oregonstate.edu/ap/cps/documents/view/106764","No Sustainability Content"]
[null,"MTH","MTH",103,"MTH 103","ALGEBRAIC REASONING","Undergrad","https://secure.oregonstate.edu/ap/cps/documents/view/115226","No Sustainability Content"]
[null,"MTH","MTH",105,"MTH 105","*INTRO TO CONTEMPORARY MATH","Undergrad","https://secure.oregonstate.edu/ap/cps/documents/view/115242","No Sustainability Content"]
[null,"MTH","MTH",111,"MTH 111","*COLLEGE ALGEBRA","Undergrad","https://secure.oregonstate.edu/ap/cps/documents/view/115225","No Sustainability Content"]
[null,"MTH","MTH",112,"MTH 112","*ELEMENTARY FUNCTIONS","Undergrad","https://secure.oregonstate.edu/ap/cps/documents/view/115231","No Sustainability Content"]
[null,"MTH","MTH",211,"MTH 211","*FOUNDATIONS ELEMENTARY MATH","Undergrad","https://secure.oregonstate.edu/ap/cps/documents/view/115597","No Sustainability Content"]
[null,"MTH","MTH",212,{"$f":"TRIM(C3090)&\" \"&TRIM(D3090)","v":"MTH 212"},"FOUNDATIONS OF ELEMENTARY MATH","Undergrad","https://secure.oregonstate.edu/ap/cps/documents/view/129666 ","No Sustainability Content"]
[null,"MTH","MTH",227,{"$f":"TRIM(C3091)&\" \"&TRIM(D3091)","v":"MTH 227"},"*MATH FOR LIFE SCIENCES I","Undergrad","https://secure.oregonstate.edu/ap/cps/documents/view/130522","No Sustainability Content"]
[null,"MTH","MTH",228,{"$f":"TRIM(C3092)&\" \"&TRIM(D3092)","v":"MTH 228"},"MATH FOR LIFE SCIENCES II","Undergrad","https://secure.oregonstate.edu/ap/cps/documents/view/129095","No Sustainability Content"]
[null,"MTH","MTH",231,"MTH 231","ELEMENTS DISCRETE MATHEMATICS","Undergrad","https://secure.oregonstate.edu/ap/cps/documents/view/115234","No Sustainability Content"]
[null,"MTH","MTH",241,"MTH 241","*CALC FOR MGT & SOCIAL SCI","Undergrad","https://secure.oregonstate.edu/ap/cps/documents/view/115237","No Sustainability Content"]
[null,"MTH","MTH",245,"MTH 245","*MATH FOR MGT, LIFE, & SOCIAL","Undergrad","https://secure.oregonstate.edu/ap/cps/documents/view/115236","No Sustainability Content"]
[null,"MTH","MTH",251,"MTH 251","*DIFFERENTIAL CALCULUS","Undergrad","https://secure.oregonstate.edu/ap/cps/documents/view/115239","No Sustainability Content"]
[null,"MTH","MTH",264,"MTH 264","INTRODUCTION TO MATRIX ALGEBRA. (2 Credits)","Undergrad","https://secure.oregonstate.edu/ap/cps/documents/view/132767","No Sustainability Content"]
[null,"MTH","MTH",311,"MTH 311","ADVANCED CALCULUS","Undergrad","https://secure.oregonstate.edu/ap/cps/documents/view/112126","No Sustainability Content"]
[null,"MTH","MTH",321,"MTH 321","INTRO APPL OF MATH SOFTWARE","Undergrad","https://secure.oregonstate.edu/ap/cps/documents/view/117973","No Sustainability Content"]
[null,"MTH","MTH",333,{"$f":"TRIM(C3100)&\" \"&TRIM(D3100)","v":"MTH 333"},"^FUND CONCEPTS OF TOPOLOGY","Undergrad","https://secure.oregonstate.edu/ap/cps/documents/view/11201","Unavailable syllabus"]
[null,"MTH","MTH",341,{"$f":"TRIM(C3101)&\" \"&TRIM(D3101)","v":"MTH 341"},"LINEAR ALGEBRA I","Undergrad","https://secure.oregonstate.edu/ap/cps/documents/view/125986","No Sustainability Content"]
[null,"MTH","MTH",342,{"$f":"TRIM(C3102)&\" \"&TRIM(D3102)","v":"MTH 342"},"LINEAR ALGEBRA II","Undergrad","https://secure.oregonstate.edu/ap/cps/documents/view/126255","No Sustainability Content"]
[null,"MTH","MTH",343,"MTH 343","INTRODUCTION TO MODERN ALGEBRA","Undergrad","https://secure.oregonstate.edu/ap/cps/documents/view/112186","No Sustainability Content"]
[null,"MTH","MTH",355,"MTH 355","DISCRETE MATHEMATICS","Undergrad","https://secure.oregonstate.edu/ap/cps/documents/view/117975","No Sustainability Content"]
[null,"MTH","MTH",390,{"$f":"TRIM(C3105)&\" \"&TRIM(D3105)","v":"MTH 390"},"FOUNDATIONS OF ELEMENTARY MATH","Undergrad","https://secure.oregonstate.edu/ap/cps/documents/view/129667","No Sustainability Content"]
[null,"MTH","MTH",419,{"$f":"TRIM(C3106)&\" \"&TRIM(D3106)","v":"MTH 419"},"MULTIVARIABLE ADV CALCULUS","Undergrad","https://secure.oregonstate.edu/ap/cps/documents/view/129383","No Sustainability Content"]
[null,"MTH","MTH",420,"MTH 420","MODELS METHODS APPLIED MATH","Undergrad","https://catalog.oregonstate.edu/search/?P=MTH%20420","No Sustainability Content"]
[null,"MTH","MTH",427,"MTH 427","INTRO TO MATHEMATICAL BIOLOGY","Undergrad","https://catalog.oregonstate.edu/search/?P=MTH%20427","No Sustainability Content"]
[null,"MTH","MTH",428,"MTH 428","MATH BIO: STOCHASTIC ELEMENTS","Undergrad","https://catalog.oregonstate.edu/search/?P=MTH%20428","No Sustainability Content"]
[null,"MTH","MTH",430,"MTH 430","METRIC SPACES AND TOPOLOGY","Undergrad","https://secure.oregonstate.edu/ap/cps/documents/view/114593","No Sustainability Content"]
[null,"MTH","MTH",434,"MTH 434","INTRO TO DIFFERENTIAL GEOMETRY","Undergrad","https://secure.oregonstate.edu/ap/cps/documents/view/116531","No Sustainability Content"]
[null,"MTH","MTH",437,"MTH 437","GENERAL RELATIVITY. (3 Credits)","Undergrad","https://catalog.oregonstate.edu/search/?P=MTH%20437","No Sustainability Content"]
[null,"MTH","MTH",440,"MTH 440","COMPUTATIONAL NUMBER THEORY","Undergrad","https://catalog.oregonstate.edu/search/?P=MTH%20440","No Sustainability Content"]
[null,"MTH","MTH",441,"MTH 441","APPLIED & COMPUTATION ALGEBRA","Undergrad","https://secure.oregonstate.edu/ap/cps/documents/view/116360","No Sustainability Content"]
[null,"MTH","MTH",443,"MTH 443","ABSTRACT LINEAR ALGEBRA","Undergrad","https://catalog.oregonstate.edu/search/?P=MTH%20443","No Sustainability Content"]
[null,"MTH","MTH",452,"MTH 452","NUMERICAL SOLUTION ORDINARY DE","Undergrad","https://catalog.oregonstate.edu/search/?P=MTH%20452","No Sustainability Content"]
[null,"MTH","MTH",481,"MTH 481","APPLIED ORDINARY DIFF EQUATION","Undergrad","https://secure.oregonstate.edu/ap/cps/documents/view/116551","No Sustainability Content"]
[null,"MTH","MTH",482,"MTH 482","APPLIED PARTIAL DIFF EQUATIONS","Undergrad","https://catalog.oregonstate.edu/search/?P=MTH%20482","No Sustainability Content"]
[null,"MTH","MTH",483,"MTH 483","COMPLEX VARIABLES","Undergrad","https://catalog.oregonstate.edu/search/?P=MTH%20483","No Sustainability Content"]
[null,"MTH","MTH",520,"MTH 520","MODELS METHODS APPLIED MATH","Grad","https://catalog.oregonstate.edu/search/?P=MTH%20520","No Sustainability Content"]
[null,"MTH","MTH",524,"MTH 524","DYNAMICAL SYSTEMS THY & APPL","Grad","https://secure.oregonstate.edu/ap/cps/documents/view/8905","No Sustainability Content"]
[null,"MTH","MTH",525,"MTH 525","DYNAMICAL SYSTEMS THY & APPL","Grad","https://secure.oregonstate.edu/ap/cps/documents/view/9003","No Sustainability Content"]
[null,"MTH","MTH",527,"MTH 527","INTRO TO MATHEMATICAL BIOLOGY","Grad","https://catalog.oregonstate.edu/search/?P=MTH%20527","No Sustainability Content"]
[null,"MTH","MTH",528,"MTH 528","MATH BIO: STOCHASTIC ELEMENTS","Grad","https://catalog.oregonstate.edu/search/?P=MTH%20528","No Sustainability Content"]
[null,"MTH","MTH",531,"MTH 531","GEN TOPOLOGY & FUND GROUPS","Grad","https://secure.oregonstate.edu/ap/cps/documents/view/102110","No Sustainability Content"]
[null,"MTH","MTH",532,"MTH 532","GEN TOPOLOGY & FUND GROUPS","Grad","https://secure.oregonstate.edu/ap/cps/documents/view/102138","No Sustainability Content"]
[null,"MTH","MTH",534,"MTH 534","INTRO TO DIFFERENTIAL GEOMETRY","Grad","https://secure.oregonstate.edu/ap/cps/documents/view/116532","No Sustainability Content"]
[null,"MTH","MTH",537,"MTH 537","GENERAL RELATIVITY. (3 Credits)","Grad","https://catalog.oregonstate.edu/search/?P=MTH%20537","No Sustainability Content"]
[null,"MTH","MTH",540,"MTH 540","COMPUTATIONAL NUMBER THEORY","Grad","https://catalog.oregonstate.edu/search/?P=MTH%20540","No Sustainability Content"]
[null,"MTH","MTH",541,"MTH 541","APPLIED & COMPUTATION ALGEBRA","Grad","https://secure.oregonstate.edu/ap/cps/documents/view/116362","No Sustainability Content"]
[null,"MTH","MTH",543,"MTH 543","ABSTRACT LINEAR ALGEBRA","Grad","https://catalog.oregonstate.edu/search/?P=MTH%20543","No Sustainability Content"]
[null,"MTH","MTH",552,"MTH 552","NUMERICAL SOLUTION ORDINARY DE","Grad","https://catalog.oregonstate.edu/search/?P=MTH%20552","No Sustainability Content"]
[null,"MTH","MTH",581,"MTH 581","APPLIED ORDINARY DIFF EQUATION","Grad","https://secure.oregonstate.edu/ap/cps/documents/view/116552","No Sustainability Content"]
[null,"MTH","MTH",582,"MTH 582","APPLIED PARTIAL DIFF EQUATIONS","Grad","https://catalog.oregonstate.edu/search/?P=MTH%20582","No Sustainability Content"]
[null,"MTH","MTH",583,"MTH 583","COMPLEX VARIABLES","Grad","https://catalog.oregonstate.edu/search/?P=MTH%20583","No Sustainability Content"]
[null,"MTH","MTH",590,"MTH 590","TOPICS SECONDARY MATHEMATICS","Grad","https://secure.oregonstate.edu/ap/cps/documents/view/115455","No Sustainability Content"]
[null,"MTH","MTH",621,"MTH 621","PARTIAL DIFFERENTIAL EQUATIONS","Grad","https://secure.oregonstate.edu/ap/cps/documents/view/125750","No Sustainability Content"]
[null,"MTH","MTH",622,"MTH 622","PARTIAL DIFFERENTIAL EQUATIONS",{"$f":"IF(D3138>499,\"Grad\", \"Undergrad\")","v":"Grad"},"https://secure.oregonstate.edu/ap/cps/documents/view/125654","No Sustainability Content"]
[null,"MTH","MTH",623,{"$f":"TRIM(C3139)&\" \"&TRIM(D3139)","v":"MTH 623"},"PARTIAL DIFFERENTIAL EQUATIONS","Grad","https://secure.oregonstate.edu/ap/cps/documents/view/125780","No Sustainability Content"]
[null,"MTH","MTH",627,"MTH 627","ADVANCED PDES","Grad","https://secure.oregonstate.edu/ap/cps/documents/view/125782","No Sustainability Content"]
[null,"MTH","MTH",628,"MTH 628","ADVANCED PDES","Grad","https://secure.oregonstate.edu/ap/cps/documents/view/125784","No Sustainability Content"]
[null,"MTH","MTH",65,"MTH 65","ELEMENTARY ALGEBRA","Undergrad","https://catalog.oregonstate.edu/search/?P=MTH%2065","No Sustainability Content"]
[null,"MTH","MTH",654,{"$f":"TRIM(C3143)&\" \"&TRIM(D3143)","v":"MTH 654"},"NUMERICAL ANALYSIS","Grad","https://secure.oregonstate.edu/ap/cps/documents/view/125924","No Sustainability Content"]
[null,"MTH","MTH",655,{"$f":"TRIM(C3144)&\" \"&TRIM(D3144)","v":"MTH 655"},"NUMERICAL ANALYSIS","Grad","https://secure.oregonstate.edu/ap/cps/documents/view/125921","No Sustainability Content"]
[null,"MTH","MTH",656,{"$f":"TRIM(C3145)&\" \"&TRIM(D3145)","v":"MTH 656"},"NUMERICAL ANALYSIS","Grad","https://secure.oregonstate.edu/ap/cps/documents/view/125716","No Sustainability Content"]
[null,"MTH","MTH",95,{"$f":"TRIM(C3146)&\" \"&TRIM(D3146)","v":"MTH 95"},"INTERMEDIATE ALGEBRA","Undergrad","https://catalog.oregonstate.edu/search/?P=MTH%2095","No Sustainability Content"]
[null,"SAC","MUED",201,"MUED 201","VOCAL DICTION SEMINAR I: LATIN AND GERMAN. (1 Credit)","Undergrad","https://secure.oregonstate.edu/ap/cps/documents/view/132227","No Sustainability Content"]
[null,"SAC","MUED",202,"MUED 202","VOCAL DICTION SEMINAR II: ITALIAN AND FRENCH. (1 Credit)","Undergrad","https://secure.oregonstate.edu/ap/cps/documents/view/132228","No Sustainability Content"]
[null,"SAC","MUED",275,"MUED 275","PROFESSIONAL SEMINAR IN MUSIC EDUCATION I. (1 Credit)","Undergrad","https://secure.oregonstate.edu/ap/cps/documents/view/132681","No Sustainability Content"]
[null,"SAC","MUED",276,"MUED 276","PROFESSIONAL SEMINAR IN MUSIC EDUCATION II. (1 Credit)","Undergrad","https://secure.oregonstate.edu/ap/cps/documents/view/132682 ","No Sustainability Content"]
[null,"SAC","MUED",277,{"$f":"TRIM(C3151)&\" \"&TRIM(D3151)","v":"MUED 277"},"PEDAGOGIC TECHNIQUES","Undergrad","https://secure.oregonstate.edu/ap/cps/documents/view/131316","No Sustainability Content"]
[null,"SAC","MUED",350,"MUED 350","JAZZ PEDAGOGY. (1 Credit)","Undergrad","https://secure.oregonstate.edu/ap/cps/documents/view/131283","No Sustainability Content"]
[null,"SAC","MUED",353,"MUED 353","MUSIC ED IN PUBLIC SCHOOLS","Undergrad","https://secure.oregonstate.edu/ap/cps/documents/view/118752","No Sustainability Content"]
[null,"SAC","MUED",375,"MUED 375","PROFESSIONAL SEMINAR IN MUSIC EDUCATION III. (1 Credit)","Undergrad","https://secure.oregonstate.edu/ap/cps/documents/view/132230","No Sustainability Content"]
[null,"SAC","MUED",376,"MUED 376","PROFESSIONAL SEMINAR IN MUSIC EDUCATION IV. (1 Credit)","Undergrad","https://secure.oregonstate.edu/ap/cps/documents/view/132229","No Sustainability Content"]
[null,"SAC","MUED",391,"MUED 391","SECONDARY GENERAL MUSIC FOUNDATIONS. (3 Credits)","Undergrad","https://secure.oregonstate.edu/ap/cps/documents/view/131286","No Sustainability Content"]
[null,"SAC","MUED",392,"MUED 392","SEMINAR IN SECONDARY GENERAL MUSIC. (1 Credit)","Undergrad","https://secure.oregonstate.edu/ap/cps/documents/view/131367","No Sustainability Content"]
[null,"SAC","MUED",410,"MUED 410","INTERNSHIP/STUDENT TEACHING. (10 Credits)","Undergrad","https://secure.oregonstate.edu/ap/cps/documents/view/131308","No Sustainability Content"]
[null,"SAC","MUED",450,"MUED 450","SURVEY OF WIND LITERATURE. (1 Credit)","Undergrad","https://secure.oregonstate.edu/ap/cps/documents/view/131303","No Sustainability Content"]
[null,"SAC","MUED",460,"MUED 460","PSYCHOLOGY OF MUSIC. (3 Credits)","Undergrad","https://catalog.oregonstate.edu/search/?P=MUED%20460","No Sustainability Content"]
[null,"SAC","MUED",469,"MUED 469","MARCHING BAND TECHNIQUES LABORATORY. (1 Credit)","Undergrad","https://secure.oregonstate.edu/ap/cps/documents/view/131302","No Sustainability Content"]
[null,"SAC","MUED",470,"MUED 470","MTHDS & MATERIALS PUB SCH BAND","Undergrad","https://catalog.oregonstate.edu/search/?P=MUED%20470","No Sustainability Content"]
[null,"SAC","MUED",471,"MUED 471","INVESTIGATING MUSICAL CULTURES. (3 Credits)","Undergrad","https://catalog.oregonstate.edu/search/?P=MUED%20471","No Sustainability Content"]
[null,"SAC","MUED",473,"MUED 473","METHODS FOR TEACH ELEM MUSIC","Undergrad","https://catalog.oregonstate.edu/search/?P=MUED%20473","No Sustainability Content"]
[null,"SAC","MUED",474,"MUED 474","ELEMENTARY APPROACHES SEMINAR I. (1 Credit)","Undergrad","https://secure.oregonstate.edu/ap/cps/documents/view/131312","No Sustainability Content"]
[null,"SAC","MUED",475,"MUED 475","ELEMENTARY APPROACHES SEMINAR II. (1 Credit)","Undergrad","https://secure.oregonstate.edu/ap/cps/documents/view/131285","No Sustainability Content"]
[null,"SAC","MUED",480,"MUED 480","CLASSROOM CHORAL METHODS. (3 Credits)","Undergrad","https://secure.oregonstate.edu/ap/cps/documents/view/131922 ","No Sustainability Content"]
[null,"SAC","MUED",560,"MUED 560","PSYCHOLOGY OF MUSIC. (3 Credits)","Grad","https://catalog.oregonstate.edu/search/?P=MUED%20560","No Sustainability Content"]
[null,"SAC","MUED",570,"MUED 570","METHODS AND MATERIALS FOR THE PUBLIC SCHOOL WIND BAND. (3 Credits)","Grad","https://catalog.oregonstate.edu/search/?P=MUED%20570","No Sustainability Content"]
[null,"SAC","MUED",571,"MUED 571","INVESTIGATING MUSICAL CULTURES. (3 Credits)","Grad","https://catalog.oregonstate.edu/search/?P=MUED%20571","No Sustainability Content"]
[null,"SAC","MUED",573,"MUED 573","METHODS FOR TEACH ELEM MUSIC","Grad","https://catalog.oregonstate.edu/search/?P=MUED%20573","No Sustainability Content"]
[null,"SAC","MUP",196,"MUP 196","INDIVIDUAL LESSONS: GUITAR. (1-2 Credits)","Undergrad","https://secure.oregonstate.edu/ap/cps/documents/view/132648","No Sustainability Content"]
[null,"SAC","MUP",296,"MUP 296","INDIVIDUAL LESSONS: GUITAR. (1-2 Credits)","Undergrad","https://secure.oregonstate.edu/ap/cps/documents/view/132600","No Sustainability Content"]
[null,"SAC","MUP",396,"MUP 396","INDIVIDUAL LESSONS: GUITAR. (1-2 Credits)","Undergrad","https://secure.oregonstate.edu/ap/cps/documents/view/132601","No Sustainability Content"]
[null,"SAC","MUP",398,"MUP 398","JUNIOR RECITAL. (1 Credit)","Undergrad","https://secure.oregonstate.edu/ap/cps/documents/view/132941","No Sustainability Content"]
[null,"SAC","MUP",496,"MUP 496","INDIVIDUAL LESSONS: GUITAR. (1-2 Credits)","Undergrad","https://secure.oregonstate.edu/ap/cps/documents/view/132602","No Sustainability Content"]
[null,"SAC","MUP",498,"MUP 498","SENIOR RECITAL. (1 Credit)","Undergrad","https://secure.oregonstate.edu/ap/cps/documents/view/132942","No Sustainability Content"]
[null,"SAC","MUS",104,"MUS 104","SURVEY OF JAZZ","Undergrad","https://secure.oregonstate.edu/ap/cps/documents/view/7670","No Sustainability Content"]
[null,"SAC","MUS",111,"MUS 111","THE FUNDAMENTALS OF MUSIC TECHNOLOGY. (3 Credits)","Undergrad","https://secure.oregonstate.edu/ap/cps/documents/view/128339","No Sustainability Content"]
[null,"SAC","MUS",112,{"$f":"TRIM(C3180)&\" \"&TRIM(D3180)","v":"MUS 112"},"INTRODUCTION TO DIGITAL AUDIO","Undergrad","https://secure.oregonstate.edu/ap/cps/documents/view/129697","No Sustainability Content"]
[null,"SAC","MUS",113,{"$f":"TRIM(C3181)&\" \"&TRIM(D3181)","v":"MUS 113"},"AUDIO TECHNOLOGIES","Undergrad","https://secure.oregonstate.edu/ap/cps/documents/view/128545","No Sustainability Content"]
[null,"SAC","MUS",125,"MUS 125","LITERATURE & MATERIALS LAB I","Undergrad","https://secure.oregonstate.edu/ap/cps/documents/view/4736","No Sustainability Content"]
[null,"SAC","MUS",126,"MUS 126","LITERATURE & MATERIALS LAB II","Undergrad","https://secure.oregonstate.edu/ap/cps/documents/view/4735","No Sustainability Content"]
[null,"SAC","MUS",152,"MUS 152","RHYTHM AND BEAVS PEP BAND","Undergrad","https://secure.oregonstate.edu/ap/cps/documents/view/8546","No Sustainability Content"]
[null,"SAC","MUS",162,"MUS 162","CHAMBER ENSEMBLE: GUITAR. (1 Credit)","Undergrad","https://secure.oregonstate.edu/ap/cps/documents/view/131677","No Sustainability Content"]
[null,"SAC","MUS",171,{"$f":"TRIM(C3186)&\" \"&TRIM(D3186)","v":"MUS 171"},"GROUP LESSONS: PIANO I","Undergrad","https://secure.oregonstate.edu/ap/cps/documents/view/126637","No Sustainability Content"]
[null,"SAC","MUS",172,{"$f":"TRIM(C3187)&\" \"&TRIM(D3187)","v":"MUS 172"},"GROUP PIANO II","Undergrad","https://secure.oregonstate.edu/ap/cps/documents/view/127060","No Sustainability Content"]
[null,"SAC","MUS",173,{"$f":"TRIM(C3188)&\" \"&TRIM(D3188)","v":"MUS 173"},"GROUP PIANO III","Undergrad","https://secure.oregonstate.edu/ap/cps/documents/view/127062","No Sustainability Content"]
[null,"SAC","MUS",186,"MUS 186","GROUP GUITAR","Undergrad","https://secure.oregonstate.edu/ap/cps/documents/view/4734","No Sustainability Content"]
[null,"SAC","MUS",187,"MUS 187","GROUP GUITAR II","Undergrad","https://secure.oregonstate.edu/ap/cps/documents/view/7614","No Sustainability Content"]
[null,"SAC","MUS",251,"MUS 251","INTRO TO ARTS ENTREPRENEURSHIP. (3 Credits)","Undergrad","https://secure.oregonstate.edu/ap/cps/documents/view/129989","No Sustainability Content"]
[null,"SAC","MUS",271,"MUS 271","GROUP PIANO IV. (1 Credit)","Undergrad","https://secure.oregonstate.edu/ap/cps/documents/view/127063","No Sustainability Content"]
[null,"SAC","MUS",272,{"$f":"TRIM(C3193)&\" \"&TRIM(D3193)","v":"MUS 272"},"GROUP PIANO V","Undergrad","https://secure.oregonstate.edu/ap/cps/documents/view/127064","No Sustainability Content"]
[null,"SAC","MUS",301,"MUS 301","SOLO VOCAL REPERTOIRE: ENGLISH. (2 Credits)","Undergrad","https://secure.oregonstate.edu/ap/cps/documents/view/132800","No Sustainability Content"]
[null,"SAC","MUS",302,"MUS 302","SOLO VOCAL REPERTOIRE: ITALIAN. (2 Credits)","Undergrad","https://secure.oregonstate.edu/ap/cps/documents/view/132809","No Sustainability Content"]
[null,"SAC","MUS",303,"MUS 303","SOLO VOCAL REPERTOIRE: GERMAN. (2 Credits)","Undergrad","https://secure.oregonstate.edu/ap/cps/documents/view/132825","No Sustainability Content"]
[null,"SAC","MUS",304,"MUS 304","SOLO VOCAL REPERTOIRE: FRENCH. (2 Credits)","Undergrad","https://secure.oregonstate.edu/ap/cps/documents/view/132826","No Sustainability Content"]
[null,"SAC","MUS",309,{"$f":"TRIM(C3198)&\" \"&TRIM(D3198)","v":"MUS 309"},"*WOMEN IN WESTERN MUSIC","Undergrad","https://secure.oregonstate.edu/ap/cps/documents/view/129111","No Sustainability Content"]
[null,"SAC","MUS",311,"MUS 311","MIDI SYSTEMS AND APPLICATIONS. (3 Credits)","Undergrad","https://secure.oregonstate.edu/ap/cps/documents/view/128581","No Sustainability Content"]
[null,"SAC","MUS",313,"MUS 313","SOUND SYNTHESIS. (3 Credits)","Undergrad","https://secure.oregonstate.edu/ap/cps/documents/view/129515","No Sustainability Content"]
[null,"SAC","MUS",330,"MUS 330","ALEXANDER TECHNIQUE FOR MUSICIANS. (1 Credit)","Undergrad","https://secure.oregonstate.edu/ap/cps/documents/view/125116","No Sustainability Content"]
[null,"SAC","MUS",341,"MUS 341","VOCAL PEDAGOGY I. (2 Credits)",{"$f":"IF(D3202>499,\"Grad\", \"Undergrad\")","v":"Undergrad"},"https://secure.oregonstate.edu/ap/cps/documents/view/133876","No Sustainability Content"]
[null,"SAC","MUS",352,"MUS 352","RHYTHM AND BEAVS PEP BAND","Undergrad","https://secure.oregonstate.edu/ap/cps/documents/view/8548","No Sustainability Content"]
[null,"SAC","MUS",362,"MUS 362","CHAMBER ENSEMBLE: GUITAR. (1 Credit)","Undergrad","https://secure.oregonstate.edu/ap/cps/documents/view/132603","No Sustainability Content"]
[null,"SAC","MUS",371,{"$f":"TRIM(C3205)&\" \"&TRIM(D3205)","v":"MUS 371"},"GROUP PIANO VII","Undergrad","https://secure.oregonstate.edu/ap/cps/documents/view/127067","No Sustainability Content"]
[null,"SAC","MUS",372,{"$f":"TRIM(C3206)&\" \"&TRIM(D3206)","v":"MUS 372"},"GROUP PIANO VIII","Undergrad","https://secure.oregonstate.edu/ap/cps/documents/view/127068","No Sustainability Content"]
[null,"SAC","MUS",373,{"$f":"TRIM(C3207)&\" \"&TRIM(D3207)","v":"MUS 373"},"GROUP PIANO IX","Undergrad","https://secure.oregonstate.edu/ap/cps/documents/view/127069","No Sustainability Content"]
[null,"SAC","MUS",375,"MUS 375","INTRODUCTION TO PIANO TUNING. (3 Credits)","Undergrad","https://secure.oregonstate.edu/ap/cps/documents/view/125800","No Sustainability Content"]
[null,"SAC","MUS",378,"MUS 378","MUSICAL WELLNESS FOR PIANISTS. (3 Credits)","Undergrad","https://secure.oregonstate.edu/ap/cps/documents/view/127475","No Sustainability Content"]
[null,"SAC","MUS",400,{"$f":"TRIM(C3210)&\" \"&TRIM(D3210)","v":"MUS 400"},"^STUDY IN WRITING ABOUT MUSIC","Undergrad","https://secure.oregonstate.edu/ap/cps/documents/view/128537","No Sustainability Content"]
[null,"SAC","MUS",409,"MUS 409","PIANO PEDAGOGY PRACTICUM. (2 Credits)","Undergrad","https://secure.oregonstate.edu/ap/cps/documents/view/127120","No Sustainability Content"]
[null,"SAC","MUS",444,"MUS 444","FOUNDATIONS OF PIANO PEDAGOGY. (3 Credits)","Undergrad","https://secure.oregonstate.edu/ap/cps/documents/view/117219","No Sustainability Content"]
[null,"SAC","MUS",445,"MUS 445","PIANO PEDAGOGY I: BEGINNING AND ELEMENTARY STUDENTS. (3 Credits)","Undergrad","https://secure.oregonstate.edu/ap/cps/documents/view/126793","No Sustainability Content"]
[null,"SAC","MUS",446,"MUS 446","PIANO PEDAGOGY II. (3 Credits)","Undergrad","https://secure.oregonstate.edu/ap/cps/documents/view/126941","No Sustainability Content"]
[null,"SAC","MUS",447,"MUS 447","PIANO PEDAGOGY III. (3 Credits)","Undergrad","https://secure.oregonstate.edu/ap/cps/documents/view/126942","No Sustainability Content"]
[null,"SAC","MUS",451,"MUS 451","INTRO TO ARTS ENTREPRENEURSHIP","Undergrad","https://secure.oregonstate.edu/ap/cps/documents/view/119583","No Sustainability Content"]
[null,"SAC","MUS",481,"MUS 481","PIANO LITERATURE I: 18TH THROUGH EARLY 19TH CENTURIES. (3 Credits)","Undergrad","https://secure.oregonstate.edu/ap/cps/documents/view/125251","No Sustainability Content"]
[null,"SAC","MUS",482,"MUS 482","PIANO LITERATURE II: 19TH AND 20TH CENTURIES. (3 Credits)","Undergrad","https://secure.oregonstate.edu/ap/cps/documents/view/125252","No Sustainability Content"]
[null,"SAC","MUS",485,"MUS 485","PIANO LITERATURE III: REPERTOIRE FOR TEACHING THE PIANO. (3 Credits)","Undergrad","https://secure.oregonstate.edu/ap/cps/documents/view/126836","No Sustainability Content"]
[null,"SAC","MUS",496,"MUS 496","SURROUND SOUND RECORDING AND MASTERING. (2 Credits)","Undergrad","https://secure.oregonstate.edu/ap/cps/documents/view/6931","No Sustainability Content"]
[null,"SNSE","NE",114,"NE 114","INTRODUCTION TO NUCLEAR ENGINEERING AND RADIATION HEALTH PHYSICS I","Undergrad","https://secure.oregonstate.edu/ap/cps/documents/view/113470","No Sustainability Content"]
[null,"SNSE","NE",115,"NE 115","INTRODUCTION TO NUCLEAR ENGINEERING AND RADIATION HEALTH PHYSICS II","Undergrad","https://secure.oregonstate.edu/ap/cps/documents/view/113485","No Sustainability Content"]
[null,"SNSE","NE",234,"NE 234","Nuclear and Radiation Physics I","Undergrad","https://secure.oregonstate.edu/ap/cps/documents/view/114054","No Sustainability Content"]
[null,"SNSE","NE",235,"NE 235","Nuclear and Radiation Physics II","Undergrad","https://secure.oregonstate.edu/ap/cps/documents/view/113999","No Sustainability Content"]
[null,"SNSE","NE",312,"NE 312","THERMODYNAMICS","Undergrad","https://secure.oregonstate.edu/ap/cps/documents/view/4407","No Sustainability Content"]
[null,"SNSE","NE",332,"NE 332","HEAT TRANSFER","Undergrad","https://secure.oregonstate.edu/ap/cps/documents/view/4408","No Sustainability Content"]
[null,"SNSE","NE",333,"NE 333","MATHEMATICAL METHODS FOR NUCLEAR \nENGINEERING AND RADIATION HEALTH PHYSICS\n","Undergrad","https://secure.oregonstate.edu/ap/cps/documents/view/100354","No Sustainability Content"]
[null,"SNSE","NE",435,"NE 435","RADIATION SHIELDING AND EXTERNAL DOSIMETRY ","Undergrad","https://secure.oregonstate.edu/ap/cps/documents/view/100204","No Sustainability Content"]
[null,"SNSE","NE",440,"NE 440","Nuclear Fuel Cycle and Waste Management","Undergrad","https://secure.oregonstate.edu/ap/cps/documents/view/6904","No Sustainability Content"]
[null,"SNSE","NE",451,"NE 451","NEUTRONIC ANALYSIS I","Undergrad","https://secure.oregonstate.edu/ap/cps/documents/view/104420","No Sustainability Content"]
[null,"SNSE","NE",452,"NE 452","NEUTRONIC ANALYSIS","Undergrad","https://secure.oregonstate.edu/ap/cps/documents/view/98950","No Sustainability Content"]
[null,"SNSE","NE",455,"NE 455","TRIGA® Reactor Operator Training I","Undergrad","https://secure.oregonstate.edu/ap/cps/documents/view/105463","No Sustainability Content"]
[null,"SNSE","NE",456,"NE 456","TRIGA® Reactor Operator Training II","Undergrad","https://secure.oregonstate.edu/ap/cps/documents/view/105272","No Sustainability Content"]
[null,"SNSE","NE",457,"NE 457","Nuclear Reactor Laboratory","Undergrad","https://secure.oregonstate.edu/ap/cps/documents/view/94790","No Sustainability Content"]
[null,"SNSE","NE",467,"NE 467","Nuclear Reactor Laboratory","Undergrad","https://secure.oregonstate.edu/ap/cps/documents/view/94790","No Sustainability Content"]
[null,"SNSE","NE",468,"NE 468","Nuclear Reactor Safety","Undergrad","https://secure.oregonstate.edu/ap/cps/documents/view/105066","No Sustainability Content"]
[null,"SNSE","NE",473,"NE 473","Nuclear Reactor Systems Analysis","Undergrad","https://secure.oregonstate.edu/ap/cps/documents/view/119386","No Sustainability Content"]
[null,"SNSE","NE",474,"NE 474","NUCLEAR SYSTEMS DESIGN I & II","Undergrad","https://secure.oregonstate.edu/ap/cps/documents/view/120509","No Sustainability Content"]
[null,"SNSE","NE",475,"NE 475","NUCLEAR SYSTEMS DESIGN I & II","Undergrad","https://secure.oregonstate.edu/ap/cps/documents/view/95140 \nhttps://secure.oregonstate.edu/ap/cps/documents/view/95150 \nhttps://secure.oregonstate.edu/ap/cps/documents/view/95160","No Sustainability Content"]
[null,"SNSE","NE",481,"NE 481","INTRODUCTION TO NUCLEAR ENGINEERING AND RADIATION HEALTH PHYSICS I","Undergrad","https://secure.oregonstate.edu/ap/cps/documents/view/8829","No Sustainability Content"]
[null,"SNSE","NE",516,"NE 516","RADIOCHEMISTRY","Grad","https://secure.oregonstate.edu/ap/cps/documents/view/99010","No Sustainability Content"]
[null,"SNSE","NE",519,"NE 519","RADIOCHEMICAL ANALYSIS ","Grad","https://secure.oregonstate.edu/ap/cps/documents/view/118315","No Sustainability Content"]
[null,"SNSE","NE",526,"NE 526","Numerical Methods for Engineering Analysis","Grad","https://secure.oregonstate.edu/ap/cps/documents/view/10244","No Sustainability Content"]
[null,"SNSE","NE",535,"NE 535","RADIATION SHIELDING AND EXTERNAL DOSIMETRY ","Grad","https://secure.oregonstate.edu/ap/cps/documents/view/100204","No Sustainability Content"]
[null,"SNSE","NE",536,"NE 536","Advanced Radiation Detection and Measurement","Grad","https://secure.oregonstate.edu/ap/cps/documents/view/100299","No Sustainability Content"]
[null,"SNSE","NE",537,"NE 537","Digital Radiation Measurement and Spectroscopy","Grad","https://secure.oregonstate.edu/ap/cps/documents/view/100240","No Sustainability Content"]
[null,"SNSE","NE",540,"NE 540","Nuclear Fuel Cycle and Waste Management","Grad","https://secure.oregonstate.edu/ap/cps/documents/view/6904","No Sustainability Content"]
[null,"SNSE","NE",551,"NE 551","NEUTRONIC ANALYSIS I","Grad","https://secure.oregonstate.edu/ap/cps/documents/view/104420","No Sustainability Content"]
[null,"SNSE","NE",552,"NE 552","NEUTRONIC ANALYSIS","Grad","https://secure.oregonstate.edu/ap/cps/documents/view/98950","No Sustainability Content"]
[null,"SNSE","NE",553,"NE 553","Advanced  Reactor Physics","Grad","https://secure.oregonstate.edu/ap/cps/documents/view/8806","No Sustainability Content"]
[null,"SNSE","NE",555,"NE 555","TRIGA® Reactor Operator Training I","Grad","https://secure.oregonstate.edu/ap/cps/documents/view/105463","No Sustainability Content"]
[null,"SNSE","NE",556,"NE 556","TRIGA® Reactor Operator Training II","Grad","https://secure.oregonstate.edu/ap/cps/documents/view/105272","No Sustainability Content"]
[null,"SNSE","NE",557,"NE 557","Nuclear Reactor Laboratory","Grad","https://secure.oregonstate.edu/ap/cps/documents/view/94790","No Sustainability Content"]
[null,"SNSE","NE",567,"NE 567","Nuclear Reactor Laboratory","Grad","https://secure.oregonstate.edu/ap/cps/documents/view/94970","No Sustainability Content"]
[null,"SNSE","NE",568,"NE 568","Nuclear Reactor Safety","Grad","https://secure.oregonstate.edu/ap/cps/documents/view/8958","No Sustainability Content"]
[null,"SNSE","NE",573,"NE 573","Nuclear Reactor Systems Analysis","Grad","https://secure.oregonstate.edu/ap/cps/documents/view/119386","No Sustainability Content"]
[null,"SNSE","NE",574,"NE 574","NUCLEAR SYSTEMS DESIGN I & II","Grad","https://secure.oregonstate.edu/ap/cps/documents/view/120509","No Sustainability Content"]
[null,"SNSE","NE",575,"NE 575","NUCLEAR SYSTEMS DESIGN I & II","Grad","https://secure.oregonstate.edu/ap/cps/documents/view/95140 \nhttps://secure.oregonstate.edu/ap/cps/documents/view/95150 \nhttps://secure.oregonstate.edu/ap/cps/documents/view/95160","No Sustainability Content"]
[null,"SNSE","NE",582,"NE 582","Applied Radiation Safety ","Grad","https://secure.oregonstate.edu/ap/cps/documents/view/100305","No Sustainability Content"]
[null,"SNSE","NE",654,"NE 654","Computational Particle Transport","Grad","https://secure.oregonstate.edu/ap/cps/documents/view/8625","No Sustainability Content"]
[null,"SAC","NMC",100,"NMC 100","*NEW MEDIA AND CULTURE","Undergrad","https://secure.oregonstate.edu/ap/cps/documents/view/125257","No Sustainability Content"]
[null,"SAC","NMC",101,"NMC 101","INTRO TO NEW MEDIA COMMUNICA","Undergrad","https://secure.oregonstate.edu/ap/cps/documents/view/10572\nhttps://secure.oregonstate.edu/ap/cps/documents/view/3244","No Sustainability Content"]
[null,"SAC","NMC",183,"NMC 183","INTRODUCTION TO MEDIA PRODUCTION. (3 Credits)","Undergrad","https://secure.oregonstate.edu/ap/cps/documents/view/4990","No Sustainability Content"]
[null,"SAC","NMC",240,"NMC 240","SURVEY OF SOCIAL MEDIA","Undergrad","https://secure.oregonstate.edu/ap/cps/documents/view/111873","No Sustainability Content"]
[null,"SAC","NMC",241,"NMC 241","APPLIED MEDIA AESTHETICS. (4 Credits)","Undergrad","https://secure.oregonstate.edu/ap/cps/documents/view/132689","No Sustainability Content"]
[null,"SAC","NMC",255,"NMC 255","INTRODUCTION TO SOUND DESIGN",{"$f":"IF(D3266>499,\"Grad\", \"Undergrad\")","v":"Undergrad"},"https://secure.oregonstate.edu/ap/cps/documents/view/113961","No Sustainability Content"]
[null,"SAC","NMC",260,"NMC 260","NEW MEDIA FUTURES","Undergrad","https://secure.oregonstate.edu/ap/cps/documents/view/121827","No Sustainability Content"]
[null,"SAC","NMC",280,"NMC 280","GLOBAL MEDIA","Undergrad","https://secure.oregonstate.edu/ap/cps/documents/view/119798","No Sustainability Content"]
[null,"SAC","NMC",305,"NMC 305","COPYEDITING. (3 Credits)","Undergrad","https://secure.oregonstate.edu/ap/cps/documents/view/110312","No Sustainability Content"]
[null,"SAC","NMC",306,"NMC 306","ART & CULTURE CONTENT CREATION","Undergrad","https://secure.oregonstate.edu/ap/cps/documents/view/119730","No Sustainability Content"]
[null,"SAC","NMC",311,"NMC 311","INTRO TO NONPROFIT MANAGEMENT","Undergrad","https://secure.oregonstate.edu/ap/cps/documents/view/120057","No Sustainability Content"]
[null,"SAC","NMC",320,"NMC 320","HISTORY OF TELECOMMUNICATIONS. (3 Credits)","Undergrad","https://secure.oregonstate.edu/ap/cps/documents/view/122126","No Sustainability Content"]
[null,"SAC","NMC",321,"NMC 321","HISTORY OF BROADCASTING. (3 Credits)","Undergrad","https://secure.oregonstate.edu/ap/cps/documents/view/123325","No Sustainability Content"]
[null,"SAC","NMC",322,{"$f":"TRIM(C3274)&\" \"&TRIM(D3274)","v":"NMC 322"},"LANDMARKS IN MEDIA CONTENT","Undergrad","https://secure.oregonstate.edu/ap/cps/documents/view/122106","No Sustainability Content"]
[null,"SAC","NMC",330,"NMC 330","THE MEANING OF VIDEO GAMES","Undergrad","https://secure.oregonstate.edu/ap/cps/documents/view/122108","No Sustainability Content"]
[null,"SAC","NMC",340,"NMC 340","SOCIAL MEDIA STRATEGY","Undergrad","https://secure.oregonstate.edu/ap/cps/documents/view/123324    ","No Sustainability Content"]
[null,"SAC","NMC",341,"NMC 341","MEDIA SPIN AND DECEPTION DETECTION. (3 Credits)","Undergrad","https://secure.oregonstate.edu/ap/cps/documents/view/133548","No Sustainability Content"]
[null,"SAC","NMC",349,"NMC 349","VIDEO ART","Undergrad","https://secure.oregonstate.edu/ap/cps/documents/view/118473","No Sustainability Content"]
[null,"SAC","NMC",355,"NMC 355","APPLIED SOUND DESIGN","Undergrad","https://secure.oregonstate.edu/ap/cps/documents/view/121762","No Sustainability Content"]
[null,"SAC","NMC",380,"NMC 380","PRE-PRODUCTION","Undergrad","https://secure.oregonstate.edu/ap/cps/documents/view/122727","No Sustainability Content"]
[null,"SAC","NMC",383,"NMC 383","FIELD PRODUCTION","Undergrad","https://secure.oregonstate.edu/ap/cps/documents/view/123322","No Sustainability Content"]
[null,"SAC","NMC",385,"NMC 385","2D MOTION DESIGN. (4 Credits)","Undergrad","https://secure.oregonstate.edu/ap/cps/documents/view/128754","No Sustainability Content"]
[null,"SAC","NMC",388,"NMC 388","SOCIAL MEDIA AND INTERPERSONAL RELATIONSHIPS. (3 Credits)","Undergrad","https://secure.oregonstate.edu/ap/cps/documents/view/124247","No Sustainability Content"]
[null,"SAC","NMC",418,"NMC 418","VIRAL CONTENT. (3 Credits)","Undergrad","https://secure.oregonstate.edu/ap/cps/documents/view/127649","No Sustainability Content"]
[null,"SAC","NMC",419,"NMC 419","REEFER MADNESS IN THE MEDIA","Undergrad","https://secure.oregonstate.edu/ap/cps/documents/view/119099","No Sustainability Content"]
[null,"SAC","NMC",421,"NMC 421","DIFFUSION OF INNOVATIONS","Undergrad","https://secure.oregonstate.edu/ap/cps/documents/view/122107","No Sustainability Content"]
[null,"SAC","NMC",425,"NMC 425","LATINOS IN THE MEDIA","Undergrad","https://secure.oregonstate.edu/ap/cps/documents/view/120253","No Sustainability Content"]
[null,"SAC","NMC",427,"NMC 427","*DIGITAL PORNOGRAPHY. (3 Credits)","Undergrad","https://secure.oregonstate.edu/ap/cps/documents/view/107800","No Sustainability Content"]
[null,"SAC","NMC",430,"NMC 430","MEDIA THEORY","Undergrad","https://secure.oregonstate.edu/ap/cps/documents/view/122104","No Sustainability Content"]
[null,"SAC","NMC",435,"NMC 435","MEDIA EFFECTS","Undergrad","https://secure.oregonstate.edu/ap/cps/documents/view/122305","No Sustainability Content"]
[null,"SAC","NMC",437,"NMC 437","NEW MEDIA AND SOCIETY","Undergrad","https://secure.oregonstate.edu/ap/cps/documents/view/122324","No Sustainability Content"]
[null,"SAC","NMC",440,"NMC 440","MEDIA MANAGEMENT","Undergrad","https://secure.oregonstate.edu/ap/cps/documents/view/122299","No Sustainability Content"]
[null,"SAC","NMC",470,"NMC 470","MEDIA LAW. (3 Credits)","Undergrad","https://secure.oregonstate.edu/ap/cps/documents/view/122322","No Sustainability Content"]
[null,"SAC","NMC",471,"NMC 471","TELECOMMUNICATIONS POLICY. (3 Credits)","Undergrad","https://secure.oregonstate.edu/ap/cps/documents/view/122295","No Sustainability Content"]
[null,"SAC","NMC",481,"NMC 481","POST PRODUCTION","Undergrad","https://secure.oregonstate.edu/ap/cps/documents/view/122207","No Sustainability Content"]
[null,"SAC","NMC",482,"NMC 482","DOCUMENTARY","Undergrad","https://secure.oregonstate.edu/ap/cps/documents/view/123380","No Sustainability Content"]
[null,"SAC","NMC",483,"NMC 483","NEW MEDIA 3-D","Undergrad","https://secure.oregonstate.edu/ap/cps/documents/view/122728","No Sustainability Content"]
[null,"SAC","NMC",490,"NMC 490","MEDIA ETHICS","Undergrad","https://secure.oregonstate.edu/ap/cps/documents/view/122505","No Sustainability Content"]
[null,"SAC","NMC",493,{"$f":"TRIM(C3299)&\" \"&TRIM(D3299)","v":"NMC 493"},"MEDIA AND POWER","Undergrad","https://secure.oregonstate.edu/ap/cps/documents/view/131013","No Sustainability Content"]
[null,"SAC","NMC",498,"NMC 498","ADV COLLABORATIVE EXPERIENCE","Undergrad","https://secure.oregonstate.edu/ap/cps/documents/view/124847","No Sustainability Content"]
[null,"NS","NS",112,"NS 112","U.S. NAVAL HISTORY I","Undergrad","https://secure.oregonstate.edu/ap/cps/documents/view/99794","No Sustainability Content"]
[null,"NS","NS",113,"NS 113","U.S. NAVAL HISTORY II","Undergrad","https://secure.oregonstate.edu/ap/cps/documents/view/99795","No Sustainability Content"]
[null,"NS","NS",211,"NS 211","LEADERSHIP & MANAGEMENT","Undergrad","https://secure.oregonstate.edu/ap/cps/documents/view/109840","No Sustainability Content"]
[null,"NS","NS",212,"NS 212","NAVAL ENGINEERING","Undergrad","https://secure.oregonstate.edu/ap/cps/documents/view/109662","No Sustainability Content"]
[null,"NS","NS",311,"NS 311","NAVIGATION","Undergrad","https://secure.oregonstate.edu/ap/cps/documents/view/109663","No Sustainability Content"]
[null,"NS","NS",313,"NS 313","NAVAL OPERATIONS & SEAMANSHIP","Undergrad","https://secure.oregonstate.edu/ap/cps/documents/view/7622","No Sustainability Content"]
[null,"NS","NS",321,"NS 321","EVOLUTION OF WARFARE I","Undergrad","https://secure.oregonstate.edu/ap/cps/documents/view/7640","No Sustainability Content"]
[null,"NS","NS",322,"NS 322","EVOLUTION OF WARFARE II","Undergrad","https://secure.oregonstate.edu/ap/cps/documents/view/7642","No Sustainability Content"]
[null,"NS","NS",411,"NS 411","NAVAL WEAPONS SYSTEMS","Undergrad","https://secure.oregonstate.edu/ap/cps/documents/view/109661","No Sustainability Content"]
[null,"NS","NS",413,"NS 413","LEADERSHIP AND ETHICS","Undergrad","https://secure.oregonstate.edu/ap/cps/documents/view/3269","No Sustainability Content"]
[null,"NS","NS",421,"NS 421","FUNDAMENTALS OF MANEUVER WARFARE I. (3 Credits)","Undergrad","https://secure.oregonstate.edu/ap/cps/documents/view/129082","No Sustainability Content"]
[null,"NS","NS",422,"NS 422","FUNDAMENTALS OF MANEUVER WARFARE II. (3 Credits)","Undergrad","https://secure.oregonstate.edu/ap/cps/documents/view/129092","No Sustainability Content"]
[null,"SNSE","NSE",233,{"$f":"TRIM(C3313)&\" \"&TRIM(D3313)","v":"NSE 233"},"MATHEMATICAL METHODS FOR NSE","Undergrad","https://secure.oregonstate.edu/ap/cps/documents/view/127399","No Sustainability Content"]
[null,"SNSE","NSE",522,"NSE 522","NUCLEAR SECURITY SCIENCE. (4 Credits)","Grad","https://secure.oregonstate.edu/ap/cps/documents/view/132452","No Sustainability Content"]
[null,"SNSE","NSE",525,"NSE 525","NUCLEAR SECURITY SYSTEM DESIGN. (3 Credits)","Grad","https://secure.oregonstate.edu/ap/cps/documents/view/132128","No Sustainability Content"]
[null,"SNSE","NSE",533,"NSE 533","DETECTION OF SPECIAL NUCLEAR MATERIALS. (3 Credits)","Grad","https://secure.oregonstate.edu/ap/cps/documents/view/132924","No Sustainability Content"]
[null,"BPHS","NUR",411,"NUR 411","INFORMATICS IN NURSING. (1 Credit)","Undergrad","https://secure.oregonstate.edu/ap/cps/documents/view/133808","No Sustainability Content"]
[null,"BPHS","NUR",412,"NUR 412","TRANSITION TO PROFESSIONAL NURSING. (3 Credits)","Undergrad","https://secure.oregonstate.edu/ap/cps/documents/view/133809","No Sustainability Content"]
[null,"BPHS","NUR",414,"NUR 414","NURSING EPIDEMIOLOGY. (3 Credits)","Undergrad","https://secure.oregonstate.edu/ap/cps/documents/view/133811","No Sustainability Content"]
[null,"BPHS","NUR",419,"NUR 419","HEALTH CARE QUALITY IN NURSING PRACTICE. (2 Credits)","Undergrad","https://secure.oregonstate.edu/ap/cps/documents/view/133817","No Sustainability Content"]
[null,"BPHS","NUR",421,"NUR 421","AGING AND END OF LIFE ISSUES IN NURSING. (3 Credits)","Undergrad","https://secure.oregonstate.edu/ap/cps/documents/view/133820","No Sustainability Content"]
[null,"BPHS","NUR",423,"NUR 423","NURSING LEADERSHIP. (4 Credits)","Undergrad","https://secure.oregonstate.edu/ap/cps/documents/view/133822","No Sustainability Content"]
[null,"BPHS","NUTR",104,"NUTR 104","ORIENT TO THE NUTRITION MAJOR","Undergrad","https://secure.oregonstate.edu/ap/cps/documents/view/117480","No Sustainability Content"]
[null,"BPHS","NUTR",225,"NUTR 225","GENERAL HUMAN NUTRITION","Undergrad","https://secure.oregonstate.edu/ap/cps/documents/view/9929","No Sustainability Content"]
[null,"BPHS","NUTR",240,"NUTR 240","HUMAN NUTRITION","Undergrad","https://secure.oregonstate.edu/ap/cps/documents/view/9679","No Sustainability Content"]
[null,"BPHS","NUTR",241,"NUTR 241","APPS IN HUMAN NUTRITION","Undergrad","https://secure.oregonstate.edu/ap/cps/documents/view/5186","No Sustainability Content"]
[null,"BPHS","NUTR",312,"NUTR 312","*ISSUES IN NUTRITION & HEALTH","Undergrad","https://secure.oregonstate.edu/ap/cps/documents/view/7832","No Sustainability Content"]
[null,"BPHS","NUTR",341,"NUTR 341","NUTRITION FOR EXERCISE","Undergrad","https://secure.oregonstate.edu/ap/cps/documents/view/7586","No Sustainability Content"]
[null,"BPHS","NUTR",417,"NUTR 417","HUMAN NUTRITION SCIENCE","Undergrad","https://catalog.oregonstate.edu/search/?P=NUTR%20417","No Sustainability Content"]
[null,"BPHS","NUTR",418,"NUTR 418","HUMAN NUTRITION SCIENCE",{"$f":"IF(D3330>499,\"Grad\", \"Undergrad\")","v":"Undergrad"},"https://catalog.oregonstate.edu/search/?P=NUTR%20418","No Sustainability Content"]
[null,"BPHS","NUTR",432,"NUTR 432","MEDICAL NUTRITION THERAPY 3","Undergrad","https://catalog.oregonstate.edu/search/?P=NUTR%20432","No Sustainability Content"]
[null,"BPHS","NUTR",439,"NUTR 439","^COMMUNICATIONS IN DIETETICS","Undergrad","https://secure.oregonstate.edu/ap/cps/documents/view/117254","No Sustainability Content"]
[null,"BPHS","NUTR",447,"NUTR 447","MANAGEMENT OF FOOD SYSTEMS LAB","Undergrad","https://secure.oregonstate.edu/ap/cps/documents/view/9620","No Sustainability Content"]
[null,"BPHS","NUTR",517,"NUTR 517","HUMAN NUTRITION SCIENCE","Grad","https://catalog.oregonstate.edu/search/?P=NUTR%20517","No Sustainability Content"]
[null,"BPHS","NUTR",518,"NUTR 518","HUMAN NUTRITION SCIENCE","Grad","https://catalog.oregonstate.edu/search/?P=NUTR%20518","No Sustainability Content"]
[null,"BPHS","NUTR",532,"NUTR 532","MEDICAL NUTRITION THERAPY 3","Grad","https://catalog.oregonstate.edu/search/?P=NUTR%20532","No Sustainability Content"]
[null,"BPHS","NUTR",535,"NUTR 535","MACRONUTRIENT & ENERGY METABOL","Grad","https://secure.oregonstate.edu/ap/cps/documents/view/4025","No Sustainability Content"]
[null,"BPHS","NUTR",617,"NUTR 617","METABOLIC INTERRELATSHIPS IN N","Grad","https://secure.oregonstate.edu/ap/cps/documents/view/117270","No Sustainability Content"]
[null,"BPHS","NUTR",618,"NUTR 618","ADV MICRONUTRIENT METABOLISM","Grad","https://secure.oregonstate.edu/ap/cps/documents/view/117711","No Sustainability Content"]
[null,"OC","OC",331,"OC 331","Introduction to Oceanography","Undergrad","https://secure.oregonstate.edu/ap/cps/documents/view/110370","No Sustainability Content"]
[null,"OC","OC",440,{"$f":"TRIM(C3341)&\" \"&TRIM(D3341)","v":"OC 440"},"BIOLOGICAL OCEANOGRAPHY","Undergrad","https://secure.oregonstate.edu/ap/cps/documents/view/126629","No Sustainability Content"]
[null,"OC","OC",442,"OC 442","Estuarine Ecology and Biogeochemistry","Undergrad","https://secure.oregonstate.edu/ap/cps/documents/view/2025","No Sustainability Content"]
[null,"OC","OC",450,{"$f":"TRIM(C3343)&\" \"&TRIM(D3343)","v":"OC 450"},"CHEMICAL OCEANOGRAPHY","Undergrad","https://secure.oregonstate.edu/ap/cps/documents/view/129462","Unavailable syllabus"]
[null,"OC","OC",512,"OC 512","BASIC MATLAB FOR ENVIRONMENTAL SCIENTISTS AND ENGINEERS. (2 Credits)","Grad","https://secure.oregonstate.edu/ap/cps/documents/view/114376","No Sustainability Content"]
[null,"OC","OC",515,"OC 515","OREGON COAST MATH CAMP","Grad","https://secure.oregonstate.edu/ap/cps/documents/view/114194","No Sustainability Content"]
[null,"OC","OC",542,"OC 542","Estuarine Ecology and Biogeochemistry","Grad","https://secure.oregonstate.edu/ap/cps/documents/view/2025","No Sustainability Content"]
[null,"OC","OC",561,"OC 561","IGNEOUS & TECTONIC OCEAN PROC","Grad","https://secure.oregonstate.edu/ap/cps/documents/view/4675","No Sustainability Content"]
[null,"OC","OC",630,{"$f":"TRIM(C3348)&\" \"&TRIM(D3348)","v":"OC 630"},"OCEAN WAVE MECHANICS I","Grad","https://secure.oregonstate.edu/ap/cps/documents/view/7601","No Sustainability Content"]
[null,"OC","OC",631,"OC 631","OCEAN WAVE MECHANICS II","Grad","https://secure.oregonstate.edu/ap/cps/documents/view/7598","No Sustainability Content"]
[null,"OC","OC",634,"OC 634","LONG WAVE MECHANICS. (3 Credits)","Grad","https://secure.oregonstate.edu/ap/cps/documents/view/7753","No Sustainability Content"]
[null,"OC","OC",635,"OC 635","APPLIED MODELING OF NEARSHORE PROCESSES. (4 Credits)","Grad","https://secure.oregonstate.edu/ap/cps/documents/view/8215","Unavailable syllabus"]
[null,"OC","OC",664,"OC 664","NEARSHORE SEDIMENT TRANSPORT","Grad","https://secure.oregonstate.edu/ap/cps/documents/view/106191","No Sustainability Content"]
[null,"OC","OC",665,"OC 665","Numerical and Statistical Techniques in Marine Geology","Grad","https://secure.oregonstate.edu/ap/cps/documents/view/3783","No Sustainability Content"]
[null,"OC","OC",678,"OC 678","OCEAN REMOTE SENSING","Grad","https://secure.oregonstate.edu/ap/cps/documents/view/10257","No Sustainability Content"]
[null,"OC","OC",680,"OC 680","STABILITY/GEOPHYS FLUID FLOWS","Grad","https://secure.oregonstate.edu/ap/cps/documents/view/105402","No Sustainability Content"]
[null,"OC","OC",682,"OC 682","DATA ANALY IN TIME/SPACE DOMAI","Grad","https://secure.oregonstate.edu/ap/cps/documents/view/7336","No Sustainability Content"]
[null,"OC","OC",683,"OC 683","DATA ANALYSIS IN THE FREQUENCY AND WAVE NUMBER DOMAINS. (4 Credits)","Grad","https://secure.oregonstate.edu/ap/cps/documents/view/7277","No Sustainability Content"]
[null,"OC","OC",691,"OC 691","PROPOSAL WRITING","Grad","https://secure.oregonstate.edu/ap/cps/documents/view/5076","No Sustainability Content"]
[null,"BPHS","PAC",105,"PAC 105","CPR/FIRST AID","Undergrad","https://secure.oregonstate.edu/ap/cps/documents/view/120929","No Sustainability Content"]
[null,"BPHS","PAC",121,"PAC 121","BILLIARDS","Undergrad","https://secure.oregonstate.edu/ap/cps/documents/view/108779","No Sustainability Content"]
[null,"BPHS","PAC",126,"PAC 126","CARDIO KICKBOXING I","Undergrad","https://secure.oregonstate.edu/ap/cps/documents/view/4610","No Sustainability Content"]
[null,"BPHS","PAC",133,"PAC 133","DANCE: TAP I. (1 Credit)","Undergrad","https://secure.oregonstate.edu/ap/cps/documents/view/111448","No Sustainability Content"]
[null,"BPHS","PAC",148,"PAC 148","DANCE: CUBAN SALSA I (MEN/WOM)","Undergrad","https://secure.oregonstate.edu/ap/cps/documents/view/9787","No Sustainability Content"]
[null,"BPHS","PAC",150,"PAC 150","CULTURAL WORLD DANCE (MEN/WOMEN). (1 Credit)","Undergrad","https://secure.oregonstate.edu/ap/cps/documents/view/4611","No Sustainability Content"]
[null,"BPHS","PAC",151,"PAC 151","COUNTRY LINE DANCE","Undergrad","https://secure.oregonstate.edu/ap/cps/documents/view/116149","No Sustainability Content"]
[null,"BPHS","PAC",156,"PAC 156","DANCE: COUNTRY WESTERN III","Undergrad","https://secure.oregonstate.edu/ap/cps/documents/view/8979","No Sustainability Content"]
[null,"BPHS","PAC",162,"PAC 162","DANCE: SWING II (MEN/WOMEN). (1 Credit)","Undergrad","https://secure.oregonstate.edu/ap/cps/documents/view/9786","No Sustainability Content"]
[null,"BPHS","PAC",166,"PAC 166","BALLROOM 2-STEP, HUSTLE (M/W)","Undergrad","https://secure.oregonstate.edu/ap/cps/documents/view/4625","No Sustainability Content"]
[null,"BPHS","PAC",168,"PAC 168","DAN: LINDY HOP II (MEN/WOMEN)","Undergrad","https://secure.oregonstate.edu/ap/cps/documents/view/9000","No Sustainability Content"]
[null,"BPHS","PAC",170,"PAC 170","DANCE: WEST COAST SWING II","Undergrad","https://secure.oregonstate.edu/ap/cps/documents/view/8956","No Sustainability Content"]
[null,"BPHS","PAC",174,"PAC 174","FLAG FOOTBALL","Undergrad","https://secure.oregonstate.edu/ap/cps/documents/view/8476","No Sustainability Content"]
[null,"BPHS","PAC",182,"PAC 182","DISC GOLF I","Undergrad","https://secure.oregonstate.edu/ap/cps/documents/view/106246","No Sustainability Content"]
[null,"BPHS","PAC",195,"PAC 195","PILATES II","Undergrad","https://secure.oregonstate.edu/ap/cps/documents/view/104085","No Sustainability Content"]
[null,"BPHS","PAC",197,"PAC 197","PICKLEBALL","Undergrad","https://secure.oregonstate.edu/ap/cps/documents/view/103442","No Sustainability Content"]
[null,"BPHS","PAC",205,"PAC 205","ROWING, CREW I (MEN/WOMEN)","Undergrad","https://secure.oregonstate.edu/ap/cps/documents/view/4552","No Sustainability Content"]
[null,"BPHS","PAC",214,"PAC 214","HALF MARATHON TRAINING","Undergrad","https://secure.oregonstate.edu/ap/cps/documents/view/104768","No Sustainability Content"]
[null,"BPHS","PAC",215,"PAC 215","RUGBY, TOUCH","Undergrad","https://secure.oregonstate.edu/ap/cps/documents/view/8410","No Sustainability Content"]
[null,"BPHS","PAC",242,"PAC 242","SCUBA: OPEN WATER","Undergrad","https://secure.oregonstate.edu/ap/cps/documents/view/4214","No Sustainability Content"]
[null,"BPHS","PAC",247,"PAC 247","SURFING","Undergrad","https://secure.oregonstate.edu/ap/cps/documents/view/4478","No Sustainability Content"]
[null,"BPHS","PAC",249,"PAC 249","LIFEGUARD TRAINING. (1 Credit)","Undergrad","https://secure.oregonstate.edu/ap/cps/documents/view/120928","No Sustainability Content"]
[null,"BPHS","PAC",254,"PAC 254","COMPETITIVE SWIMMING","Undergrad","https://secure.oregonstate.edu/ap/cps/documents/view/100977","No Sustainability Content"]
[null,"BPHS","PAC",256,"PAC 256","TAIJI, TAI CHI I","Undergrad","https://secure.oregonstate.edu/ap/cps/documents/view/9782","No Sustainability Content"]
[null,"BPHS","PAC",257,"PAC 257","TAIJI, TAI CHI II","Undergrad","https://secure.oregonstate.edu/ap/cps/documents/view/9784","No Sustainability Content"]
[null,"BPHS","PAC",264,"PAC 264","TEAM HANDBALL/(MEN/WOMEN). (1 Credit)","Undergrad","https://secure.oregonstate.edu/ap/cps/documents/view/4464","No Sustainability Content"]
[null,"BPHS","PAC",266,"PAC 266","TUMBLING II","Undergrad","https://secure.oregonstate.edu/ap/cps/documents/view/8408","No Sustainability Content"]
[null,"BPHS","PAC",268,"PAC 268","TRIATHLON TRAINING","Undergrad","https://secure.oregonstate.edu/ap/cps/documents/view/104937","No Sustainability Content"]
[null,"BPHS","PAC",293,"PAC 293","INTERDISCIPLINARY YOGA","Undergrad","https://secure.oregonstate.edu/ap/cps/documents/view/126001","No Sustainability Content"]
[null,"BPHS","PAC",297,"PAC 297","YOGATHON","Undergrad","https://secure.oregonstate.edu/ap/cps/documents/view/4390","No Sustainability Content"]
[null,"BPHS","PAC",301,"PAC 301","ALI: CHALLENGE COURSE EXP","Undergrad","https://secure.oregonstate.edu/ap/cps/documents/view/100887","No Sustainability Content"]
[null,"BPHS","PAC",307,"PAC 307","ALI: RAFTING","Undergrad","https://secure.oregonstate.edu/ap/cps/documents/view/115501","No Sustainability Content"]
[null,"BPHS","PAC",308,"PAC 308","ALI: CANOEING","Undergrad","https://secure.oregonstate.edu/ap/cps/documents/view/121755","No Sustainability Content"]
[null,"BPHS","PAC",311,"PAC 311","ALI: STAND UP PADDLEBOARD. (1 Credit)","Undergrad","https://secure.oregonstate.edu/ap/cps/documents/view/121763","No Sustainability Content"]
[null,"BPHS","PAC",314,"PAC 314","ALI: BOULDERING","Undergrad","https://secure.oregonstate.edu/ap/cps/documents/view/106264","No Sustainability Content"]
[null,"BPHS","PAC",315,"PAC 315","ALI: ROCK CLIMBING I",{"$f":"IF(D3394>499,\"Grad\", \"Undergrad\")","v":"Undergrad"},"https://secure.oregonstate.edu/ap/cps/documents/view/113217","No Sustainability Content"]
[null,"BPHS","PAC",316,"PAC 316","ALI: ROCK CLIMBING II","Undergrad","https://secure.oregonstate.edu/ap/cps/documents/view/114597","No Sustainability Content"]
[null,"BPHS","PAC",317,"PAC 317","ALI: ROCK CLIMBING III","Undergrad","https://secure.oregonstate.edu/ap/cps/documents/view/119471","No Sustainability Content"]
[null,"BPHS","PAC",320,"PAC 320","ALI: MOUNTAINEERING I","Undergrad","https://secure.oregonstate.edu/ap/cps/documents/view/109206","No Sustainability Content"]
[null,"BPHS","PAC",324,"PAC 324","ALI: WHITE WATER RESCUE","Undergrad","https://secure.oregonstate.edu/ap/cps/documents/view/119594","No Sustainability Content"]
[null,"BPHS","PAC",325,"PAC 325","ALI: WILDERNESS FIRST AID","Undergrad","https://secure.oregonstate.edu/ap/cps/documents/view/109470","No Sustainability Content"]
[null,"BPHS","PAC",329,"PAC 329","ALI: WILDERNESS 1ST RESPONDER","Undergrad","https://secure.oregonstate.edu/ap/cps/documents/view/100890","No Sustainability Content"]
[null,"BPHS","PAR",319,"PAR 319","Technical Rappelling","Undergrad","https://secure.oregonstate.edu/ap/cps/documents/view/119465","No Sustainability Content"]
[null,"SHPR","PAX",201,"PAX 201","STUDY PEACE & CAUSES CONFLICT","Undergrad","https://catalog.oregonstate.edu/search/?P=PAX%20201","No Sustainability Content"]
[null,"HORT","PBG",519,"PBG 519","CURRENT TOPICS IN PBG","Grad","https://secure.oregonstate.edu/ap/cps/documents/view/109466","No Sustainability Content"]
[null,"HORT","PBG",551,"PBG 551","BREEDING CLONAL CROPS","Grad","https://secure.oregonstate.edu/ap/cps/documents/view/117886","No Sustainability Content"]
[null,"HORT","PBG",556,{"$f":"TRIM(C3405)&\" \"&TRIM(D3405)","v":"PBG 556"},"CROP PLANT DOMESTICATION","Grad","https://secure.oregonstate.edu/ap/cps/documents/view/130532","No Sustainability Content"]
[null,"HORT","PBG",557,"PBG 557","PLANTS AND PATENTS. (2 Credits)","Grad","https://secure.oregonstate.edu/ap/cps/documents/view/130533","No Sustainability Content"]
[null,"PH","PH",111,"PH 111","*INQUIRING INTO PHYS PHENOMENA","Undergrad","https://secure.oregonstate.edu/ap/cps/documents/view/7591","No Sustainability Content"]
[null,"PH","PH",112,"PH 112","Inquiring into Physical Phenomena ","Undergrad","https://secure.oregonstate.edu/ap/cps/documents/view/6630","No Sustainability Content"]
[null,"PH","PH",113,"PH 113","Inquiring into Physical Phenomena ","Undergrad","https://secure.oregonstate.edu/ap/cps/documents/view/6630","No Sustainability Content"]
[null,"PH","PH",205,"PH 205","*SOLAR SYSTEM ASTRONOMY","Undergrad","https://secure.oregonstate.edu/ap/cps/documents/view/112280","No Sustainability Content"]
[null,"PH","PH",211,"PH 211","*GENERAL PHYSICS WITH CALCULUS","Undergrad","https://secure.oregonstate.edu/ap/cps/documents/view/123385","No Sustainability Content"]
[null,"PH","PH",212,"PH 212","*GENERAL PHYSICS WITH CALCULUS","Undergrad","https://secure.oregonstate.edu/ap/cps/documents/view/115476","No Sustainability Content"]
[null,"PH","PH",335,{"$f":"TRIM(C3413)&\" \"&TRIM(D3413)","v":"PH 335"},"THEORETICAL MECHANICS","Undergrad","https://secure.oregonstate.edu/ap/cps/documents/view/125996","No Sustainability Content"]
[null,"PH","PH",365,"PH 365","COMPUTATIONAL PHYSICS LAB","Undergrad","https://secure.oregonstate.edu/ap/cps/documents/view/112403","No Sustainability Content"]
[null,"PH","PH",366,"PH 366","COMPUTATIONAL PHYSICS LAB","Undergrad","https://secure.oregonstate.edu/ap/cps/documents/view/113798","No Sustainability Content"]
[null,"PH","PH",367,"PH 367","COMPUTATIONAL PHYSICS LAB","Undergrad","https://secure.oregonstate.edu/ap/cps/documents/view/113986","No Sustainability Content"]
[null,"PH","PH",411,{"$f":"TRIM(C3417)&\" \"&TRIM(D3417)","v":"PH 411"},"ELECTRONICS","Undergrad","https://secure.oregonstate.edu/ap/cps/documents/view/128512","No Sustainability Content"]
[null,"PH","PH",422,"PH 422","STATIC FIELDS","Undergrad","https://secure.oregonstate.edu/ap/cps/documents/view/125976","No Sustainability Content"]
[null,"PH","PH",423,"PH 423","ENERGY AND ENTROPY","Undergrad","https://secure.oregonstate.edu/ap/cps/documents/view/125973","No Sustainability Content"]
[null,"PH","PH",424,"PH 424","OSCILLATIONS AND WAVES","Undergrad","https://secure.oregonstate.edu/ap/cps/documents/view/125974","No Sustainability Content"]
[null,"PH","PH",425,"PH 425","QUANTUM FUNDAMENTALS","Undergrad","https://secure.oregonstate.edu/ap/cps/documents/view/125972","No Sustainability Content"]
[null,"PH","PH",426,"PH 426","CENTRAL FORCES","Undergrad","https://secure.oregonstate.edu/ap/cps/documents/view/125977","No Sustainability Content"]
[null,"PH","PH",427,"PH 427","PERIODIC SYSTEMS","Undergrad","https://secure.oregonstate.edu/ap/cps/documents/view/125975","No Sustainability Content"]
[null,"PH","PH",455,"PH 455","ASTROPHYSICS","Undergrad","https://secure.oregonstate.edu/ap/cps/documents/view/126353","No Sustainability Content"]
[null,"PH","PH",461,"PH 461","CAPSTONES IN PHYSICS: MATHEMATICAL METHODS. (3 Credits)","Undergrad","https://catalog.oregonstate.edu/search/?P=PH%20461","No Sustainability Content"]
[null,"PH","PH",495,"PH 495","INTRODUCTION TO PARTICLE AND NUCLEAR PHYSICS. (3 Credits)","Undergrad","https://secure.oregonstate.edu/ap/cps/documents/view/126056","No Sustainability Content"]
[null,"PH","PH",511,{"$f":"TRIM(C3427)&\" \"&TRIM(D3427)","v":"PH 511"},"ELECTRONICS","Grad","https://secure.oregonstate.edu/ap/cps/documents/view/128512","No Sustainability Content"]
[null,"PH","PH",555,{"$f":"TRIM(C3428)&\" \"&TRIM(D3428)","v":"PH 555"},"ASTROPHYSICS","Grad","https://secure.oregonstate.edu/ap/cps/documents/view/126353","No Sustainability Content"]
[null,"PH","PH",561,"PH 561","MATHEMATICAL PHYSICS. (3 Credits)","Grad","https://secure.oregonstate.edu/ap/cps/documents/view/103077","No Sustainability Content"]
[null,"PH","PH",562,"PH 562","MATHEMATICAL PHYSICS","Grad","https://secure.oregonstate.edu/ap/cps/documents/view/112606","No Sustainability Content"]
[null,"PH","PH",575,"PH 575","INTRO TO SOLID STATE PHYSICS","Grad","https://secure.oregonstate.edu/ap/cps/documents/view/6831","No Sustainability Content"]
[null,"PH","PH",585,"PH 585","ATOMIC, MOLE, & OPTICAL PHYSIC","Grad","https://secure.oregonstate.edu/ap/cps/documents/view/9572","No Sustainability Content"]
[null,"PH","PH",591,"PH 591","BIOLOGICAL PHYSICS","Grad","https://secure.oregonstate.edu/ap/cps/documents/view/125456","No Sustainability Content"]
[null,"PH","PH",595,"PH 595","INTRODUCTION TO PARTICLE AND NUCLEAR PHYSICS. (3 Credits)","Grad","https://secure.oregonstate.edu/ap/cps/documents/view/126056","No Sustainability Content"]
[null,"PH","PH",642,{"$f":"TRIM(C3435)&\" \"&TRIM(D3435)","v":"PH 642"},"STATISTICAL THERMOPHYSICS","Grad","https://secure.oregonstate.edu/ap/cps/documents/view/126265","No Sustainability Content"]
[null,"PH","PH",671,"PH 671","SOLID STATE PHYSICS, ELECTRON TRANSPORT. (2 Credits)","Grad","https://secure.oregonstate.edu/ap/cps/documents/view/10062","No Sustainability Content"]
[null,"PH","PH",672,"PH 672","SOLID STATE PHYSICS, THEORY. (2 Credits)","Grad","https://secure.oregonstate.edu/ap/cps/documents/view/10063","No Sustainability Content"]
[null,"PH","PH",673,"PH 673","SOLID STATE PHYSICS, NANOSCIENCE AND NANOTECHNOLOGY. (2 Credits)","Grad","https://secure.oregonstate.edu/ap/cps/documents/view/10064","No Sustainability Content"]
[null,"PH","PH",674,"PH 674","SOLID STATE PHYSICS, MAGNETISM. (2 Credits)","Grad","https://secure.oregonstate.edu/ap/cps/documents/view/10065","No Sustainability Content"]
[null,"PH","PH",681,"PH 681","ATOMIC, MOLECULAR AND OPTICAL PHYSICS, MODERN OPTICS. (2 Credits)","Grad","https://secure.oregonstate.edu/ap/cps/documents/view/10067","No Sustainability Content"]
[null,"PH","PH",682,"PH 682","AMO PHYSICS, SEMICOND OPTICS","Grad","https://secure.oregonstate.edu/ap/cps/documents/view/10068","No Sustainability Content"]
[null,"PH","PH",683,"PH 683","AMO PHYSICS, NONLINEAR OPTICS","Grad","https://secure.oregonstate.edu/ap/cps/documents/view/10069","No Sustainability Content"]
[null,"PH","PH",684,"PH 684","ATOMIC, MOLECULAR AND OPTICAL PHYSICS, ULTRAFAST OPTICS. (2 Credits)","Grad","https://secure.oregonstate.edu/ap/cps/documents/view/10070","No Sustainability Content"]
[null,"PHAR","PHAR",201,"PHAR 201","PHARMACY ORIENTATION","Undergrad","https://secure.oregonstate.edu/ap/cps/documents/view/9597","No Sustainability Content"]
[null,"PHAR","PHAR",525,"PHAR 525","FOUNDATIONS OF DRUG ACTION I. (3 Credits)","Grad","https://secure.oregonstate.edu/ap/cps/documents/view/116937","No Sustainability Content"]
[null,"PHAR","PHAR",526,"PHAR 526","FOUNDATIONS OF DRUG ACTION III. (3 Credits)","Grad","https://secure.oregonstate.edu/ap/cps/documents/view/116938","No Sustainability Content"]
[null,"PHAR","PHAR",527,"PHAR 527","FOUNDATIONS OF DRUG ACTION II","Grad","https://secure.oregonstate.edu/ap/cps/documents/view/116874","No Sustainability Content"]
[null,"PHAR","PHAR",563,"PHAR 563","CANCER AND CHEMOPREVENTION","Grad","https://secure.oregonstate.edu/ap/cps/documents/view/100244","No Sustainability Content"]
[null,"PHAR","PHAR",574,"PHAR 574","NANOMEDICINE","Grad","https://secure.oregonstate.edu/ap/cps/documents/view/126150","No Sustainability Content"]
[null,"PHAR","PHAR",591,"PHAR 591","PHARMACOLOGY I","Grad","https://catalog.oregonstate.edu/search/?P=PHAR%20591","No Sustainability Content"]
[null,"PHAR","PHAR",592,"PHAR 592","PHARMACOLOGY II","Grad","https://catalog.oregonstate.edu/search/?P=PHAR%20592","No Sustainability Content"]
[null,"PHAR","PHAR",593,"PHAR 593","PHARMACOLOGY III","Grad","https://catalog.oregonstate.edu/search/?P=PHAR%20593","No Sustainability Content"]
[null,"PHAR","PHAR",669,"PHAR 669","INTRODUCTION TO GRANT WRITING","Grad","https://secure.oregonstate.edu/ap/cps/documents/view/120055","No Sustainability Content"]
[null,"PHAR","PHAR",706,"PHAR 706","INTRODUCTION TO HEALTH DISPARITIES. (2 Credits)","Grad","https://secure.oregonstate.edu/ap/cps/documents/view/126296","No Sustainability Content"]
[null,"PHAR","PHAR",707,"PHAR 707","CAREER PERSPECTIVES","Grad","https://secure.oregonstate.edu/ap/cps/documents/view/120850","No Sustainability Content"]
[null,"PHAR","PHAR",708,"PHAR 708","COMMUNITY CARE I","Grad","https://secure.oregonstate.edu/ap/cps/documents/view/126142","No Sustainability Content"]
[null,"PHAR","PHAR",709,"PHAR 709","COMMUNITY CARE II","Grad","https://secure.oregonstate.edu/ap/cps/documents/view/126144","No Sustainability Content"]
[null,"PHAR","PHAR",712,"PHAR 712","FOUNDATIONS OF PATIENT SAFETY",{"$f":"IF(D3458>499,\"Grad\", \"Undergrad\")","v":"Grad"},"https://secure.oregonstate.edu/ap/cps/documents/view/117011","No Sustainability Content"]
[null,"PHAR","PHAR",713,"PHAR 713","SPANISH FOR PHARMACISTS","Grad","https://secure.oregonstate.edu/ap/cps/documents/view/9546","No Sustainability Content"]
[null,"PHAR","PHAR",714,"PHAR 714","COMPLEMENTARY MEDICINE","Grad","https://secure.oregonstate.edu/ap/cps/documents/view/116728","No Sustainability Content"]
[null,"PHAR","PHAR",715,"PHAR 715","PRESCRIPTION DRUG ABUSE","Grad","https://secure.oregonstate.edu/ap/cps/documents/view/104041","No Sustainability Content"]
[null,"PHAR","PHAR",718,"PHAR 718","NATURAL PRODUCT DRUG DEVEL","Grad","https://secure.oregonstate.edu/ap/cps/documents/view/99985","No Sustainability Content"]
[null,"PHAR","PHAR",719,"PHAR 719","POISONS AND TOXINS","Grad","https://secure.oregonstate.edu/ap/cps/documents/view/100106","No Sustainability Content"]
[null,"PHAR","PHAR",720,"PHAR 720","PHARMACY PRACTICE I","Grad","https://secure.oregonstate.edu/ap/cps/documents/view/115746","No Sustainability Content"]
[null,"PHAR","PHAR",722,"PHAR 722","PHARMACY PRACTICE III","Grad","https://secure.oregonstate.edu/ap/cps/documents/view/121445","No Sustainability Content"]
[null,"PHAR","PHAR",726,"PHAR 726","DRUG LITERATURE EVALUATION","Grad","https://secure.oregonstate.edu/ap/cps/documents/view/108491","No Sustainability Content"]
[null,"PHAR","PHAR",728,"PHAR 728","PHARMACY LAW","Grad","https://secure.oregonstate.edu/ap/cps/documents/view/121446","No Sustainability Content"]
[null,"PHAR","PHAR",733,"PHAR 733","PHARMACEUTICS I","Grad","https://secure.oregonstate.edu/ap/cps/documents/view/121121","No Sustainability Content"]
[null,"PHAR","PHAR",734,"PHAR 734","PHARMACEUTICS II","Grad","https://secure.oregonstate.edu/ap/cps/documents/view/121147","No Sustainability Content"]
[null,"PHAR","PHAR",735,"PHAR 735","FOUNDATIONS OF DRUG ACTION I","Grad","https://secure.oregonstate.edu/ap/cps/documents/view/115716","No Sustainability Content"]
[null,"PHAR","PHAR",736,"PHAR 736","DRUG ACTION III","Grad","https://secure.oregonstate.edu/ap/cps/documents/view/8515","No Sustainability Content"]
[null,"PHAR","PHAR",737,"PHAR 737","DRUG ACTION II","Grad","https://secure.oregonstate.edu/ap/cps/documents/view/118449","No Sustainability Content"]
[null,"PHAR","PHAR",743,"PHAR 743","COMMUNITY CARE III","Grad","https://secure.oregonstate.edu/ap/cps/documents/view/120669","No Sustainability Content"]
[null,"PHAR","PHAR",744,"PHAR 744","AMBULATORY CARE I","Grad","https://secure.oregonstate.edu/ap/cps/documents/view/121267","No Sustainability Content"]
[null,"PHAR","PHAR",745,"PHAR 745","AMBULATORY CARE  II","Grad","https://secure.oregonstate.edu/ap/cps/documents/view/121387","No Sustainability Content"]
[null,"PHAR","PHAR",747,"PHAR 747","INFECTIOUS DISEASES","Grad","https://secure.oregonstate.edu/ap/cps/documents/view/116334","No Sustainability Content"]
[null,"PHAR","PHAR",748,"PHAR 748","IMMUNOLOGY AND INFLAMMATION","Grad","https://secure.oregonstate.edu/ap/cps/documents/view/116464","No Sustainability Content"]
[null,"PHAR","PHAR",750,"PHAR 750","PHARMACOKINETICS/BIOPHARMA","Grad","https://secure.oregonstate.edu/ap/cps/documents/view/118971","No Sustainability Content"]
[null,"PHAR","PHAR",752,"PHAR 752","INTEGRATED DRUG TOPICS I","Grad","https://secure.oregonstate.edu/ap/cps/documents/view/122262","No Sustainability Content"]
[null,"PHAR","PHAR",753,"PHAR 753","INTEGRATED DRUG TOPICS II","Grad","https://secure.oregonstate.edu/ap/cps/documents/view/121549","No Sustainability Content"]
[null,"PHAR","PHAR",754,"PHAR 754","INTEGRATED DRUG TOPICS III","Grad","https://secure.oregonstate.edu/ap/cps/documents/view/123135","No Sustainability Content"]
[null,"PHAR","PHAR",759,"PHAR 759","Introduction to Pathophysiology and Therapeutics","Grad","https://secure.oregonstate.edu/ap/cps/documents/view/100082","No Sustainability Content"]
[null,"PHAR","PHAR",760,"PHAR 760","IPPE: HEALTH SYSTEMS","Grad","https://secure.oregonstate.edu/ap/cps/documents/view/108530","No Sustainability Content"]
[null,"PHAR","PHAR",761,"PHAR 761","INTEGRATED DRUG THERAPY I","Grad","https://secure.oregonstate.edu/ap/cps/documents/view/126301","No Sustainability Content"]
[null,"PHAR","PHAR",762,"PHAR 762","ADV INTEGRATED DRUG THERAPY II","Grad","https://secure.oregonstate.edu/ap/cps/documents/view/126094","No Sustainability Content"]
[null,"PHAR","PHAR",763,"PHAR 763","PATHOPHYSIOLOGY AND THERAPEUTICS III. (7 Credits)","Grad","https://secure.oregonstate.edu/ap/cps/documents/view/100906","No Sustainability Content"]
[null,"PHAR","PHAR",767,{"$f":"TRIM(C3487)&\" \"&TRIM(D3487)","v":"PHAR 767"},"PRE-APPE READINESS & COMPLEX","Grad","https://secure.oregonstate.edu/ap/cps/documents/view/126305","No Sustainability Content"]
[null,"PHAR","PHAR",768,{"$f":"TRIM(C3488)&\" \"&TRIM(D3488)","v":"PHAR 768"},"APPLIED LAW AND ETHICS","Grad","https://secure.oregonstate.edu/ap/cps/documents/view/126306","No Sustainability Content"]
[null,"PHAR","PHAR",773,"PHAR 773","EBM III: EVIDENCE SYN & DECISI","Grad","https://secure.oregonstate.edu/ap/cps/documents/view/109730","No Sustainability Content"]
[null,"PHAR","PHAR",774,"PHAR 774","DRUG POLICY","Grad","https://secure.oregonstate.edu/ap/cps/documents/view/126302","No Sustainability Content"]
[null,"PHAR","PHAR",775,"PHAR 775","PROFESSIONAL TRANSITIONS","Grad","https://secure.oregonstate.edu/ap/cps/documents/view/100874","No Sustainability Content"]
[null,"PHAR","PHAR",776,"PHAR 776","PHARMA-CSI","Grad","https://secure.oregonstate.edu/ap/cps/documents/view/101398","No Sustainability Content"]
[null,"PHAR","PHAR",777,"PHAR 777","ACUTE MEDICAL EMERGENCIES. (2 Credits)","Grad","https://secure.oregonstate.edu/ap/cps/documents/view/102053","No Sustainability Content"]
[null,"PHAR","PHAR",792,"PHAR 792","HEALTH SYSTEMS CLERKSHIP","Grad","https://secure.oregonstate.edu/ap/cps/documents/view/7280","No Sustainability Content"]
[null,"PHAR","PHAR",798,"PHAR 798","PHARMACY HEALTH ADMINISTRATION","Grad","https://secure.oregonstate.edu/ap/cps/documents/view/104741","No Sustainability Content"]
[null,"SHPR","PHL",202,"PHL 202","INTRO TO RELIGIOUS STUDIES","Undergrad","https://secure.oregonstate.edu/ap/cps/documents/view/118201","No Sustainability Content"]
[null,"SHPR","PHL",203,"PHL 203","*THE MEANING OF EXISTENCE. (4 Credits)","Undergrad","https://secure.oregonstate.edu/ap/cps/documents/view/130139","No Sustainability Content"]
[null,"SHPR","PHL",206,"PHL 206","*RELIGIOUS ETHICS AND MORAL PROBLEMS. (4 Credits)","Undergrad","https://secure.oregonstate.edu/ap/cps/documents/view/123173","No Sustainability Content"]
[null,"SHPR","PHL",208,"PHL 208","INTRO TO BUDDHIST TRADITIONS","Undergrad","https://secure.oregonstate.edu/ap/cps/documents/view/122805","No Sustainability Content"]
[null,"SHPR","PHL",209,"PHL 209","*SELF AND SOCIETY. (4 Credits)","Undergrad","https://secure.oregonstate.edu/ap/cps/documents/view/133103","No Sustainability Content"]
[null,"SHPR","PHL",210,"PHL 210","*RELIGION IN THE UNITED STATES","Undergrad","https://secure.oregonstate.edu/ap/cps/documents/view/109259","No Sustainability Content"]
[null,"SHPR","PHL",213,"PHL 213","*INTRO TO HINDU TRADITIONS","Undergrad","https://secure.oregonstate.edu/ap/cps/documents/view/119477","No Sustainability Content"]
[null,"SHPR","PHL",214,"PHL 214","*INTRO TO ISLAMIC TRADITIONS","Undergrad","https://secure.oregonstate.edu/ap/cps/documents/view/122882","No Sustainability Content"]
[null,"SHPR","PHL",220,"PHL 220","*WORLD-VIEWS & VALUES IN BIBLE","Undergrad","https://secure.oregonstate.edu/ap/cps/documents/view/122880","No Sustainability Content"]
[null,"SHPR","PHL",310,"PHL 310","*CRITICS OF RELIGION. (4 Credits)","Undergrad","https://catalog.oregonstate.edu/search/?P=PHL%20310","No Sustainability Content"]
[null,"SHPR","PHL",312,"PHL 312","*ASIAN THOUGHT. (4 Credits)","Undergrad","https://secure.oregonstate.edu/ap/cps/documents/view/122915","No Sustainability Content"]
[null,"SHPR","PHL",315,"PHL 315","*GANDHI AND NONVIOLENCE","Undergrad","https://secure.oregonstate.edu/ap/cps/documents/view/122911","No Sustainability Content"]
[null,"SHPR","PHL",316,"PHL 316","INTELLECTUAL ISSUES OF MEXICO AND MEXICAN AMERICANS. (4 Credits)","Undergrad","https://catalog.oregonstate.edu/search/?P=PHL%20316","No Sustainability Content"]
[null,"SHPR","PHL",344,"PHL 344","*PACIFISM, JUST WAR, TERRORISM","Undergrad","https://secure.oregonstate.edu/ap/cps/documents/view/122917","No Sustainability Content"]
[null,"SHPR","PHL",371,"PHL 371","*PHILOSOPHIES OF CHINA","Undergrad","https://catalog.oregonstate.edu/search/?P=PHL%20371","No Sustainability Content"]
[null,"SHPR","PHL",411,"PHL 411","GREAT FIGURES IN PHILOSOPHY","Undergrad","https://catalog.oregonstate.edu/search/?P=PHL%20411","No Sustainability Content"]
[null,"SHPR","PHL",430,"PHL 430","HISTORY OF BUDDHIST PHILOSOPHY","Undergrad","https://secure.oregonstate.edu/ap/cps/documents/view/123462","No Sustainability Content"]
[null,"SHPR","PHL",431,"PHL 431","BUDDHISM, NON-VIOLENCE, AND SOCIAL JUSTICE. (4 Credits)","Undergrad","https://secure.oregonstate.edu/ap/cps/documents/view/123503","No Sustainability Content"]
[null,"SHPR","PHL",432,"PHL 432","YOGA AND TANTRIC TRADITIONS","Undergrad","https://secure.oregonstate.edu/ap/cps/documents/view/123283","No Sustainability Content"]
[null,"SHPR","PHL",433,"PHL 433","*THEORY AND PRACTICE OF MODERN YOGA. (4 Credits)","Undergrad","https://catalog.oregonstate.edu/search/?P=PHL%20433","No Sustainability Content"]
[null,"SHPR","PHL",436,"PHL 436","PHILOSOPHY AND RELIGION. (3 Credits)","Undergrad","https://secure.oregonstate.edu/ap/cps/documents/view/123412","No Sustainability Content"]
[null,"SHPR","PHL",455,"PHL 455","DEATH AND DYING","Undergrad","https://secure.oregonstate.edu/ap/cps/documents/view/103542","No Sustainability Content"]
[null,"SHPR","PHL",456,"PHL 456","PHILOSOPHY OF MIND. (4 Credits)","Undergrad","https://catalog.oregonstate.edu/search/?P=PHL%20456","No Sustainability Content"]
[null,"SHPR","PHL",474,"PHL 474","^PHILOSOPHY OF BIOLOGY","Undergrad","https://secure.oregonstate.edu/ap/cps/documents/view/110650","No Sustainability Content"]
[null,"SHPR","PHL",511,"PHL 511","GREAT FIGURES IN PHILOSOPHY","Grad","https://catalog.oregonstate.edu/search/?P=PHL%20511","No Sustainability Content"]
[null,"SHPR","PHL",530,{"$f":"TRIM(C3521)&\" \"&TRIM(D3521)","v":"PHL 530"},"HISTORY OF BUDDHIST PHILOSOPHY","Grad","https://secure.oregonstate.edu/ap/cps/documents/view/123462","No Sustainability Content"]
[null,"SHPR","PHL",531,"PHL 531","BUDDHISM, NON-VIOLENCE, AND SOCIAL JUSTICE. (4 Credits)",{"$f":"IF(D3522>499,\"Grad\", \"Undergrad\")","v":"Grad"},"https://secure.oregonstate.edu/ap/cps/documents/view/123503","No Sustainability Content"]
[null,"SHPR","PHL",532,{"$f":"TRIM(C3523)&\" \"&TRIM(D3523)","v":"PHL 532"},"YOGA AND TANTRIC TRADITIONS","Grad","https://secure.oregonstate.edu/ap/cps/documents/view/123283","No Sustainability Content"]
[null,"SHPR","PHL",533,"PHL 533","THEORY AND PRACTICE OF MODERN YOGA. (4 Credits)","Grad","https://catalog.oregonstate.edu/search/?P=PHL%20533","No Sustainability Content"]
[null,"SHPR","PHL",536,"PHL 536","PHILOSOPHY AND RELIGION. (3 Credits)","Grad","https://secure.oregonstate.edu/ap/cps/documents/view/123412","No Sustainability Content"]
[null,"SHPR","PHL",555,"PHL 555","DEATH AND DYING","Grad","https://secure.oregonstate.edu/ap/cps/documents/view/103542","No Sustainability Content"]
[null,"SHPR","PHL",556,"PHL 556","PHILOSOPHY OF MIND. (4 Credits)","Grad","https://catalog.oregonstate.edu/search/?P=PHL%20556","No Sustainability Content"]
[null,"SLCS","PORT",111,"PORT 111","FIRST-YEAR PORTUGUESE. (4 Credits)","Undergrad","https://secure.oregonstate.edu/ap/cps/documents/view/117749","No Sustainability Content"]
[null,"SLCS","PORT",112,"PORT 112","FIRST-YEAR PORTUGUESE. (4 Credits)","Undergrad","https://secure.oregonstate.edu/ap/cps/documents/view/117751","No Sustainability Content"]
[null,"SLCS","PORT",113,"PORT 113","FIRST-YEAR PORTUGUESE. (4 Credits)","Undergrad","https://secure.oregonstate.edu/ap/cps/documents/view/117753","No Sustainability Content"]
[null,"SPP","PPOL",421,"PPOL 421","INTRODUCTION TO POLICY RESEARCH. (4 Credits)","Undergrad","https://secure.oregonstate.edu/ap/cps/documents/view/130500","No Sustainability Content"]
[null,"SPP","PPOL",448,{"$f":"TRIM(C3532)&\" \"&TRIM(D3532)","v":"PPOL 448"},"MARINE POLICY IN THE U.S.","Undergrad","https://secure.oregonstate.edu/ap/cps/documents/view/128030","No Sustainability Content"]
[null,"SPP","PPOL",510,"PPOL 510","INTERNSHIP","Grad","https://secure.oregonstate.edu/ap/cps/documents/view/116610","No Sustainability Content"]
[null,"SPP","PPOL",511,"PPOL 511","PUBLIC ORGANIZATIONS AND LEADERSHIP. (4 Credits)","Grad","https://secure.oregonstate.edu/ap/cps/documents/view/128946 ","No Sustainability Content"]
[null,"SPP","PPOL",521,"PPOL 521","UNDERSTANDING SOCIAL RESEARCH","Grad","https://secure.oregonstate.edu/ap/cps/documents/view/122496","No Sustainability Content"]
[null,"SPP","PPOL",524,"PPOL 524","APPLIED RESEARCH METHODS","Grad","https://secure.oregonstate.edu/ap/cps/documents/view/122485","No Sustainability Content"]
[null,"SPP","PPOL",525,"PPOL 525","MANAGING AND GOVERNING PUBLIC AND NON-PROFIT ORGANIZATIONS. (4 Credits)","Grad","https://secure.oregonstate.edu/ap/cps/documents/view/129385","No Sustainability Content"]
[null,"SPP","PPOL",548,"PPOL 548","MARINE POLICY IN THE U.S.","Grad","https://secure.oregonstate.edu/ap/cps/documents/view/116632","No Sustainability Content"]
[null,"SPP","PPOL",551,{"$f":"TRIM(C3539)&\" \"&TRIM(D3539)","v":"PPOL 551"},"HIGHER EDUCATION POLICY","Grad","https://secure.oregonstate.edu/ap/cps/documents/view/125283","No Sustainability Content"]
[null,"SPP","PPOL",613,"PPOL 613","ADVANCED POLICY THEORY I","Grad","https://secure.oregonstate.edu/ap/cps/documents/view/113181","No Sustainability Content"]
[null,"SPP","PPOL",621,"PPOL 621","ADVANCED QUANTITATIVE METHODS","Grad","https://secure.oregonstate.edu/ap/cps/documents/view/113021","No Sustainability Content"]
[null,"SPP","PPOL",622,"PPOL 622","ADVANCED POLICY ANALYSIS","Grad","https://secure.oregonstate.edu/ap/cps/documents/view/113437","No Sustainability Content"]
[null,"SPP","PPOL",628,"PPOL 628","ADVANCED QUALITATIVE METHODS","Grad","https://secure.oregonstate.edu/ap/cps/documents/view/113033","No Sustainability Content"]
[null,"SPP","PS",110,{"$f":"TRIM(C3544)&\" \"&TRIM(D3544)","v":"PS 110"},"*GOVERNING AFTER ZOMBIE APOCA","Undergrad","https://secure.oregonstate.edu/ap/cps/documents/view/123368","Unavailable syllabus"]
[null,"SPP","PS",205,"PS 205","*INTRO TO INTERNATL RELATIONS","Undergrad","https://secure.oregonstate.edu/ap/cps/documents/view/101597","No Sustainability Content"]
[null,"SPP","PS",221,"PS 221","INTRODUCTION TO LAW. (4 Credits)","Undergrad","https://secure.oregonstate.edu/ap/cps/documents/view/130710  ","No Sustainability Content"]
[null,"SPP","PS",300,"PS 300","^RESEARCH METHODS","Undergrad","https://secure.oregonstate.edu/ap/cps/documents/view/122217","No Sustainability Content"]
[null,"SPP","PS",312,"PS 312","PRESIDENTIAL POLITICS","Undergrad","https://secure.oregonstate.edu/ap/cps/documents/view/119097","No Sustainability Content"]
[null,"SPP","PS",313,"PS 313","CAMPAIGNS AND ELECTIONS. (4 Credits)","Undergrad","https://secure.oregonstate.edu/ap/cps/documents/view/119390","No Sustainability Content"]
[null,"SPP","PS",315,"PS 315","*THE POLITICS OF MEDIA","Undergrad","https://secure.oregonstate.edu/ap/cps/documents/view/119618","No Sustainability Content"]
[null,"SPP","PS",321,"PS 321","CON LAW: POWERS & CONSTRAINTS","Undergrad","https://secure.oregonstate.edu/ap/cps/documents/view/119091","No Sustainability Content"]
[null,"SPP","PS",323,"PS 323","CONSTITUTIONAL LAW: RIGHTS OF THE ACCUSED. (4 Credits)","Undergrad","https://secure.oregonstate.edu/ap/cps/documents/view/119094","No Sustainability Content"]
[null,"SPP","PS",326,"PS 326","JUDICIAL PROCESS AND POLITICS","Undergrad","https://secure.oregonstate.edu/ap/cps/documents/view/2976","No Sustainability Content"]
[null,"SPP","PS",342,"PS 342","THE POLITICS OF CORRUPTION. (4 Credits)","Undergrad","https://secure.oregonstate.edu/ap/cps/documents/view/122200","No Sustainability Content"]
[null,"SPP","PS",344,"PS 344","*LATIN AMERICAN POLITICS","Undergrad","https://secure.oregonstate.edu/ap/cps/documents/view/119106","No Sustainability Content"]
[null,"SPP","PS",349,"PS 349","*BRITISH POLITICS","Undergrad","https://secure.oregonstate.edu/ap/cps/documents/view/124461","No Sustainability Content"]
[null,"SPP","PS",351,{"$f":"TRIM(C3557)&\" \"&TRIM(D3557)","v":"PS 351"},"AMERICAN FOREIGN POLICY","Undergrad","https://secure.oregonstate.edu/ap/cps/documents/view/110166","No Sustainability Content"]
[null,"SPP","PS",354,"PS 354","*INTL ORGS & GLOBAL POLITICS","Undergrad","https://secure.oregonstate.edu/ap/cps/documents/view/124056","No Sustainability Content"]
[null,"SPP","PS",364,"PS 364","CONTEMPORARY POLITICAL THEORY. (4 Credits)","Undergrad","https://secure.oregonstate.edu/ap/cps/documents/view/122199","No Sustainability Content"]
[null,"SPP","PS",366,"PS 366","*FROM ATLANTIS TO UTOPIA","Undergrad","https://secure.oregonstate.edu/ap/cps/documents/view/125311","No Sustainability Content"]
[null,"SPP","PS",372,"PS 372","PUBLIC ADMINISTRATION","Undergrad","https://secure.oregonstate.edu/ap/cps/documents/view/121778","No Sustainability Content"]
[null,"SPP","PS",427,"PS 427","NUCLEAR NONPROLIFERATION AND ARMS CONTROL. (4 Credits)","Undergrad","https://secure.oregonstate.edu/ap/cps/documents/view/132594 ","No Sustainability Content"]
[null,"SPP","PS",428,"PS 428","TERRORISM AND GLOBAL SECURITY. (4 Credits)","Undergrad","https://secure.oregonstate.edu/ap/cps/documents/view/132939","No Sustainability Content"]
[null,"SPP","PS",441,"PS 441","DEMOCRATIZATION","Undergrad","https://catalog.oregonstate.edu/search/?P=PS%20441","No Sustainability Content"]
[null,"SPP","PS",458,"PS 458","*INTERNATIONAL POLITICAL ECONOMY. (4 Credits)","Undergrad","https://catalog.oregonstate.edu/search/?P=PS%20458","No Sustainability Content"]
[null,"SPP","PS",462,"PS 462","THEORIES OF LAW. (4 Credits)","Undergrad","https://catalog.oregonstate.edu/search/?P=PS%20462","No Sustainability Content"]
[null,"SPP","PS",478,"PS 478","RENEWABLE ENERGY POLICY","Undergrad","https://catalog.oregonstate.edu/search/?P=PS%20478","No Sustainability Content"]
[null,"SPP","PS",483,{"$f":"TRIM(C3568)&\" \"&TRIM(D3568)","v":"PS 483"},"CUBAN CULTURE, POL & SOCIETY","Undergrad","https://secure.oregonstate.edu/ap/cps/documents/view/127878 ","No Sustainability Content"]
[null,"SPP","PS",523,"PS 523","American Constitutional Law: Rights of the Accused","Grad","https://secure.oregonstate.edu/ap/cps/documents/view/106706","No Sustainability Content"]
[null,"SPP","PS",527,"PS 527","NUCLEAR NONPROLIFERATION AND ARMS CONTROL. (4 Credits)","Grad","https://secure.oregonstate.edu/ap/cps/documents/view/132594 ","No Sustainability Content"]
[null,"SPP","PS",528,"PS 528","TERRORISM AND GLOBAL SECURITY. (4 Credits)","Grad","https://secure.oregonstate.edu/ap/cps/documents/view/132939","No Sustainability Content"]
[null,"SPP","PS",541,"PS 541","DEMOCRATIZATION","Grad","https://catalog.oregonstate.edu/search/?P=PS%20541","No Sustainability Content"]
[null,"SPP","PS",558,"PS 558","INTERNATIONAL POLITICAL ECONOMY. (4 Credits)","Grad","https://catalog.oregonstate.edu/search/?P=PS%20558","No Sustainability Content"]
[null,"SPP","PS",562,"PS 562","THEORIES OF LAW. (4 Credits)","Grad","https://catalog.oregonstate.edu/search/?P=PS%20562","No Sustainability Content"]
[null,"SPP","PS",578,"PS 578","RENEWABLE ENERGY POLICY","Grad","https://catalog.oregonstate.edu/search/?P=PS%20578","No Sustainability Content"]
[null,"SPP","PS",583,{"$f":"TRIM(C3576)&\" \"&TRIM(D3576)","v":"PS 583"},"CUBAN CULTURE, POL & SOCIETY","Grad","https://secure.oregonstate.edu/ap/cps/documents/view/127878 ","No Sustainability Content"]
[null,"IST","PSM",513,"PSM 513","PROFESSIONAL SKILLS","Grad","https://secure.oregonstate.edu/ap/cps/documents/view/99430","No Sustainability Content"]
[null,"IST","PSM",565,"PSM 565","ACCOUNTING AND FINANCE FOR SCIENTISTS. (3 Credits)","Grad","https://secure.oregonstate.edu/ap/cps/documents/view/98190","No Sustainability Content"]
[null,"IST","PSM",566,"PSM 566","Management and Marketing of Scientific Technologies","Grad","https://secure.oregonstate.edu/ap/cps/documents/view/98180","No Sustainability Content"]
[null,"IST","PSM",567,"PSM 567","Innovation Management","Grad","https://secure.oregonstate.edu/ap/cps/documents/view/98200","No Sustainability Content"]
[null,"SPS","PSY",330,"PSY 330","BRAIN AND BEHAVIOR","Undergrad","https://secure.oregonstate.edu/ap/cps/documents/view/10520","No Sustainability Content"]
[null,"SPS","PSY",340,"PSY 340","COGNITION","Undergrad","https://secure.oregonstate.edu/ap/cps/documents/view/10521","No Sustainability Content"]
[null,"SPS","PSY",350,"PSY 350","HUMAN LIFESPAN DEVELOPMENT","Undergrad","https://secure.oregonstate.edu/ap/cps/documents/view/10522","No Sustainability Content"]
[null,"SPS","PSY",360,"PSY 360","SOCIAL PSYCHOLOGY","Undergrad","https://secure.oregonstate.edu/ap/cps/documents/view/10523","No Sustainability Content"]
[null,"SPS","PSY",370,"PSY 370","PERSONALITY","Undergrad","https://secure.oregonstate.edu/ap/cps/documents/view/10653","No Sustainability Content"]
[null,"SPS","PSY",381,"PSY 381","ABNORMAL PSYCHOLOGY",{"$f":"IF(D3586>499,\"Grad\", \"Undergrad\")","v":"Undergrad"},"https://secure.oregonstate.edu/ap/cps/documents/view/10654","No Sustainability Content"]
[null,"SPS","PSY",432,"PSY 432","PHYSIOLOGICAL PSYCHOLOGY","Undergrad","https://catalog.oregonstate.edu/search/?P=PSY%20432","No Sustainability Content"]
[null,"SPS","PSY",434,"PSY 434","^BRAIN AND BEHAVIOR METHODS. (4 Credits)","Undergrad","https://catalog.oregonstate.edu/search/?P=PSY%20434","No Sustainability Content"]
[null,"SPS","PSY",437,"PSY 437","MOTIVATION","Undergrad","https://catalog.oregonstate.edu/search/?P=PSY%20437","No Sustainability Content"]
[null,"SPS","PSY",442,"PSY 442","PERCEPTION","Undergrad","https://catalog.oregonstate.edu/search/?P=PSY%20442","No Sustainability Content"]
[null,"SPS","PSY",444,"PSY 444","LEARNING AND MEMORY","Undergrad","https://catalog.oregonstate.edu/search/?P=PSY%20444","No Sustainability Content"]
[null,"SPS","PSY",448,"PSY 448","CONSCIOUSNESS","Undergrad","https://catalog.oregonstate.edu/search/?P=PSY%20448","No Sustainability Content"]
[null,"SPS","PSY",454,"PSY 454","COGNITIVE DEVELOPMENT","Undergrad","https://catalog.oregonstate.edu/search/?P=PSY%20454","No Sustainability Content"]
[null,"SPS","PSY",456,"PSY 456","SOCIAL DEVELOPMENT","Undergrad","https://secure.oregonstate.edu/ap/cps/documents/view/100743","No Sustainability Content"]
[null,"SPS","PSY",458,"PSY 458","LANGUAGE ACQUISITION","Undergrad","https://catalog.oregonstate.edu/search/?P=PSY%20458","No Sustainability Content"]
[null,"SPS","PSY",463,"PSY 463","JUDGMENT AND DECISION MAKING. (4 Credits)","Undergrad","https://secure.oregonstate.edu/ap/cps/documents/view/129392","No Sustainability Content"]
[null,"SPS","PSY",464,"PSY 464","SOCIAL COGNITION","Undergrad","https://catalog.oregonstate.edu/search/?P=PSY%20464","No Sustainability Content"]
[null,"SPS","PSY",467,"PSY 467","POLITICAL PSYCHOLOGY. (4 Credits)","Undergrad","https://secure.oregonstate.edu/ap/cps/documents/view/130850","No Sustainability Content"]
[null,"SPS","PSY",480,"PSY 480","^CLINICAL RESEARCH METHODS","Undergrad","https://catalog.oregonstate.edu/search/?P=PSY%20480","No Sustainability Content"]
[null,"SPS","PSY",482,"PSY 482","PSYCHOTHERAPY","Undergrad","https://catalog.oregonstate.edu/search/?P=PSY%20482","No Sustainability Content"]
[null,"SPS","PSY",483,"PSY 483","DEVELOPMENTAL PSYCHOPATHOLOGY","Undergrad","https://catalog.oregonstate.edu/search/?P=PSY%20483","No Sustainability Content"]
[null,"SPS","PSY",485,"PSY 485","BEHAVIOR MODIFICATION","Undergrad","https://catalog.oregonstate.edu/search/?P=PSY%20485","No Sustainability Content"]
[null,"SPS","PSY",486,"PSY 486","YOGA AND MENTAL HEALTH. (4 Credits)","Undergrad","https://secure.oregonstate.edu/ap/cps/documents/view/130788","No Sustainability Content"]
[null,"SPS","PSY",493,"PSY 493","POSITIVE PSYCHOLOGY","Undergrad","https://catalog.oregonstate.edu/search/?P=PSY%20493","No Sustainability Content"]
[null,"SPS","PSY",494,"PSY 494","ENGINEERING PSYCHOLOGY","Undergrad","https://catalog.oregonstate.edu/search/?P=PSY%20494","No Sustainability Content"]
[null,"SPS","PSY",495,{"$f":"TRIM(C3606)&\" \"&TRIM(D3606)","v":"PSY 495"},"PSYCHOLOGY OF MEDITATION","Undergrad","https://secure.oregonstate.edu/ap/cps/documents/view/128781 ","No Sustainability Content"]
[null,"SPS","PSY",496,"PSY 496","INDUSTR & ORGANIZATIONAL PSYCH","Undergrad","https://catalog.oregonstate.edu/search/?P=PSY%20496","No Sustainability Content"]
[null,"SPS","PSY",497,{"$f":"TRIM(C3608)&\" \"&TRIM(D3608)","v":"PSY 497"},"EVOLUTIONARY PSYCHOLOGY","Undergrad","https://secure.oregonstate.edu/ap/cps/documents/view/128780","No Sustainability Content"]
[null,"SPS","PSY",514,{"$f":"TRIM(C3609)&\" \"&TRIM(D3609)","v":"PSY 514"},"RESEARCH METHODS I","Grad","https://secure.oregonstate.edu/ap/cps/documents/view/126790","No Sustainability Content"]
[null,"SPS","PSY",521,{"$f":"TRIM(C3610)&\" \"&TRIM(D3610)","v":"PSY 521"},"PSYCHOLOGY PROSEM","Grad","https://secure.oregonstate.edu/ap/cps/documents/view/127030","No Sustainability Content"]
[null,"SPS","PSY",523,{"$f":"TRIM(C3611)&\" \"&TRIM(D3611)","v":"PSY 523"},"ETHICS IN PSYCH RESEARCH","Grad","https://secure.oregonstate.edu/ap/cps/documents/view/126044","No Sustainability Content"]
[null,"SPS","PSY",531,{"$f":"TRIM(C3612)&\" \"&TRIM(D3612)","v":"PSY 531"},"GRAD BEHAVIORAL NEUROSCIENCE","Grad","https://secure.oregonstate.edu/ap/cps/documents/view/128124","No Sustainability Content"]
[null,"SPS","PSY",532,"PSY 532","Intro to Physiological Psychology","Grad","https://secure.oregonstate.edu/ap/cps/documents/view/10656","No Sustainability Content"]
[null,"SPS","PSY",534,"PSY 534","BRAIN AND BEHAVIOR METHODS. (4 Credits)","Grad","https://catalog.oregonstate.edu/search/?P=PSY%20534","No Sustainability Content"]
[null,"SPS","PSY",537,"PSY 537","MOTIVATION. (4 Credits)","Grad","https://catalog.oregonstate.edu/search/?P=PSY%20537","No Sustainability Content"]
[null,"SPS","PSY",541,"PSY 541","GRADUATE SEMINAR IN COGNITION. (4 Credits)","Grad","https://secure.oregonstate.edu/ap/cps/documents/view/128620","No Sustainability Content"]
[null,"SPS","PSY",542,"PSY 542","PERCEPTION. (4 Credits)","Grad","https://catalog.oregonstate.edu/search/?P=PSY%20542","No Sustainability Content"]
[null,"SPS","PSY",544,"PSY 544","LEARNING AND MEMORY. (4 Credits)","Grad","https://catalog.oregonstate.edu/search/?P=PSY%20544","No Sustainability Content"]
[null,"SPS","PSY",548,"PSY 548","CONSCIOUSNESS. (4 Credits)","Grad","https://catalog.oregonstate.edu/search/?P=PSY%20548","No Sustainability Content"]
[null,"SPS","PSY",551,"PSY 551","LIFESPAN DEVELOPMENTAL SCIENCE. (4 Credits)","Grad","https://secure.oregonstate.edu/ap/cps/documents/view/131174","No Sustainability Content"]
[null,"SPS","PSY",554,"PSY 554","COGNITIVE DEVELOPMENT. (4 Credits)","Grad","https://catalog.oregonstate.edu/search/?P=PSY%20554","No Sustainability Content"]
[null,"SPS","PSY",556,"PSY 556","SOCIAL DEVELOPMENT","Grad","https://secure.oregonstate.edu/ap/cps/documents/view/100744","No Sustainability Content"]
[null,"SPS","PSY",558,"PSY 558","LANGUAGE ACQUISITION","Grad","https://catalog.oregonstate.edu/search/?P=PSY%20558","No Sustainability Content"]
[null,"SPS","PSY",561,"PSY 561","GRADUATE SOCIAL PSYCHOLOGY. (4 Credits)","Grad","https://secure.oregonstate.edu/ap/cps/documents/view/124862","No Sustainability Content"]
[null,"SPS","PSY",564,"PSY 564","SOCIAL COGNITION","Grad","https://catalog.oregonstate.edu/search/?P=PSY%20564","No Sustainability Content"]
[null,"SPS","PSY",571,"PSY 571","GRADUATE PSYCHOMETRICS","Grad","https://secure.oregonstate.edu/ap/cps/documents/view/124458","No Sustainability Content"]
[null,"SPS","PSY",580,"PSY 580","CLINICAL RESEARCH METHODS. (4 Credits)","Grad","https://catalog.oregonstate.edu/search/?P=PSY%20580","No Sustainability Content"]
[null,"SPS","PSY",581,{"$f":"TRIM(C3628)&\" \"&TRIM(D3628)","v":"PSY 581"},"CLINICAL RESEARCH AND THEORY","Grad","https://secure.oregonstate.edu/ap/cps/documents/view/128145","No Sustainability Content"]
[null,"SPS","PSY",582,"PSY 582","PSYCHOTHERAPY","Grad","https://catalog.oregonstate.edu/search/?P=PSY%20582","No Sustainability Content"]
[null,"SPS","PSY",583,"PSY 583","DEVELOPMENTAL PSYCHOPATHOLOGY. (4 Credits)","Grad","https://catalog.oregonstate.edu/search/?P=PSY%20583","No Sustainability Content"]
[null,"SPS","PSY",585,"PSY 585","BEHAVIOR MODIFICATION","Grad","https://catalog.oregonstate.edu/search/?P=PSY%20585","No Sustainability Content"]
[null,"SPS","PSY",586,"PSY 586","YOGA AND MENTAL HEALTH. (4 Credits)","Grad","https://secure.oregonstate.edu/ap/cps/documents/view/130788","No Sustainability Content"]
[null,"SPS","PSY",591,{"$f":"TRIM(C3633)&\" \"&TRIM(D3633)","v":"PSY 591"},"GRADUATE HEALTH PSYCHOLOGY","Grad","https://secure.oregonstate.edu/ap/cps/documents/view/128104 ","No Sustainability Content"]
[null,"SPS","PSY",593,"PSY 593","POSITIVE PSYCHOLOGY","Grad","https://catalog.oregonstate.edu/search/?P=PSY%20593","No Sustainability Content"]
[null,"SPS","PSY",594,"PSY 594","ENGINEERING PSYCHOLOGY","Grad","https://catalog.oregonstate.edu/search/?P=PSY%20594","No Sustainability Content"]
[null,"SPS","PSY",595,{"$f":"TRIM(C3636)&\" \"&TRIM(D3636)","v":"PSY 595"},"PSYCHOLOGY OF MEDITATION","Grad","https://secure.oregonstate.edu/ap/cps/documents/view/128781 ","No Sustainability Content"]
[null,"SPS","PSY",596,"PSY 596","INDUSTR & ORGANIZAT PSYCHOLOGY","Grad","https://catalog.oregonstate.edu/search/?P=PSY%20596","No Sustainability Content"]
[null,"SPS","PSY",643,"PSY 643","APPLIED COGNITION. (4 Credits)","Grad","https://secure.oregonstate.edu/ap/cps/documents/view/128558 ","No Sustainability Content"]
[null,"SPS","PSY",649,"PSY 649","ADVANCED ENGINEERING PSYCHOLOGY. (4 Credits)","Grad","https://secure.oregonstate.edu/ap/cps/documents/view/130985","No Sustainability Content"]
[null,"SPS","PSY",697,"PSY 697","GRADUATE PSYCHOLOGICAL SCIENCE OF TEACHING AND LEARNING. (4 Credits)","Grad","https://secure.oregonstate.edu/ap/cps/documents/view/129394","No Sustainability Content"]
[null,"SLCS","QS",361,{"$f":"TRIM(C3641)&\" \"&TRIM(D3641)","v":"QS 361"},"(RE)FRAMING RACE FILM PROD","Undergrad","https://secure.oregonstate.edu/ap/cps/documents/view/129199 ","No Sustainability Content"]
[null,"SLCS","QS",431,"QS 431","*QUEER OF COLOR CRITIQUES. (4 Credits)","Undergrad","https://catalog.oregonstate.edu/search/?P=QS%20431","No Sustainability Content"]
[null,"SLCS","QS",472,"QS 472","^INDIGENOUS 2SPIRIT STUDIES","Undergrad","https://catalog.oregonstate.edu/search/?P=QS%20472","No Sustainability Content"]
[null,"SLCS","QS",524,"QS 524","TRANS/GENDER POLITICS","Grad","https://secure.oregonstate.edu/ap/cps/documents/view/115161","No Sustainability Content"]
[null,"SLCS","QS",531,"QS 531","QUEER OF COLOR CRITIQUES. (4 Credits)","Grad","https://catalog.oregonstate.edu/search/?P=QS%20531","No Sustainability Content"]
[null,"SLCS","QS",569,"QS 569","TOPICS IN JOTERIA STUDIES. (3 Credits)","Grad","https://secure.oregonstate.edu/ap/cps/documents/view/106681","No Sustainability Content"]
[null,"SLCS","QS",572,"QS 572","INDIGENOUS 2SPIRIT STUDIES","Grad","https://catalog.oregonstate.edu/search/?P=QS%20572","No Sustainability Content"]
[null,"SHPR","REL",201,"REL 201","STUDY OF PEACE AND THE CAUSES OF CONFLICT. (3 Credits)","Undergrad","https://catalog.oregonstate.edu/search/?P=REL%20201","No Sustainability Content"]
[null,"SHPR","REL",202,"REL 202","INTRO TO RELIGIOUS STUDIES","Undergrad","https://secure.oregonstate.edu/ap/cps/documents/view/118201","No Sustainability Content"]
[null,"SHPR","REL",206,"REL 206","*RELIGIOUS ETHICS AND MORAL PROBLEMS. (4 Credits)",{"$f":"IF(D3650>499,\"Grad\", \"Undergrad\")","v":"Undergrad"},"https://secure.oregonstate.edu/ap/cps/documents/view/123173","No Sustainability Content"]
[null,"SHPR","REL",208,"REL 208","INTRO TO BUDDHIST TRADITIONS","Undergrad","https://secure.oregonstate.edu/ap/cps/documents/view/122806","No Sustainability Content"]
[null,"SHPR","REL",213,"REL 213","*INTRO TO HINDU TRADITIONS","Undergrad","https://secure.oregonstate.edu/ap/cps/documents/view/119477","No Sustainability Content"]
[null,"SHPR","REL",214,"REL 214","*INTRO TO ISLAMIC TRADITIONS","Undergrad","https://secure.oregonstate.edu/ap/cps/documents/view/122883","No Sustainability Content"]
[null,"SHPR","REL",215,"REL 215","*INTRO TO JEWISH TRADITIONS","Undergrad","https://secure.oregonstate.edu/ap/cps/documents/view/122220","No Sustainability Content"]
[null,"SHPR","REL",220,"REL 220","*WORLD-VIEWS & VALUES IN BIBLE","Undergrad","https://secure.oregonstate.edu/ap/cps/documents/view/122881","No Sustainability Content"]
[null,"SHPR","REL",310,"REL 310","*CRITICS OF RELIGION. (4 Credits)","Undergrad","https://catalog.oregonstate.edu/search/?P=REL%20310","No Sustainability Content"]
[null,"SHPR","REL",312,"REL 312","*ASIAN THOUGHT. (4 Credits)","Undergrad","https://secure.oregonstate.edu/ap/cps/documents/view/122916","No Sustainability Content"]
[null,"SHPR","REL",315,"REL 315","*GANDHI AND NONVIOLENCE","Undergrad","https://secure.oregonstate.edu/ap/cps/documents/view/122912","No Sustainability Content"]
[null,"SHPR","REL",316,"REL 316","INTELLECTUAL ISSUES OF MEXICO AND MEXICAN AMERICANS. (4 Credits)","Undergrad","https://catalog.oregonstate.edu/search/?P=REL%20316","No Sustainability Content"]
[null,"SHPR","REL",324,"REL 324","*ANCIENT JEWISH HISTORY. (4 Credits)","Undergrad","https://catalog.oregonstate.edu/search/?P=REL%20324","No Sustainability Content"]
[null,"SHPR","REL",325,{"$f":"TRIM(C3661)&\" \"&TRIM(D3661)","v":"REL 325"},"*EARLY CHRISTIANITY: ORIGINS","Undergrad","https://secure.oregonstate.edu/ap/cps/documents/view/128354","No Sustainability Content"]
[null,"SHPR","REL",327,"REL 327","HISTORY OF MEDIEVAL EUROPE. (4 Credits)","Undergrad","https://catalog.oregonstate.edu/search/?P=REL%20327","No Sustainability Content"]
[null,"SHPR","REL",328,"REL 328","HISTORY OF MEDIEVAL EUROPE","Undergrad","https://catalog.oregonstate.edu/search/?P=REL%20328","No Sustainability Content"]
[null,"SHPR","REL",330,"REL 330","HISTORY OF EARLY MODERN EUROPE","Undergrad","https://catalog.oregonstate.edu/search/?P=REL%20330","No Sustainability Content"]
[null,"SHPR","REL",333,"REL 333","MEDIEVAL & EARLY MODERN SPAIN","Undergrad","https://catalog.oregonstate.edu/search/?P=REL%20333","No Sustainability Content"]
[null,"SHPR","REL",338,"REL 338","Hitler’s Europe","Undergrad","https://secure.oregonstate.edu/ap/cps/documents/view/117037","No Sustainability Content"]
[null,"SHPR","REL",344,"REL 344","*PACIFISM, JUST WAR, TERRORISM","Undergrad","https://secure.oregonstate.edu/ap/cps/documents/view/122918","No Sustainability Content"]
[null,"SHPR","REL",350,"REL 350","*MODERN LATIN AMERICA","Undergrad","https://catalog.oregonstate.edu/search/?P=REL%20350","No Sustainability Content"]
[null,"SHPR","REL",371,"REL 371","*PHILOSOPHIES OF CHINA","Undergrad","https://catalog.oregonstate.edu/search/?P=REL%20371","No Sustainability Content"]
[null,"SHPR","REL",378,"REL 378","*RELIGION AND GENDER: A GLOBAL PERSPECTIVE. (4 Credits)","Undergrad","https://secure.oregonstate.edu/ap/cps/documents/view/130944","No Sustainability Content"]
[null,"SHPR","REL",387,"REL 387","*ISLAMIC CIVILIZATION","Undergrad","https://catalog.oregonstate.edu/search/?P=REL%20387","No Sustainability Content"]
[null,"SHPR","REL",388,"REL 388","*ISLAMIC CIVILIZATION","Undergrad","https://catalog.oregonstate.edu/search/?P=REL%20388","No Sustainability Content"]
[null,"SHPR","REL",407,"REL 407","^SEMINAR. (1-16 Credits)","Undergrad","https://secure.oregonstate.edu/ap/cps/documents/view/133491","No Sustainability Content"]
[null,"SHPR","REL",411,"REL 411","GREAT FIGURES IN PHILOSOPHY. (4 Credits)","Undergrad","https://catalog.oregonstate.edu/search/?P=REL%20411","No Sustainability Content"]
[null,"SHPR","REL",430,{"$f":"TRIM(C3675)&\" \"&TRIM(D3675)","v":"REL 430"},"HISTORY OF BUDDHIST PHILOSOPHY","Undergrad","https://secure.oregonstate.edu/ap/cps/documents/view/123462","No Sustainability Content"]
[null,"SHPR","REL",431,"REL 431","BUDDHISM, NON-VIOLENCE, AND SOCIAL JUSTICE. (4 Credits)","Undergrad","https://secure.oregonstate.edu/ap/cps/documents/view/123503","No Sustainability Content"]
[null,"SHPR","REL",432,{"$f":"TRIM(C3677)&\" \"&TRIM(D3677)","v":"REL 432"},"YOGA AND TANTRIC TRADITIONS","Undergrad","https://secure.oregonstate.edu/ap/cps/documents/view/123283","No Sustainability Content"]
[null,"SHPR","REL",433,"REL 433","*THEORY AND PRACTICE OF MODERN YOGA. (4 Credits)","Undergrad","https://catalog.oregonstate.edu/search/?P=REL%20433","No Sustainability Content"]
[null,"SHPR","REL",436,"REL 436","PHILOSOPHY AND RELIGION. (3 Credits)","Undergrad","https://secure.oregonstate.edu/ap/cps/documents/view/123412","No Sustainability Content"]
[null,"SHPR","REL",455,"REL 455","DEATH AND DYING","Undergrad","https://secure.oregonstate.edu/ap/cps/documents/view/103542","No Sustainability Content"]
[null,"SHPR","REL",470,"REL 470","RELIGION IN THE AMERICAN WEST","Undergrad","https://catalog.oregonstate.edu/search/?P=REL%20470","No Sustainability Content"]
[null,"SHPR","REL",511,"REL 511","GREAT FIGURES IN PHILOSOPHY. (4 Credits)","Grad","https://catalog.oregonstate.edu/search/?P=REL%20511","No Sustainability Content"]
[null,"SHPR","REL",530,"REL 530","HISTORY OF BUDDHIST PHILOSOPHY","Grad","https://secure.oregonstate.edu/ap/cps/documents/view/123462","No Sustainability Content"]
[null,"SHPR","REL",531,"REL 531","BUDDHISM, NON-VIOLENCE, AND SOCIAL JUSTICE. (4 Credits)","Grad","https://secure.oregonstate.edu/ap/cps/documents/view/123503","No Sustainability Content"]
[null,"SHPR","REL",532,"REL 532","YOGA AND TANTRIC TRADITIONS","Grad","https://secure.oregonstate.edu/ap/cps/documents/view/123283","No Sustainability Content"]
[null,"SHPR","REL",533,"REL 533","THEORY AND PRACTICE OF MODERN YOGA. (4 Credits)","Grad","https://catalog.oregonstate.edu/search/?P=REL%20533","No Sustainability Content"]
[null,"SHPR","REL",536,"REL 536","PHILOSOPHY AND RELIGION. (3 Credits)","Grad","https://secure.oregonstate.edu/ap/cps/documents/view/123412","No Sustainability Content"]
[null,"SHPR","REL",555,"REL 555","DEATH AND DYING","Grad","https://secure.oregonstate.edu/ap/cps/documents/view/103542","No Sustainability Content"]
[null,"SHPR","REL",570,"REL 570","RELIGION IN THE AMERICAN WEST","Grad","https://catalog.oregonstate.edu/search/?P=REL%20570","No Sustainability Content"]
[null,"SNSE","RHP",114,"RHP 114","INTRODUCTION TO NUCLEAR ENGINEERING AND RADIATION HEALTH PHYSICS I","Undergrad","https://secure.oregonstate.edu/ap/cps/documents/view/113476","No Sustainability Content"]
[null,"SNSE","RHP",115,"RHP 115","INTRODUCTION TO NUCLEAR ENGINEERING AND RADIATION HEALTH PHYSICS II","Undergrad","https://secure.oregonstate.edu/ap/cps/documents/view/113486","No Sustainability Content"]
[null,"SNSE","RHP",234,"RHP 234","Nuclear and Radiation Physics I","Undergrad","https://secure.oregonstate.edu/ap/cps/documents/view/114055","No Sustainability Content"]
[null,"SNSE","RHP",235,"RHP 235","Nuclear and Radiation Physics II","Undergrad","https://secure.oregonstate.edu/ap/cps/documents/view/114000","No Sustainability Content"]
[null,"SNSE","RHP",333,"RHP 333","MATHEMATICAL METHODS FOR NUCLEAR ","Undergrad","https://secure.oregonstate.edu/ap/cps/documents/view/100355","No Sustainability Content"]
[null,"SNSE","RHP",435,"RHP 435","ENGINEERING AND RADIATION HEALTH PHYSICS","Undergrad","https://secure.oregonstate.edu/ap/cps/documents/view/10403","No Sustainability Content"]
[null,"SNSE","RHP",474,"RHP 474","NUCLEAR SYSYEMS DESIGN I & II","Undergrad","https://secure.oregonstate.edu/ap/cps/documents/view/120501","No Sustainability Content"]
[null,"SNSE","RHP",475,"RHP 475","NUCLEAR SYSYEMS DESIGN I & II","Undergrad","https://secure.oregonstate.edu/ap/cps/documents/view/95170","No Sustainability Content"]
[null,"SNSE","RHP",481,"RHP 481","INTRODUCTION TO NUCLEAR ENGINEERING AND RADIATION HEALTH PHYSICS I","Undergrad","https://secure.oregonstate.edu/ap/cps/documents/view/8833","No Sustainability Content"]
[null,"SNSE","RHP",483,"RHP 483","RADIATION BIOLOGY","Undergrad","https://secure.oregonstate.edu/ap/cps/documents/view/115113","No Sustainability Content"]
[null,"SNSE","RHP",516,"RHP 516","RADIOCHEMISTRY","Grad","https://secure.oregonstate.edu/ap/cps/documents/view/99000","No Sustainability Content"]
[null,"SNSE","RHP",517,"RHP 517","RADIONUCLIDES IN LIFE SCIENCES","Grad","https://secure.oregonstate.edu/ap/cps/documents/view/10361","No Sustainability Content"]
[null,"SNSE","RHP",519,"RHP 519","RADIOCHEMICAL ANALYSIS ","Grad","https://secure.oregonstate.edu/ap/cps/documents/view/118314","No Sustainability Content"]
[null,"SNSE","RHP",521,"RHP 521","Radiological Anatomy and Physiology","Grad","https://secure.oregonstate.edu/ap/cps/documents/view/116275","No Sustainability Content"]
[null,"SNSE","RHP",535,"RHP 535","RADIATION SHIELDING AND EXTERNAL DOSIMETRY ","Grad","https://secure.oregonstate.edu/ap/cps/documents/view/10403","No Sustainability Content"]
[null,"SNSE","RHP",536,"RHP 536","Advanced Radiation Detection and Measurement","Grad","https://secure.oregonstate.edu/ap/cps/documents/view/100300","No Sustainability Content"]
[null,"SNSE","RHP",537,"RHP 537","Digital Radiation Measurement and Spectroscopy","Grad","https://secure.oregonstate.edu/ap/cps/documents/view/100199","No Sustainability Content"]
[null,"SNSE","RHP",574,"RHP 574","NUCLEAR SYSYEMS DESIGN I & II","Grad","https://secure.oregonstate.edu/ap/cps/documents/view/120501","No Sustainability Content"]
[null,"SNSE","RHP",575,"RHP 575","NUCLEAR SYSYEMS DESIGN I & II","Grad","https://secure.oregonstate.edu/ap/cps/documents/view/95170","No Sustainability Content"]
[null,"SNSE","RHP",582,"RHP 582","Applied Radiation Safety ","Grad","https://secure.oregonstate.edu/ap/cps/documents/view/100295","No Sustainability Content"]
[null,"SNSE","RHP",583,"RHP 583","RADIATION BIOLOGY","Grad","https://secure.oregonstate.edu/ap/cps/documents/view/115113","No Sustainability Content"]
[null,"SNSE","RHP",584,"RHP 584","Radiation Biology II","Grad","https://secure.oregonstate.edu/ap/cps/documents/view/116291","No Sustainability Content"]
[null,"SNSE","RHP",590,"RHP 590","INTERNAL DOSIMETRY","Grad","https://secure.oregonstate.edu/ap/cps/documents/view/99670","No Sustainability Content"]
[null,"ANRS","RNG",346,"RNG 346","TOPICS IN WILDLAND FIRE","Undergrad","https://secure.oregonstate.edu/ap/cps/documents/view/6570","No Sustainability Content"]
[null,"ANRS","RNG",352,"RNG 352","RANGE ECOLOGY II-SHRUBLANDS",{"$f":"IF(D3714>499,\"Grad\", \"Undergrad\")","v":"Undergrad"},"https://secure.oregonstate.edu/ap/cps/documents/view/7733","No Sustainability Content"]
[null,"ANRS","RNG",455,{"$f":"TRIM(C3715)&\" \"&TRIM(D3715)","v":"RNG 455"},"RIPARIAN ECOHYDR & MANAGEMENT","Undergrad","https://secure.oregonstate.edu/ap/cps/documents/view/127268","No Sustainability Content"]
[null,"ANRS","RNG",555,{"$f":"TRIM(C3716)&\" \"&TRIM(D3716)","v":"RNG 555"},"RIPARIAN ECOHYDR & MANAGEMENT","Grad","https://secure.oregonstate.edu/ap/cps/documents/view/127268","No Sustainability Content"]
[null,"MIME","ROB",514,{"$f":"TRIM(C3717)&\" \"&TRIM(D3717)","v":"ROB 514"},"INTRODUCTION TO ROBOTICS","Grad","https://secure.oregonstate.edu/ap/cps/documents/view/127670","No Sustainability Content"]
[null,"MIME","ROB",521,{"$f":"TRIM(C3718)&\" \"&TRIM(D3718)","v":"ROB 521"},"RESEARCH ROBOTICS","Grad","https://secure.oregonstate.edu/ap/cps/documents/view/129318","No Sustainability Content"]
[null,"MIME","ROB",534,"ROB 534","SEQUENTIAL DECISION MAKING IN ROBOTICS. (4 Credits)","Grad","https://secure.oregonstate.edu/ap/cps/documents/view/116764","No Sustainability Content"]
[null,"MIME","ROB",541,"ROB 541","GEOMETRIC MECHANICS","Grad","https://secure.oregonstate.edu/ap/cps/documents/view/117951","No Sustainability Content"]
[null,"MIME","ROB",542,"ROB 542","ACTUATOR DYNAMICS. (4 Credits)","Grad","https://secure.oregonstate.edu/ap/cps/documents/view/118483","No Sustainability Content"]
[null,"MIME","ROB",562,"ROB 562","HUMAN CONTROL SYSTEMS. (4 Credits)","Grad","https://secure.oregonstate.edu/ap/cps/documents/view/122514","No Sustainability Content"]
[null,"MIME","ROB",564,"ROB 564","SOFT ROBOTICS. (4 Credits)","Grad","https://secure.oregonstate.edu/ap/cps/documents/view/121365","No Sustainability Content"]
[null,"MIME","ROB",568,"ROB 568","SOCIAL ROBOTICS. (4 Credits)","Grad","https://secure.oregonstate.edu/ap/cps/documents/view/132185","No Sustainability Content"]
[null,"APEC","RS",512,"RS 512","INTRODUCTION TO RURAL STUDIES. (2 Credits)","Grad","https://secure.oregonstate.edu/ap/cps/documents/view/112295","No Sustainability Content"]
[null,"SED","SED",321,"SED 321","Teaching and Learning with Computer-based Technologies","Undergrad","https://secure.oregonstate.edu/ap/cps/documents/view/3468","No Sustainability Content"]
[null,"SED","SED",413,{"$f":"TRIM(C3727)&\" \"&TRIM(D3727)","v":"SED 413"},"INQUIRY IN SCIENCE EDUCATION","Undergrad","https://secure.oregonstate.edu/ap/cps/documents/view/128502","No Sustainability Content"]
[null,"SED","SED",414,"SED 414","INQUIRY IN MATH EDUCATION","Undergrad","https://catalog.oregonstate.edu/search/?P=SED%20414","No Sustainability Content"]
[null,"SED","SED",416,{"$f":"TRIM(C3729)&\" \"&TRIM(D3729)","v":"SED 416"},"INQUIRY IN SCI AND MATH","Undergrad","https://secure.oregonstate.edu/ap/cps/documents/view/127932","No Sustainability Content"]
[null,"SED","SED",417,"SED 417","Teaching Quantitative Reasoning in Mathematics and Science","Undergrad","https://secure.oregonstate.edu/ap/cps/documents/view/110986","No Sustainability Content"]
[null,"SED","SED",419,"SED 419","TEACHING MATHEMATICAL MODELING IN STEM. (3 Credits)","Undergrad","https://catalog.oregonstate.edu/search/?P=SED%20419","No Sustainability Content"]
[null,"SED","SED",431,"SED 431","OVERVIEW OF FREE-CHOICE LEARNING. (3 Credits)","Undergrad","https://catalog.oregonstate.edu/search/?P=SED%20431","No Sustainability Content"]
[null,"SED","SED",435,{"$f":"TRIM(C3733)&\" \"&TRIM(D3733)","v":"SED 435"},"COMM SCIENCE INFORMAL AUDIENCE","Undergrad","https://secure.oregonstate.edu/ap/cps/documents/view/128509","No Sustainability Content"]
[null,"SED","SED",473,"SED 473","SCIENCE PEDAGOGY & TECH I","Undergrad","https://secure.oregonstate.edu/ap/cps/documents/view/100549","No Sustainability Content"]
[null,"SED","SED",474,"SED 474","MATH PEDAGOGY & TECHNOLOGY I","Undergrad","https://secure.oregonstate.edu/ap/cps/documents/view/100868","No Sustainability Content"]
[null,"SED","SED",476,"SED 476","MATHEMATICS PEDAGOGY AND TECHNOLOGY II. (4 Credits)","Undergrad","https://catalog.oregonstate.edu/search/?P=SED%20476","No Sustainability Content"]
[null,"SED","SED",477,"SED 477","SCIENCE PEDAGOGY AND TECHNOLOGY II. (4 Credits)","Undergrad","https://catalog.oregonstate.edu/search/?P=SED%20477","No Sustainability Content"]
[null,"SED","SED",491,"SED 491","Science/Mathematics Content Standards and Curriculum Development for Middle Level ","Undergrad","https://secure.oregonstate.edu/ap/cps/documents/view/5506","No Sustainability Content"]
[null,"SED","SED",494,"SED 494","Science/Mathematics Content Standards & Curriculum Development for High School","Undergrad","https://secure.oregonstate.edu/ap/cps/documents/view/5507","No Sustainability Content"]
[null,"SED","SED",513,{"$f":"TRIM(C3740)&\" \"&TRIM(D3740)","v":"SED 513"},"INQUIRY IN SCIENCE EDUCATION","Grad","https://secure.oregonstate.edu/ap/cps/documents/view/128502","No Sustainability Content"]
[null,"SED","SED",514,"SED 514","INQUIRY IN MATHEMATICS AND MATHEMATICS EDUCATION. (3 Credits)","Grad","https://catalog.oregonstate.edu/search/?P=SED%20514","No Sustainability Content"]
[null,"SED","SED",516,{"$f":"TRIM(C3742)&\" \"&TRIM(D3742)","v":"SED 516"},"INQUIRY IN SCI AND MATH","Grad","https://secure.oregonstate.edu/ap/cps/documents/view/127932","No Sustainability Content"]
[null,"SED","SED",517,"SED 517","Teaching Quantitative Reasoning in Mathematics and Science","Grad","https://secure.oregonstate.edu/ap/cps/documents/view/110986","No Sustainability Content"]
[null,"SED","SED",519,"SED 519","TEACHING MATHEMATICAL MODELING IN STEM. (3 Credits)","Grad","https://catalog.oregonstate.edu/search/?P=SED%20519","No Sustainability Content"]
[null,"SED","SED",520,"SED 520","TECHNOLOGY FOR MATH AND SCIENCE EDUCATION. (3 Credits)","Grad","https://secure.oregonstate.edu/ap/cps/documents/view/121900","No Sustainability Content"]
[null,"SED","SED",521,"SED 521","Teaching Mathematics and Science with Digital and Video Technologies","Grad","https://secure.oregonstate.edu/ap/cps/documents/view/104924","No Sustainability Content"]
[null,"SED","SED",522,"SED 522","Dynamic Spreadsheets as Learning Tools in Science and Mathematics","Grad","https://secure.oregonstate.edu/ap/cps/documents/view/10140","No Sustainability Content"]
[null,"SED","SED",523,"SED 523","Science/Mathematics Strategies and Organizational Structures for Middle Level \n","Grad","https://secure.oregonstate.edu/ap/cps/documents/view/4722","No Sustainability Content"]
[null,"SED","SED",531,"SED 531","OVERVIEW OF FREE-CHOICE LEARNING. (3 Credits)","Grad","https://catalog.oregonstate.edu/search/?P=SED%20531","No Sustainability Content"]
[null,"SED","SED",535,"SED 535","COMM SCIENCE INFORMAL AUDIENCE","Grad","https://secure.oregonstate.edu/ap/cps/documents/view/120578","No Sustainability Content"]
[null,"SED","SED",540,"SED 540","Field and Online Learning of Geoscience Concepts","Grad","https://secure.oregonstate.edu/ap/cps/documents/view/112583","No Sustainability Content"]
[null,"SED","SED",564,"SED 564","ENGINEERING AND SCIENCE IN THE LIVES OF STUDENTS. (3 Credits)","Grad","https://secure.oregonstate.edu/ap/cps/documents/view/121901","No Sustainability Content"]
[null,"SED","SED",565,"SED 565","Inquiring into Science and Mathematics Learning and Teaching","Grad","https://secure.oregonstate.edu/ap/cps/documents/view/6182","No Sustainability Content"]
[null,"SED","SED",566,"SED 566","FOSTERING REFLECTIVE DISCOURSE","Grad","https://secure.oregonstate.edu/ap/cps/documents/view/101022","No Sustainability Content"]
[null,"SED","SED",568,"SED 568","Enhancing Literacy Learning in Science and Mathematics Contexts","Grad","https://secure.oregonstate.edu/ap/cps/documents/view/101263\nhttps://secure.oregonstate.edu/ap/cps/documents/view/101264","No Sustainability Content"]
[null,"SED","SED",573,"SED 573","SCIENCE PEDAGOGY & TECH I","Grad","https://secure.oregonstate.edu/ap/cps/documents/view/100549","No Sustainability Content"]
[null,"SED","SED",574,"SED 574","MATH PEDAGOGY & TECHNOLOGY I","Grad","https://secure.oregonstate.edu/ap/cps/documents/view/100868","No Sustainability Content"]
[null,"SED","SED",576,"SED 576","MATH PEDAGOGY & TECHNOLOGY II","Grad","https://secure.oregonstate.edu/ap/cps/documents/view/100807","No Sustainability Content"]
[null,"SED","SED",577,"SED 577","SCIENCE PEDAGOGY & TECH II","Grad","https://secure.oregonstate.edu/ap/cps/documents/view/100553","No Sustainability Content"]
[null,"SED","SED",581,"SED 581","PROFESSIONAL DEVELOPMENT AND PRACTICUM IN MATHEMATICS. (3 Credits)","Grad","https://secure.oregonstate.edu/ap/cps/documents/view/7514","No Sustainability Content"]
[null,"SED","SED",583,"SED 583","SOCIO-CULTURAL DIMEN LEARNING","Grad","https://secure.oregonstate.edu/ap/cps/documents/view/7685","No Sustainability Content"]
[null,"SED","SED",584,"SED 584","PHYSICAL DIMENSIONS OF FCL","Grad","https://secure.oregonstate.edu/ap/cps/documents/view/7092","No Sustainability Content"]
[null,"SED","SED",594,"SED 594","ADVANCED INSTRUCTIONAL STRATEGIES IN SCIENCE AND MATHEMATICS. (3 Credits)","Grad","https://secure.oregonstate.edu/ap/cps/documents/view/121903","No Sustainability Content"]
[null,"SED","SED",595,"SED 595","ASSESSMENT AND EVALUATION","Grad","https://secure.oregonstate.edu/ap/cps/documents/view/121902","No Sustainability Content"]
[null,"SED","SED",597,"SED 597","PROFESSIONAL DEVELOPMENT IN MATHEMATICS AND SCIENCE EDUCATION. (3 Credits)","Grad","https://secure.oregonstate.edu/ap/cps/documents/view/7515","No Sustainability Content"]
[null,"SED","SED",598,"SED 598","MATH AND SCIENCE CURRICULUM","Grad","https://secure.oregonstate.edu/ap/cps/documents/view/121904","No Sustainability Content"]
[null,"SED","SED",611,"SED 611","SURVEY OF RESEARCH ON TEACHING","Grad","https://secure.oregonstate.edu/ap/cps/documents/view/10512","No Sustainability Content"]
[null,"SED","SED",612,"SED 612","QUANT RES DESIGN&CRIT ANALYSIS","Grad","https://secure.oregonstate.edu/ap/cps/documents/view/9776","No Sustainability Content"]
[null,"SED","SED",613,"SED 613","LEARNING THEORY","Grad","https://secure.oregonstate.edu/ap/cps/documents/view/10487","No Sustainability Content"]
[null,"SED","SED",621,"SED 621","SURVEY OF RESEARCH ON LEARN. (3 Credits)","Grad","https://secure.oregonstate.edu/ap/cps/documents/view/94700","No Sustainability Content"]
[null,"SED","SED",622,"SED 622","QUAL RESEARCH TECHNIQUES","Grad","https://secure.oregonstate.edu/ap/cps/documents/view/10224","No Sustainability Content"]
[null,"SED","SED",623,"SED 623","CURRICULUM THEORY. (3 Credits)","Grad","https://secure.oregonstate.edu/ap/cps/documents/view/10164","No Sustainability Content"]
[null,"SPP","SOC",205,"SOC 205","*INSTITUTIONS & SOCIAL CHANGE","Undergrad","https://secure.oregonstate.edu/ap/cps/documents/view/3573","No Sustainability Content"]
[null,"SPP","SOC",313,"SOC 313","SOC OF INTIMATE RELATIONSHIPS","Undergrad","https://secure.oregonstate.edu/ap/cps/documents/view/126238","No Sustainability Content"]
[null,"SPP","SOC",315,"SOC 315","^METHODS I: RESEARCH DESIGN","Undergrad","https://secure.oregonstate.edu/ap/cps/documents/view/95870","No Sustainability Content"]
[null,"SPP","SOC",316,"SOC 316","METHODS II: QUANT ANALYSIS","Undergrad","https://secure.oregonstate.edu/ap/cps/documents/view/95880","No Sustainability Content"]
[null,"SPP","SOC",345,{"$f":"TRIM(C3777)&\" \"&TRIM(D3777)","v":"SOC 345"},"*CRIME & VIOL IN INTIMATE REL","Undergrad","https://secure.oregonstate.edu/ap/cps/documents/view/127024","No Sustainability Content"]
[null,"SPP","SOC",355,"SOC 355","DEATH AND DYING",{"$f":"IF(D3778>499,\"Grad\", \"Undergrad\")","v":"Undergrad"},"https://secure.oregonstate.edu/ap/cps/documents/view/103542","No Sustainability Content"]
[null,"SPP","SOC",371,"SOC 371","*SOCIAL MEDIA AND EVERYDAY LIFE. (4 Credits)","Undergrad","https://secure.oregonstate.edu/ap/cps/documents/view/132639","No Sustainability Content"]
[null,"SPP","SOC",418,"SOC 418","QUALITATIVE RESEARCH METHODS. (4 Credits)","Undergrad","https://catalog.oregonstate.edu/search/?P=SOC%20418","No Sustainability Content"]
[null,"SPP","SOC",422,"SOC 422","SOCIOLOGY OF ORGANIZATIONS. (4 Credits)","Undergrad","https://catalog.oregonstate.edu/search/?P=SOC%20422","No Sustainability Content"]
[null,"SPP","SOC",430,{"$f":"TRIM(C3782)&\" \"&TRIM(D3782)","v":"SOC 430"},"GENDER AND SOCIETY","Undergrad","https://secure.oregonstate.edu/ap/cps/documents/view/133497","No Sustainability Content"]
[null,"SPP","SOC",438,"SOC 438","US IMMIGRATION ISSUES","Undergrad","https://catalog.oregonstate.edu/search/?P=SOC%20438","No Sustainability Content"]
[null,"SPP","SOC",442,"SOC 442","SOCIOLOGY OF DRUG USE & ABUSE","Undergrad","https://catalog.oregonstate.edu/search/?P=SOC%20442","No Sustainability Content"]
[null,"SPP","SOC",444,"SOC 444","PRISONS AND COMMUNITIES","Undergrad","https://catalog.oregonstate.edu/search/?P=SOC%20444","No Sustainability Content"]
[null,"SPP","SOC",449,"SOC 449","LAW, CRIME, AND POLICY","Undergrad","https://catalog.oregonstate.edu/search/?P=SOC%20449","No Sustainability Content"]
[null,"SPP","SOC",518,"SOC 518","QUALITATIVE RESEARCH METHODS. (4 Credits)","Grad","https://catalog.oregonstate.edu/search/?P=SOC%20518","No Sustainability Content"]
[null,"SPP","SOC",522,"SOC 522","SOCIOLOGY OF ORGANIZATIONS. (4 Credits)","Grad","https://catalog.oregonstate.edu/search/?P=SOC%20522","No Sustainability Content"]
[null,"SPP","SOC",538,"SOC 538","US IMMIGRATION ISSUES","Grad","https://catalog.oregonstate.edu/search/?P=SOC%20538","No Sustainability Content"]
[null,"SPP","SOC",542,"SOC 542","SOCIOLOGY OF DRUG USE & ABUSE","Grad","https://catalog.oregonstate.edu/search/?P=SOC%20542","No Sustainability Content"]
[null,"SPP","SOC",544,"SOC 544","PRISONS AND COMMUNITIES","Grad","https://catalog.oregonstate.edu/search/?P=SOC%20544","No Sustainability Content"]
[null,"SPP","SOC",549,"SOC 549","LAW, CRIME, AND POLICY","Grad","https://catalog.oregonstate.edu/search/?P=SOC%20549","No Sustainability Content"]
[null,"CSS","SOIL",101,{"$f":"TRIM(C3793)&\" \"&TRIM(D3793)","v":"SOIL 101"},"INTRO TO CROP, SOIL, INSECT","Undergrad","https://secure.oregonstate.edu/ap/cps/documents/view/132081","No Sustainability Content"]
[null,"CSS","SOIL",395,{"$f":"TRIM(C3794)&\" \"&TRIM(D3794)","v":"SOIL 395"},"*WORLD SOIL RESOURCES","Undergrad","https://secure.oregonstate.edu/ap/cps/documents/view/133730","No Sustainability Content"]
[null,"CSS","SOIL",512,"SOIL 512","METHODS OF SOIL ANALYSIS - FIELD. (1 Credit)","Grad","https://secure.oregonstate.edu/ap/cps/documents/view/130203 ","No Sustainability Content"]
[null,"CSS","SOIL",514,"SOIL 514","METHODS OF SOIL ANALYSIS - LABORATORY. (2 Credits)","Grad","https://secure.oregonstate.edu/ap/cps/documents/view/130214","No Sustainability Content"]
[null,"SLCS","SPAN",221,"SPAN 221","SPANISH FOR MEDICAL PROFESSIONS I. (4 Credits)","Undergrad","https://secure.oregonstate.edu/ap/cps/documents/view/122922","No Sustainability Content"]
[null,"SLCS","SPAN",311,"SPAN 311","ADVANCED SPANISH GRAMMAR","Undergrad","https://secure.oregonstate.edu/ap/cps/documents/view/101326","No Sustainability Content"]
[null,"SLCS","SPAN",312,"SPAN 312","INTERMEDIATE WRITING SKILLS","Undergrad","https://secure.oregonstate.edu/ap/cps/documents/view/100508","No Sustainability Content"]
[null,"SLCS","SPAN",317,"SPAN 317","DIRECTED READ & WRITING SPAN","Undergrad","https://secure.oregonstate.edu/ap/cps/documents/view/100502","No Sustainability Content"]
[null,"SLCS","SPAN",333,"SPAN 333","CULTURES OF SPAIN AND PORTUGAL","Undergrad","https://secure.oregonstate.edu/ap/cps/documents/view/5711","No Sustainability Content"]
[null,"SLCS","SPAN",345,"SPAN 345","MULTIMODAL LITERACIES: SPANISH","Undergrad","https://secure.oregonstate.edu/ap/cps/documents/view/113941","No Sustainability Content"]
[null,"SLCS","SPAN",366,"SPAN 366","LANGUAGE AND IDENTITY: SPANISH. (2 Credits)","Undergrad","https://secure.oregonstate.edu/ap/cps/documents/view/121716","No Sustainability Content"]
[null,"SLCS","SPAN",412,"SPAN 412","ADVANCED COMPOSITION. (3 Credits)","Undergrad","https://catalog.oregonstate.edu/search/?P=SPAN%20412","No Sustainability Content"]
[null,"SLCS","SPAN",413,"SPAN 413","ADVANCED COMMUNICATION SKILLS","Undergrad","https://catalog.oregonstate.edu/search/?P=SPAN%20413","No Sustainability Content"]
[null,"SLCS","SPAN",435,"SPAN 435","SPECIAL TOPICS IN LATIN AMERICAN CULTURE. (3 Credits)","Undergrad","https://catalog.oregonstate.edu/search/?P=SPAN%20435","No Sustainability Content"]
[null,"SLCS","SPAN",439,"SPAN 439","TOPICS IN MEXICAN CULTURE AS EVIDENCED THROUGH MEXICAN FILM. (3 Credits)","Undergrad","https://secure.oregonstate.edu/ap/cps/documents/view/3110","No Sustainability Content"]
[null,"SLCS","SPAN",441,"SPAN 441","CONTEMPORARY SHORT STORY. (3 Credits)","Undergrad","https://secure.oregonstate.edu/ap/cps/documents/view/116925","No Sustainability Content"]
[null,"SLCS","SPAN",453,"SPAN 453","SPANISH SOCIOLINGUISTICS. (3 Credits)","Undergrad","https://catalog.oregonstate.edu/search/?P=SPAN%20453","No Sustainability Content"]
[null,"SLCS","SPAN",512,"SPAN 512","ADVANCED COMPOSITION. (3 Credits)","Grad","https://catalog.oregonstate.edu/search/?P=SPAN%20512","No Sustainability Content"]
[null,"SLCS","SPAN",513,"SPAN 513","ADVANCED COMMUNICATION SKILLS. (3 Credits)","Grad","https://catalog.oregonstate.edu/search/?P=SPAN%20513","No Sustainability Content"]
[null,"SLCS","SPAN",535,"SPAN 535","SPECIAL TOPICS IN LATIN AMERICAN CULTURE. (3 Credits)","Grad","https://catalog.oregonstate.edu/search/?P=SPAN%20535","No Sustainability Content"]
[null,"SLCS","SPAN",552,"SPAN 552","INTRODUCTION TO SPANISH SOCIOLINGUISTICS. (3 Credits)","Grad","https://secure.oregonstate.edu/ap/cps/documents/view/7675","No Sustainability Content"]
[null,"SLCS","SPAN",553,"SPAN 553","SPANISH SOCIOLINGUISTICS. (3 Credits)","Grad","https://catalog.oregonstate.edu/search/?P=SPAN%20553","No Sustainability Content"]
[null,"SLCS","SPAN",569,"SPAN 569","TOPICS IN JOTERIA STUDIES. (3 Credits)","Grad","https://secure.oregonstate.edu/ap/cps/documents/view/106681","No Sustainability Content"]
[null,"SLCS","SPAN",570,"SPAN 570","GRADUATE SPANISH COORDINATED STUDIES. (1-15 Credits)","Grad","https://secure.oregonstate.edu/ap/cps/documents/view/100016","No Sustainability Content"]
[null,"SLCS","SSCI",211,{"$f":"TRIM(C3817)&\" \"&TRIM(D3817)","v":"SSCI 211"},"CAREER DEVELOPMENT IN THE SSCI","Undergrad","https://secure.oregonstate.edu/ap/cps/documents/view/128790","No Sustainability Content"]
[null,"SLCS","SSCI",301,{"$f":"TRIM(C3818)&\" \"&TRIM(D3818)","v":"SSCI 301"},"^QUALITATIVE RESEARCH METHOD","Undergrad","https://secure.oregonstate.edu/ap/cps/documents/view/125553","No Sustainability Content"]
[null,"ST","ST",201,"ST 201","PRINCIPLES OF STATISTICS","Undergrad","https://secure.oregonstate.edu/ap/cps/documents/view/108533","No Sustainability Content"]
[null,"ST","ST",202,"ST 202","PRINCIPLES OF STATISTICS","Undergrad","https://secure.oregonstate.edu/ap/cps/documents/view/108523","No Sustainability Content"]
[null,"ST","ST",351,"ST 351","INTRO TO STATISTICAL METHODS","Undergrad","https://secure.oregonstate.edu/ap/cps/documents/view/108525","No Sustainability Content"]
[null,"ST","ST",352,"ST 352","INTRO TO STATISTICAL METHODS","Undergrad","https://secure.oregonstate.edu/ap/cps/documents/view/108526","No Sustainability Content"]
[null,"ST","ST",439,"ST 439","SURVEY METHODS","Undergrad","https://catalog.oregonstate.edu/search/?P=ST%20439","No Sustainability Content"]
[null,"ST","ST",516,"ST 516","FOUNDATIONS OF DATA ANALYTICS","Grad","https://secure.oregonstate.edu/ap/cps/documents/view/126052","No Sustainability Content"]
[null,"ST","ST",517,"ST 517","DATA ANALYTICS I","Grad","https://secure.oregonstate.edu/ap/cps/documents/view/120812","No Sustainability Content"]
[null,"ST","ST",518,{"$f":"TRIM(C3826)&\" \"&TRIM(D3826)","v":"ST 518"},"DATA ANALYTICS II","Grad","https://secure.oregonstate.edu/ap/cps/documents/view/126346","No Sustainability Content"]
[null,"ST","ST",525,{"$f":"TRIM(C3827)&\" \"&TRIM(D3827)","v":"ST 525"},"APPLIED SURVIVAL ANALYSIS","Grad","https://secure.oregonstate.edu/ap/cps/documents/view/128351","No Sustainability Content"]
[null,"ST","ST",537,{"$f":"TRIM(C3828)&\" \"&TRIM(D3828)","v":"ST 537"},"DATA VISUALIZATION","Grad","https://secure.oregonstate.edu/ap/cps/documents/view/126292","No Sustainability Content"]
[null,"ST","ST",538,{"$f":"TRIM(C3829)&\" \"&TRIM(D3829)","v":"ST 538"},"METHODS FOR BIG DATA","Grad","https://secure.oregonstate.edu/ap/cps/documents/view/128159","No Sustainability Content"]
[null,"ST","ST",539,"ST 539","SURVEY METHODS","Grad","https://catalog.oregonstate.edu/search/?P=ST%20539","No Sustainability Content"]
[null,"ST","ST",558,{"$f":"TRIM(C3831)&\" \"&TRIM(D3831)","v":"ST 558"},"MULTIVARIATE ANALYTICS","Grad","https://secure.oregonstate.edu/ap/cps/documents/view/129032","No Sustainability Content"]
[null,"ST","ST",561,{"$f":"TRIM(C3832)&\" \"&TRIM(D3832)","v":"ST 561"},"THEORY OF STATISTICS","Grad","https://secure.oregonstate.edu/ap/cps/documents/view/134169","No Sustainability Content"]
[null,"ST","ST",565,"ST 565","TIME SERIES","Grad","https://secure.oregonstate.edu/ap/cps/documents/view/111857","No Sustainability Content"]
[null,"ST","ST",566,{"$f":"TRIM(C3834)&\" \"&TRIM(D3834)","v":"ST 566"},"TIME SERIES ANALYTICS","Grad","https://secure.oregonstate.edu/ap/cps/documents/view/130071","No Sustainability Content"]
[null,"ST","ST",567,"ST 567","SPATIAL STATISTICS. (3 Credits)","Grad","https://secure.oregonstate.edu/ap/cps/proposals/view/86892","No Sustainability Content"]
[null,"ST","ST",591,"ST 591","INTRODUCTION TO QUANTITATIVE GENOMICS. (3 Credits)","Grad","https://secure.oregonstate.edu/ap/cps/documents/view/131685 ","No Sustainability Content"]
[null,"ST","ST",592,"ST 592","STATISTICAL METHODS FOR GENOMICS RESEARCH. (3 Credits)","Grad","https://secure.oregonstate.edu/ap/cps/documents/view/126935","No Sustainability Content"]
[null,"ST","ST",595,"ST 595","CAPSTONE PROJECT. (3 Credits)","Grad","https://secure.oregonstate.edu/ap/cps/documents/view/133658","No Sustainability Content"]
[null,"CSS","SUS",350,"SUS 350","*SUSTAINABLE COMMUNITIES","Undergrad","https://secure.oregonstate.edu/ap/cps/documents/view/114928","No Sustainability Content"]
[null,"TCE","TCE",216,"TCE 216","Purpose, Structure, & Function of Education in a Democracy ","Undergrad","https://secure.oregonstate.edu/ap/cps/documents/view/10519","No Sustainability Content"]
[null,"TCE","TCE",424,"TCE 424","Teacher as Reflective Practitioner","Undergrad","https://secure.oregonstate.edu/ap/cps/documents/view/101554","No Sustainability Content"]
[null,"TCE","TCE",425,"TCE 425","Curriculum Implementation and Instructional Strategies for Grades  7-12",{"$f":"IF(D3842>499,\"Grad\", \"Undergrad\")","v":"Undergrad"},"https://secure.oregonstate.edu/ap/cps/documents/view/112087","No Sustainability Content"]
[null,"TCE","TCE",427,"TCE 427","Alternative Assessment for Middle and High School Teaching","Undergrad","https://secure.oregonstate.edu/ap/cps/documents/view/108788","No Sustainability Content"]
[null,"TCE","TCE",473,"TCE 473","INSTRUCTIONAL APPROACHES FOR ESOL/BILINGUAL EDUCATION","Undergrad","https://secure.oregonstate.edu/ap/cps/documents/view/112901","No Sustainability Content"]
[null,"TCE","TCE",476,"TCE 476","PARTNERSHIPS AND IDEOLOGIES IN ESOL/BILINGUAL EDUCATION","Undergrad","https://secure.oregonstate.edu/ap/cps/documents/view/114367","No Sustainability Content"]
[null,"TCE","TCE",479,"TCE 479","LINGUISTICS FOR ESOL/BILINGUAL TEACHERS","Undergrad","https://secure.oregonstate.edu/ap/cps/documents/view/110816","No Sustainability Content"]
[null,"TCE","TCE",512,"TCE 512","Psychology of the Adolescent","Grad","https://secure.oregonstate.edu/ap/cps/documents/view/121116","No Sustainability Content"]
[null,"TCE","TCE",515,"TCE 515","COUNSELING INTERNSHIP","Grad","https://secure.oregonstate.edu/ap/cps/documents/view/100002","No Sustainability Content"]
[null,"TCE","TCE",517,"TCE 517","Academic Writing for Masters Students","Grad","https://secure.oregonstate.edu/ap/cps/documents/view/100814","No Sustainability Content"]
[null,"TCE","TCE",528,"TCE 528","Assessment for Learning","Grad","https://secure.oregonstate.edu/ap/cps/documents/view/120984","No Sustainability Content"]
[null,"TCE","TCE",543,"TCE 543","Politics, Policy, and Advocacy in Education","Grad","https://secure.oregonstate.edu/ap/cps/documents/view/4435","No Sustainability Content"]
[null,"TCE","TCE",544,"TCE 544","Teaching Critical Literacy","Grad","https://secure.oregonstate.edu/ap/cps/documents/view/120994","No Sustainability Content"]
[null,"TCE","TCE",561,"TCE 561","Action Research","Grad","https://secure.oregonstate.edu/ap/cps/documents/view/120995","No Sustainability Content"]
[null,"TCE","TCE",569,"TCE 569","Statistics for Educators ","Grad","https://secure.oregonstate.edu/ap/cps/documents/view/101135","No Sustainability Content"]
[null,"TCE","TCE",570,"TCE 570","Statistics for Educators II ","Grad","https://secure.oregonstate.edu/ap/cps/documents/view/101134","No Sustainability Content"]
[null,"TCE","TCE",572,"TCE 572","FOUNDATIONS OF ESOL/BILINGUAL EDUCATION","Grad","https://secure.oregonstate.edu/ap/cps/documents/view/113129","No Sustainability Content"]
[null,"TCE","TCE",573,"TCE 573","INSTRUCTIONAL APPROACHES FOR ESOL/BILINGUAL EDUCATION","Grad","https://secure.oregonstate.edu/ap/cps/documents/view/112901","No Sustainability Content"]
[null,"TCE","TCE",576,"TCE 576","PARTNERSHIPS AND IDEOLOGIES IN ESOL/BILINGUAL EDUCATION","Grad","https://secure.oregonstate.edu/ap/cps/documents/view/114367","No Sustainability Content"]
[null,"TCE","TCE",578,"TCE 578","CRISIS, TRAUMA, & GRIEF COUNSELING  ","Grad","https://secure.oregonstate.edu/ap/cps/documents/view/10481","No Sustainability Content"]
[null,"TCE","TCE",579,"TCE 579","LINGUISTICS FOR ESOL/BILINGUAL TEACHERS","Grad","https://secure.oregonstate.edu/ap/cps/documents/view/110816","No Sustainability Content"]
[null,"TCE","TCE",596,"TCE 596","TECHNOLOGY FOR EDUCATORS","Grad","https://secure.oregonstate.edu/ap/cps/documents/view/108256","No Sustainability Content"]
[null,"TCE","TCE",633,"TCE 633","ADVANCED COUNSELING PRACTITIONER I ","Grad","https://secure.oregonstate.edu/ap/cps/documents/view/9997","No Sustainability Content"]
[null,"TCE","TCE",634,"TCE 634","ADVANCED COUNSELING PRACTITIONER II ","Grad","https://secure.oregonstate.edu/ap/cps/documents/view/9998","No Sustainability Content"]
[null,"TCE","TCE",671,"TCE 671","Advanced Group Counseling ","Grad","https://secure.oregonstate.edu/ap/cps/documents/view/4914","No Sustainability Content"]
[null,"FES","TOL",130,{"$f":"TRIM(C3865)&\" \"&TRIM(D3865)","v":"TOL 130"},"OUTDOOR AND ADVENTURE PROFS","Undergrad","https://secure.oregonstate.edu/ap/cps/documents/view/128032","No Sustainability Content"]
[null,"FES","TOL",132,"TOL 132","Foundations and History of Outdoor and Adventure Professions","Undergrad","https://secure.oregonstate.edu/ap/cps/documents/view/127688","No Sustainability Content"]
[null,"FES","TOL",270,"TOL 270","Pre-Internship Seminar","Undergrad","https://secure.oregonstate.edu/ap/cps/documents/view/121786","No Sustainability Content"]
[null,"EMT","TOX",360,"TOX 360","*THE WORLD OF POISONS","Undergrad","https://secure.oregonstate.edu/ap/cps/documents/view/7751","No Sustainability Content"]
[null,"EMT","TOX",554,"TOX 554","GENOME ORG STRUCT MAINTENANCE","Grad","https://catalog.oregonstate.edu/search/?P=TOX%20554","No Sustainability Content"]
[null,"EMT","TOX",575,"TOX 575","ADVANCED XENOBIOTIC METABOLISM","Grad","https://secure.oregonstate.edu/ap/cps/documents/view/125289","No Sustainability Content"]
[null,"FES","TRAL",115,{"$f":"TRIM(C3871)&\" \"&TRIM(D3871)","v":"TRAL 115"},"OUTDOOR LIVING SKILLS","Undergrad","https://secure.oregonstate.edu/ap/cps/documents/view/130085","No Sustainability Content"]
[null,"FES","TRAL",118,{"$f":"TRIM(C3872)&\" \"&TRIM(D3872)","v":"TRAL 118"},"LAB FOR OUTDOOR LIVING SKILLS","Undergrad","https://secure.oregonstate.edu/ap/cps/documents/view/130087","No Sustainability Content"]
[null,"FES","TRAL",172,{"$f":"TRIM(C3873)&\" \"&TRIM(D3873)","v":"TRAL 172"},"ROCK SITE MANAGEMENT","Undergrad","https://secure.oregonstate.edu/ap/cps/documents/view/130116","No Sustainability Content"]
[null,"FES","TRAL",215,"TRAL 215","GROUP FACILITATION. (4 Credits)","Undergrad","https://secure.oregonstate.edu/ap/cps/documents/view/130960","No Sustainability Content"]
[null,"FES","TRAL",217,"TRAL 217","INTERMEDIATE ROCK. (2 Credits)","Undergrad","https://secure.oregonstate.edu/ap/cps/documents/view/130374 ","No Sustainability Content"]
[null,"FES","TRAL",280,"TRAL 280","OUTDOOR LEADERSHIP FUNDAMENTALS. (5 Credits)","Undergrad","https://secure.oregonstate.edu/ap/cps/documents/view/131396","No Sustainability Content"]
[null,"FES","TRAL",374,"TRAL 374","OUTDOOR ADVENTURE EDUCATION. (3 Credits)","Undergrad","https://secure.oregonstate.edu/ap/cps/documents/view/130937","No Sustainability Content"]
[null,"FES","TRAL",377,{"$f":"TRIM(C3878)&\" \"&TRIM(D3878)","v":"TRAL 377"},"EXPEDITIONS I WATER","Undergrad","https://secure.oregonstate.edu/ap/cps/documents/view/132231","No Sustainability Content"]
[null,"FES","TRAL",432,"TRAL 432","ECONOMICS OF RECREATION AND TOURISM. (3 Credits)","Undergrad","https://secure.oregonstate.edu/ap/cps/documents/view/123811","No Sustainability Content"]
[null,"ALS","UEXP",111,"UEXP 111","INTRODUCTION TO RESIDENTIAL EDUCATION. (2 Credits)","Undergrad","https://secure.oregonstate.edu/ap/cps/documents/view/123548","No Sustainability Content"]
[null,"BMS","VMB",328,"VMB 328","WILDLIFE CAPTURE & IMMOBILIZAT","Undergrad","https://secure.oregonstate.edu/ap/cps/documents/view/8239","No Sustainability Content"]
[null,"BMS","VMB",523,"VMB 523","ZOONOSES. (3 Credits)","Grad","https://secure.oregonstate.edu/ap/cps/documents/view/5583","No Sustainability Content"]
[null,"BMS","VMB",627,"VMB 627","ORNAMENTAL FISH MEDICINE","Grad","https://secure.oregonstate.edu/ap/cps/documents/view/108418","No Sustainability Content"]
[null,"BMS","VMB",631,"VMB 631","MATH MODELING OF BIO SYSTEMS","Grad","https://secure.oregonstate.edu/ap/cps/documents/view/112329","No Sustainability Content"]
[null,"BMS","VMB",640,"VMB 640","SEMINARS IN LAB ANIMAL MEDICIN","Grad","https://secure.oregonstate.edu/ap/cps/documents/view/110944","No Sustainability Content"]
[null,"BMS","VMB",641,"VMB 641","SEMINARS IN LAB ANIMAL MED","Grad","https://secure.oregonstate.edu/ap/cps/documents/view/110878","No Sustainability Content"]
[null,"BMS","VMB",642,"VMB 642","SEMINARS IN LAB ANIMAL MED","Grad","https://secure.oregonstate.edu/ap/cps/documents/view/110879","No Sustainability Content"]
[null,"BMS","VMB",653,"VMB 653","VETERINARY VIROLOGY","Grad","https://secure.oregonstate.edu/ap/cps/documents/view/10216","No Sustainability Content"]
[null,"BMS","VMB",659,"VMB 659","VET BACTERIOLOGY & MYCOLOGY","Grad","https://secure.oregonstate.edu/ap/cps/documents/view/10215","No Sustainability Content"]
[null,"BMS","VMB",663,"VMB 663","VETERINARY DIAGNOSTIC PATH","Grad","https://secure.oregonstate.edu/ap/cps/documents/view/105410","No Sustainability Content"]
[null,"BMS","VMB",664,"VMB 664","COMPARATIVE MICROSCOPIC PATH","Grad","https://secure.oregonstate.edu/ap/cps/documents/view/105411","No Sustainability Content"]
[null,"BMS","VMB",665,"VMB 665","READINGS IN VETERINARY PATH","Grad","https://secure.oregonstate.edu/ap/cps/documents/view/105412","No Sustainability Content"]
[null,"BMS","VMB",666,"VMB 666","VETERINARY MEDICINE AND PUBLIC HEALTH. (3 Credits)","Grad","https://secure.oregonstate.edu/ap/cps/documents/view/100430","No Sustainability Content"]
[null,"BMS","VMB",667,"VMB 667","VETERINARY EPIDEMIOLOGY","Grad","https://secure.oregonstate.edu/ap/cps/documents/view/10217","No Sustainability Content"]
[null,"BMS","VMB",669,"VMB 669","INTRO TO GRANT WRITING","Grad","https://secure.oregonstate.edu/ap/cps/documents/view/120055","No Sustainability Content"]
[null,"BMS","VMB",670,"VMB 670","INTRODUCTION TO SYSTEMS BIOLOGY. (2 Credits)","Grad","https://secure.oregonstate.edu/ap/cps/documents/view/121513","No Sustainability Content"]
[null,"BMS","VMB",671,"VMB 671","MOLECULAR TOOLS","Grad","https://catalog.oregonstate.edu/search/?P=VMB%20671","No Sustainability Content"]
[null,"BMS","VMB",672,"VMB 672","MOLECULAR APPROACH TO CANCER","Grad","https://secure.oregonstate.edu/ap/cps/documents/view/108324","No Sustainability Content"]
[null,"BMS","VMB",673,"VMB 673","COMPARATIVE IMMUNOLOGY","Grad","https://secure.oregonstate.edu/ap/cps/documents/view/113659","No Sustainability Content"]
[null,"BMS","VMB",680,"VMB 680","Veterinary Medical Preceptorship","Grad","https://secure.oregonstate.edu/ap/cps/documents/view/100713","No Sustainability Content"]
[null,"BMS","VMB",723,"VMB 723","VETERINARY LEADERSHIP: INCLUSION, REFLECTION, DEVELOPMENT. (1 Credit)","Grad","https://secure.oregonstate.edu/ap/cps/documents/view/132884","No Sustainability Content"]
[null,"BMS","VMB",726,"VMB 726","PET BIRD SMALL MAMMAL MED SURG","Grad","https://secure.oregonstate.edu/ap/cps/documents/view/4193","No Sustainability Content"]
[null,"BMS","VMB",727,"VMB 727","ORNAMENTAL FISH MEDICINE","Grad","https://secure.oregonstate.edu/ap/cps/documents/view/4188","No Sustainability Content"]
[null,"BMS","VMB",729,"VMB 729","LAB ANIMAL/PRIMATE MED & SURG","Grad","https://secure.oregonstate.edu/ap/cps/documents/view/4349","No Sustainability Content"]
[null,"BMS","VMB",736,"VMB 736","DIAGNOSTIC CLINICAL PATHOLOGY","Grad","https://secure.oregonstate.edu/ap/cps/documents/view/101318","No Sustainability Content"]
[null,"BMS","VMB",745,"VMB 745","COMMUNICATIONS FOR VETS",{"$f":"IF(D3906>499,\"Grad\", \"Undergrad\")","v":"Grad"},"https://secure.oregonstate.edu/ap/cps/documents/view/4346","No Sustainability Content"]
[null,"BMS","VMB",749,"VMB 749","WILDLIFE SAFARI","Grad","https://secure.oregonstate.edu/ap/cps/documents/view/4199","No Sustainability Content"]
[null,"BMS","VMB",756,"VMB 756","ADVANCED CLINICAL PATHOLOGY","Grad","https://secure.oregonstate.edu/ap/cps/documents/view/112196","No Sustainability Content"]
[null,"BMS","VMB",768,"VMB 768","BASIC HISTOPATHOLOGY","Grad","https://secure.oregonstate.edu/ap/cps/documents/view/4102","No Sustainability Content"]
[null,"BMS","VMB",769,"VMB 769","ANIMAL GENOMICS","Grad","https://secure.oregonstate.edu/ap/cps/documents/view/5671","No Sustainability Content"]
[null,"BMS","VMB",772,"VMB 772","INTERNATIONAL VET MEDICINE","Grad","https://secure.oregonstate.edu/ap/cps/documents/view/100126","No Sustainability Content"]
[null,"BMS","VMB",775,"VMB 775","PRACTICE MANAGEMENT","Grad","https://secure.oregonstate.edu/ap/cps/documents/view/4040","No Sustainability Content"]
[null,"BMS","VMB",786,"VMB 786","ADVANCED HISTOPATHOLOGY","Grad","https://secure.oregonstate.edu/ap/cps/documents/view/4108","No Sustainability Content"]
[null,"BMS","VMB",795,"VMB 795","DIAGNOSTIC SERVICES","Grad","https://secure.oregonstate.edu/ap/cps/documents/view/101323","No Sustainability Content"]
[null,"VCS","VMC",509,"VMC 509","TEACHING PRACTICUM FOR VETERINARY PROFESSIONAL CURRICULUM. (1-6 Credits)","Grad","https://secure.oregonstate.edu/ap/cps/documents/view/128023","No Sustainability Content"]
[null,"VCS","VMC",632,"VMC 632","POSTGRADUATE MEDICINE","Grad","https://secure.oregonstate.edu/ap/cps/documents/view/4782","No Sustainability Content"]
[null,"VCS","VMC",634,"VMC 634","POSTGRADUATE SURGERY","Grad","https://secure.oregonstate.edu/ap/cps/documents/view/4777","No Sustainability Content"]
[null,"VCS","VMC",637,"VMC 637","POSTGRADUATE CARDIOLOGY","Grad","https://secure.oregonstate.edu/ap/cps/documents/view/4779","No Sustainability Content"]
[null,"VCS","VMC",682,"VMC 682","TOPICS IN INTERNAL MEDICINE","Grad","https://secure.oregonstate.edu/ap/cps/documents/view/4780","No Sustainability Content"]
[null,"VCS","VMC",711,"VMC 711","CLINICAL CARDIOLOGY","Grad","https://secure.oregonstate.edu/ap/cps/documents/view/4128","No Sustainability Content"]
[null,"VCS","VMC",712,"VMC 712","CLINICAL ONCOLOGY","Grad","https://secure.oregonstate.edu/ap/cps/documents/view/4131","No Sustainability Content"]
[null,"VCS","VMC",714,"VMC 714","SMALL ANIMAL DENTISTRY","Grad","https://secure.oregonstate.edu/ap/cps/documents/view/110285","No Sustainability Content"]
[null,"VCS","VMC",715,"VMC 715","CASE STUDIES IN SA MEDICINE I","Grad","https://secure.oregonstate.edu/ap/cps/documents/view/103459","No Sustainability Content"]
[null,"VCS","VMC",716,"VMC 716","CASE STUDIES IN SA MEDICINE II","Grad","https://secure.oregonstate.edu/ap/cps/documents/view/103460","No Sustainability Content"]
[null,"VCS","VMC",717,"VMC 717","CASE STUDIES IN SA MED III","Grad","https://secure.oregonstate.edu/ap/cps/documents/view/103559","No Sustainability Content"]
[null,"VCS","VMC",718,"VMC 718","SMALL ANIMAL PREVENTIVE MED","Grad","https://secure.oregonstate.edu/ap/cps/documents/view/103512","No Sustainability Content"]
[null,"VCS","VMC",719,"VMC 719","CLINICAL CARDIOLOGY I. (2 Credits)","Grad","https://secure.oregonstate.edu/ap/cps/documents/view/131750","No Sustainability Content"]
[null,"VCS","VMC",720,"VMC 720","VETERINARY CLINICAL NUTRITION","Grad","https://secure.oregonstate.edu/ap/cps/documents/view/108692","No Sustainability Content"]
[null,"VCS","VMC",721,"VMC 721","SMALL ANIMAL CLINICAL NUTRITIO","Grad","https://secure.oregonstate.edu/ap/cps/documents/view/3927","No Sustainability Content"]
[null,"VCS","VMC",722,"VMC 722","Research Reading Skills for Veterinary Students","Grad","https://secure.oregonstate.edu/ap/cps/documents/view/129593","No Sustainability Content"]
[null,"VCS","VMC",723,"VMC 723","ADVANCED FELINE MEDICINE","Grad","https://secure.oregonstate.edu/ap/cps/documents/view/101271","No Sustainability Content"]
[null,"VCS","VMC",726,"VMC 726","SMALL ANIMAL THERIOGENOLOGY","Grad","https://secure.oregonstate.edu/ap/cps/documents/view/4680","No Sustainability Content"]
[null,"VCS","VMC",727,"VMC 727","ADVANCED SMALL ANIMAL SURGERY","Grad","https://secure.oregonstate.edu/ap/cps/documents/view/4844","No Sustainability Content"]
[null,"VCS","VMC",729,"VMC 729","CLINICAL THERIOGENOLOGY","Grad","https://secure.oregonstate.edu/ap/cps/documents/view/122729","No Sustainability Content"]
[null,"VCS","VMC",731,"VMC 731","SA EMERGENCY CARE-DOVE LEWIS","Grad","https://secure.oregonstate.edu/ap/cps/documents/view/4247","No Sustainability Content"]
[null,"VCS","VMC",732,"VMC 732","CLINICAL LA MEDICINE I","Grad","https://secure.oregonstate.edu/ap/cps/documents/view/123287","No Sustainability Content"]
[null,"VCS","VMC",734,"VMC 734","CLINICAL LA SURGERY I","Grad","https://secure.oregonstate.edu/ap/cps/documents/view/123286","No Sustainability Content"]
[null,"VCS","VMC",735,"VMC 735","RURAL VETERINARY PRACTICE I","Grad","https://secure.oregonstate.edu/ap/cps/documents/view/123332","No Sustainability Content"]
[null,"VCS","VMC",737,"VMC 737","VETERINARY ANESTHESIOLOGY","Grad","https://secure.oregonstate.edu/ap/cps/documents/view/4362","No Sustainability Content"]
[null,"VCS","VMC",740,"VMC 740","SHEEP & GOAT MED & SURGERY","Grad","https://secure.oregonstate.edu/ap/cps/documents/view/4177","No Sustainability Content"]
[null,"VCS","VMC",741,"VMC 741","LARGE ANIMAL GI SURGERY","Grad","https://secure.oregonstate.edu/ap/cps/documents/view/4182","No Sustainability Content"]
[null,"VCS","VMC",742,"VMC 742","CAMELID MEDICINE AND SURGERY","Grad","https://secure.oregonstate.edu/ap/cps/documents/view/4185","No Sustainability Content"]
[null,"VCS","VMC",743,"VMC 743","ADVANCED EQUINE REPRODUCTION. (3 Credits)","Grad","https://secure.oregonstate.edu/ap/cps/documents/view/4024","No Sustainability Content"]
[null,"VCS","VMC",744,"VMC 744","ADVANCED LAMENESS IN EQUINE","Grad","https://secure.oregonstate.edu/ap/cps/documents/view/4166","No Sustainability Content"]
[null,"VCS","VMC",745,{"$f":"TRIM(C3945)&\" \"&TRIM(D3945)","v":"VMC 745"},"PRACTICE MANAGEMENT","Grad","https://secure.oregonstate.edu/ap/cps/documents/view/129492","No Sustainability Content"]
[null,"VCS","VMC",746,"VMC 746","Caine Center Food animal Medicine   ","Grad","https://secure.oregonstate.edu/ap/cps/documents/view/4549","No Sustainability Content"]
[null,"VCS","VMC",747,"VMC 747","VETERINARY ANESTHESIOLOGY II","Grad","https://secure.oregonstate.edu/ap/cps/documents/view/4172","No Sustainability Content"]
[null,"VCS","VMC",748,"VMC 748","EQUINE DENTISTRY","Grad","https://secure.oregonstate.edu/ap/cps/documents/view/4169","No Sustainability Content"]
[null,"VCS","VMC",749,"VMC 749","CLINICAL IMAGING II","Grad","https://secure.oregonstate.edu/ap/cps/documents/view/4196","No Sustainability Content"]
[null,"VCS","VMC",750,"VMC 750","EQUINE CLINICAL NUTRITION","Grad","https://secure.oregonstate.edu/ap/cps/documents/view/5668","No Sustainability Content"]
[null,"VCS","VMC",751,"VMC 751","RUMINANT NUTRITION","Grad","https://secure.oregonstate.edu/ap/cps/documents/view/3929","No Sustainability Content"]
[null,"VCS","VMC",752,"VMC 752","CLINICAL LA MEDICINE II","Grad","https://secure.oregonstate.edu/ap/cps/documents/view/4454","No Sustainability Content"]
[null,"VCS","VMC",753,"VMC 753","CLINICAL ONCOLOGY I. (2 Credits)","Grad","https://secure.oregonstate.edu/ap/cps/documents/view/131748","No Sustainability Content"]
[null,"VCS","VMC",754,"VMC 754","CLINICAL LA SURGERY II","Grad","https://secure.oregonstate.edu/ap/cps/documents/view/4482","No Sustainability Content"]
[null,"VCS","VMC",755,"VMC 755","RURAL VETERINARY PRACTICE II","Grad","https://secure.oregonstate.edu/ap/cps/documents/view/4460","No Sustainability Content"]
[null,"VCS","VMC",759,"VMC 759","LARGE ANIMAL PALPATION","Grad","https://secure.oregonstate.edu/ap/cps/documents/view/4018","No Sustainability Content"]
[null,"VCS","VMC",763,"VMC 763","ADVANCED CLINICAL CARDIOLOGY","Grad","https://secure.oregonstate.edu/ap/cps/documents/view/5663","No Sustainability Content"]
[null,"VCS","VMC",764,"VMC 764","DIAGNOSTIC IMAGING","Grad","https://secure.oregonstate.edu/ap/cps/documents/view/5636","No Sustainability Content"]
[null,"VCS","VMC",765,"VMC 765","ADVANCED CLINICAL RADIOLOGY","Grad","https://secure.oregonstate.edu/ap/cps/documents/view/112091","No Sustainability Content"]
[null,"VCS","VMC",766,{"$f":"TRIM(C3960)&\" \"&TRIM(D3960)","v":"VMC 766"},"SMALL ANIMAL ULTRASONOGRAPHY","Grad","https://secure.oregonstate.edu/ap/cps/documents/view/128022","No Sustainability Content"]
[null,"VCS","VMC",773,"VMC 773","MEDICINE LABORATORY I","Grad","https://secure.oregonstate.edu/ap/cps/documents/view/6120","No Sustainability Content"]
[null,"VCS","VMC",774,"VMC 774","MEDICINE LABORATORY II","Grad","https://secure.oregonstate.edu/ap/cps/documents/view/6123","No Sustainability Content"]
[null,"VCS","VMC",775,"VMC 775","CLINICAL SMALL REHABILITATION","Grad","https://secure.oregonstate.edu/ap/cps/documents/view/115731","No Sustainability Content"]
[null,"VCS","VMC",776,"VMC 776","SMALL ANIMAL MEDICINE I","Grad","https://secure.oregonstate.edu/ap/cps/documents/view/5677","No Sustainability Content"]
[null,"VCS","VMC",777,"VMC 777","SMALL ANIMAL MEDICINE II","Grad","https://secure.oregonstate.edu/ap/cps/documents/view/5672","No Sustainability Content"]
[null,"VCS","VMC",778,"VMC 778","SMALL ANIMAL MEDICINE III","Grad","https://secure.oregonstate.edu/ap/cps/documents/view/5674","No Sustainability Content"]
[null,"VCS","VMC",779,"VMC 779","EQUINE SPORTS MEDICINE","Grad","https://secure.oregonstate.edu/ap/cps/documents/view/112298","No Sustainability Content"]
[null,"VCS","VMC",785,"VMC 785","SMALL ANIMAL SURGERY","Grad","https://secure.oregonstate.edu/ap/cps/documents/view/5638","No Sustainability Content"]
[null,"VCS","VMC",788,"VMC 788","BUSINESS APPS IN SM ANIMAL PRA","Grad","https://secure.oregonstate.edu/ap/cps/documents/view/108348","No Sustainability Content"]
[null,"VCS","VMC",789,"VMC 789","PET PRACTICE",{"$f":"IF(D3970>499,\"Grad\", \"Undergrad\")","v":"Grad"},"https://secure.oregonstate.edu/ap/cps/documents/view/4249","No Sustainability Content"]
[null,"VCS","VMC",791,"VMC 791","CLINICAL SMALL ANIMAL MEDICINE","Grad","https://secure.oregonstate.edu/ap/cps/documents/view/123331","No Sustainability Content"]
[null,"VCS","VMC",792,"VMC 792","CLINICAL SMALL AN MEDICINE II","Grad","https://secure.oregonstate.edu/ap/cps/documents/view/3835","No Sustainability Content"]
[null,"VCS","VMC",793,"VMC 793","CLINICAL SMALL ANIMAL SURGERY","Grad","https://secure.oregonstate.edu/ap/cps/documents/view/123288","No Sustainability Content"]
[null,"VCS","VMC",794,"VMC 794","OHS SMALL ANIMAL PRIMARY CARE","Grad","https://secure.oregonstate.edu/ap/cps/documents/view/109237","No Sustainability Content"]
[null,"VCS","VMC",796,"VMC 796","CLINICAL IMAGING","Grad","https://secure.oregonstate.edu/ap/cps/documents/view/4275","No Sustainability Content"]
[null,"VCS","VMC",797,"VMC 797","SMALL ANIMAL CRITICAL CARE","Grad","https://secure.oregonstate.edu/ap/cps/documents/view/10505","No Sustainability Content"]
[null,"VCS","VMC",798,"VMC 798","CLINICAL SMALL ANIM SURGERY II","Grad","https://secure.oregonstate.edu/ap/cps/documents/view/3837","No Sustainability Content"]
[null,"SLCS","WGSS",110,"WGSS 110","*GENDER, RACE, AND POP CULTURE. (3 Credits)","Undergrad","https://secure.oregonstate.edu/ap/cps/documents/view/133888 Ecampus https://secure.oregonstate.edu/ap/cps/documents/view/133889","No Sustainability Content"]
[null,"SLCS","WGSS",111,"WGSS 111","*FEMINIST PERSPECTIVES ON CURRENT EVENTS. (3 Credits)","Undergrad","https://secure.oregonstate.edu/ap/cps/documents/view/133578 Ecampus https://secure.oregonstate.edu/ap/cps/documents/view/133579","No Sustainability Content"]
[null,"SLCS","WGSS",223,{"$f":"TRIM(C3980)&\" \"&TRIM(D3980)","v":"WGSS 223"},"*INTRO TO WGSS","Undergrad","https://secure.oregonstate.edu/ap/cps/documents/view/128772","No Sustainability Content"]
[null,"SLCS","WGSS",295,"WGSS 295","*FEMINISM AND THE BIBLE","Undergrad","https://secure.oregonstate.edu/ap/cps/documents/view/114982","No Sustainability Content"]
[null,"SLCS","WGSS",311,"WGSS 311","*GLOBAL EXPERIENCE: CULTURAL DIVERSITY. (3 Credits)","Undergrad","https://secure.oregonstate.edu/ap/cps/documents/view/128977","No Sustainability Content"]
[null,"SLCS","WGSS",312,"WGSS 312","*GLOBAL EXPERIENCE: WESTERN CULTURE. (3 Credits)","Undergrad","https://secure.oregonstate.edu/ap/cps/documents/view/128978","No Sustainability Content"]
[null,"SLCS","WGSS",313,"WGSS 313","*GLOB EXPER: CONTEMP GLOB ISSU. (3 Credits)","Undergrad","https://secure.oregonstate.edu/ap/cps/documents/view/128979","No Sustainability Content"]
[null,"SLCS","WGSS",361,{"$f":"TRIM(C3985)&\" \"&TRIM(D3985)","v":"WGSS 361"},"(RE)FRAMING RACE FILM PROD","Undergrad","https://secure.oregonstate.edu/ap/cps/documents/view/129198 ","No Sustainability Content"]
[null,"SLCS","WGSS",378,"WGSS 378","*RELIGION AND GENDER: A GLOBAL PERSPECTIVE. (4 Credits)","Undergrad","https://secure.oregonstate.edu/ap/cps/documents/view/132321","No Sustainability Content"]
[null,"SLCS","WGSS",418,"WGSS 418","FEMINIST RESEARCH METHODS. (4 Credits)","Undergrad","https://secure.oregonstate.edu/ap/cps/documents/view/114418","No Sustainability Content"]
[null,"SLCS","WGSS",431,"WGSS 431","*QUEER OF COLOR CRITIQUES. (4 Credits)","Undergrad","https://catalog.oregonstate.edu/search/?P=WGSS%20431","No Sustainability Content"]
[null,"SLCS","WGSS",460,"WGSS 460","^SEXUALITIES, FEMINISMS, WOMEN. (4 Credits)","Undergrad","https://secure.oregonstate.edu/ap/cps/documents/view/132976","No Sustainability Content"]
[null,"SLCS","WGSS",472,"WGSS 472","^INDIGENOUS 2SPIRIT STUDIES","Undergrad","https://catalog.oregonstate.edu/search/?P=WGSS%20472","No Sustainability Content"]
[null,"SLCS","WGSS",473,"WGSS 473","TRANSGENDER LIVES. (4 Credits)","Undergrad","https://catalog.oregonstate.edu/search/?P=WGSS%20473","No Sustainability Content"]
[null,"SLCS","WGSS",515,{"$f":"TRIM(C3992)&\" \"&TRIM(D3992)","v":"WGSS 515"},"ADV RESEARCH LITERATURE REVIEW","Grad","https://secure.oregonstate.edu/ap/cps/documents/view/130004","No Sustainability Content"]
[null,"SLCS","WGSS",522,"WGSS 522","GRANT AND FUND DEVELOPMENT FOR FEMINIST ORGANIZATIONS. (4 Credits)","Grad","https://secure.oregonstate.edu/ap/cps/documents/view/124442","No Sustainability Content"]
[null,"SLCS","WGSS",524,"WGSS 524","TRANS/GENDER POLITICS","Grad","https://secure.oregonstate.edu/ap/cps/documents/view/113201","No Sustainability Content"]
[null,"SLCS","WGSS",531,"WGSS 531","QUEER OF COLOR CRITIQUES. (4 Credits)","Grad","https://catalog.oregonstate.edu/search/?P=WGSS%20531","No Sustainability Content"]
[null,"SLCS","WGSS",536,"WGSS 536","FEMINIST MEDIA STUDIES. (4 Credits)","Grad","https://secure.oregonstate.edu/ap/cps/documents/view/118094","No Sustainability Content"]
[null,"SLCS","WGSS",555,"WGSS 555","FEMINIST TEXTUAL ANALYSIS","Grad","https://secure.oregonstate.edu/ap/cps/documents/view/115196","No Sustainability Content"]
[null,"SLCS","WGSS",560,"WGSS 560","SEXUALITIES, FEMINISMS, WOMEN. (4 Credits)","Grad","https://secure.oregonstate.edu/ap/cps/documents/view/132976","No Sustainability Content"]
[null,"SLCS","WGSS",569,"WGSS 569","TOPICS IN JOTERIA STUDIES. (3 Credits)","Grad","https://secure.oregonstate.edu/ap/cps/documents/view/106681","No Sustainability Content"]
[null,"SLCS","WGSS",572,"WGSS 572","INDIGENOUS 2SPIRIT STUDIES","Grad","https://catalog.oregonstate.edu/search/?P=WGSS%20572","No Sustainability Content"]
[null,"SLCS","WGSS",573,"WGSS 573","TRANSGENDER LIVES. (4 Credits)","Grad","https://catalog.oregonstate.edu/search/?P=WGSS%20573","No Sustainability Content"]
[null,"SLCS","WGSS",611,"WGSS 611","COLLOQUIUM","Grad","https://secure.oregonstate.edu/ap/cps/documents/view/114195","No Sustainability Content"]
[null,"SLCS","WGSS",617,"WGSS 617","FEMINISMS II","Grad","https://secure.oregonstate.edu/ap/cps/documents/view/114535","No Sustainability Content"]
[null,"SLCS","WLC",221,{"$f":"TRIM(C4004)&\" \"&TRIM(D4004)","v":"WLC 221"},"*MASTERPIECES OF GERMAN CINEMA","Undergrad","https://secure.oregonstate.edu/ap/cps/documents/view/102097","No Sustainability Content"]
[null,"SLCS","WLC",222,"WLC 222","Women in Italian Cinema","Undergrad","https://secure.oregonstate.edu/ap/cps/documents/view/114649","No Sustainability Content"]
[null,"SLCS","WLC",241,"WLC 241","Grimms’ Fairy Tales","Undergrad","https://secure.oregonstate.edu/ap/cps/documents/view/115415","No Sustainability Content"]
[null,"SLCS","WLC",301,"WLC 301","*INTRO TO WORLD LANG & CULT","Undergrad","https://secure.oregonstate.edu/ap/cps/documents/view/123589","No Sustainability Content"]
[null,"SLCS","WLC",320,{"$f":"TRIM(C4008)&\" \"&TRIM(D4008)","v":"WLC 320"},"*FRANCOPHONE CULTURES IN FILM","Undergrad","https://secure.oregonstate.edu/ap/cps/documents/view/107665","No Sustainability Content"]
[null,"SLCS","WLC",321,{"$f":"TRIM(C4009)&\" \"&TRIM(D4009)","v":"WLC 321"},"*SPAIN THROUGH SPANISH CINEMA","Undergrad","https://secure.oregonstate.edu/ap/cps/documents/view/121958","No Sustainability Content"]
[null,"SLCS","WLC",331,{"$f":"TRIM(C4010)&\" \"&TRIM(D4010)","v":"WLC 331"},"*CHINESE CULTURE I","Undergrad","https://secure.oregonstate.edu/ap/cps/documents/view/124517","No Sustainability Content"]
[null,"SLCS","WLC",333,{"$f":"TRIM(C4011)&\" \"&TRIM(D4011)","v":"WLC 333"},"*CHINESE CULTURE III","Undergrad","https://secure.oregonstate.edu/ap/cps/documents/view/123372","No Sustainability Content"]
[null,"SLCS","WLC",345,"WLC 345","MULTIMODAL LITERACIES","Undergrad","https://secure.oregonstate.edu/ap/cps/documents/view/115890","No Sustainability Content"]
[null,"SLCS","WLC",360,"WLC 360","International Film Festival","Undergrad","https://secure.oregonstate.edu/ap/cps/documents/view/116339","No Sustainability Content"]
[null,"SLCS","WLC",361,{"$f":"TRIM(C4014)&\" \"&TRIM(D4014)","v":"WLC 361"},"(RE)FRAMING RACE FILM PROD","Undergrad","https://secure.oregonstate.edu/ap/cps/documents/view/129181","No Sustainability Content"]
[null,"SLCS","WLC",429,"WLC 429","French Society Through Cinema","Undergrad","https://secure.oregonstate.edu/ap/cps/documents/view/116261","No Sustainability Content"]
[null,"SLCS","WLC",459,"WLC 459","ADV STUDY LANG/RACE/RACISM IN","Undergrad","https://catalog.oregonstate.edu/search/?P=WLC%20459","No Sustainability Content"]
[null,"SLCS","WLC",483,{"$f":"TRIM(C4017)&\" \"&TRIM(D4017)","v":"WLC 483"},"CUBAN CULTURE, POL & SOCIETY","Undergrad","https://secure.oregonstate.edu/ap/cps/documents/view/127152 ","No Sustainability Content"]
[null,"SLCS","WLC",559,"WLC 559","ADV STUDY LANG/RACE/RACISM IN","Grad","https://catalog.oregonstate.edu/search/?P=WLC%20559","No Sustainability Content"]
[null,"SLCS","WLC",583,{"$f":"TRIM(C4019)&\" \"&TRIM(D4019)","v":"WLC 583"},"CUBAN CULTURE, POL & SOCIETY","Grad","https://secure.oregonstate.edu/ap/cps/documents/view/127152 ","No Sustainability Content"]
[null,"SWLF","WR",121,"WR 121","*ENGLISH COMPOSITION","Undergrad","https://secure.oregonstate.edu/ap/cps/documents/view/101551","No Sustainability Content"]
[null,"SWLF","WR",130,{"$f":"TRIM(C4021)&\" \"&TRIM(D4021)","v":"WR 130"},"FUNDAMENTALS OF GRAMMAR","Undergrad","https://secure.oregonstate.edu/ap/cps/documents/view/128094","No Sustainability Content"]
[null,"SWLF","WR",224,"WR 224","*INTRO TO FICTION WRITING","Undergrad","https://secure.oregonstate.edu/ap/cps/documents/view/99930","No Sustainability Content"]
[null,"SWLF","WR",228,"WR 228","*WRITING ABROAD. (3 Credits)","Undergrad","https://secure.oregonstate.edu/ap/cps/documents/view/130304","No Sustainability Content"]
[null,"SWLF","WR",230,"WR 230","*ESSENTIALS OF ENGLISH GRAMMAR. (3 Credits)","Undergrad","https://secure.oregonstate.edu/ap/cps/documents/view/129705","No Sustainability Content"]
[null,"SWLF","WR",239,"WR 239","INTRODUCTION TO WRITING FICTION AND CREATIVE NONFICTION. (3 Credits)","Undergrad","https://secure.oregonstate.edu/ap/cps/documents/view/108322","No Sustainability Content"]
[null,"SWLF","WR",240,"WR 240","*INTRO TO NONFICTION WRITING","Undergrad","https://secure.oregonstate.edu/ap/cps/documents/view/111716","No Sustainability Content"]
[null,"SWLF","WR",241,"WR 241","*INTRO TO POETRY WRITING","Undergrad","https://secure.oregonstate.edu/ap/cps/documents/view/99931","No Sustainability Content"]
[null,"SWLF","WR",301,{"$f":"TRIM(C4028)&\" \"&TRIM(D4028)","v":"WR 301"},"*PUBLISHING AND EDITING","Undergrad","https://secure.oregonstate.edu/ap/cps/documents/view/127882","No Sustainability Content"]
[null,"SWLF","WR",303,"WR 303","*WRITING FOR THE WEB","Undergrad","https://secure.oregonstate.edu/ap/cps/documents/view/110670","No Sustainability Content"]
[null,"SWLF","WR",324,"WR 324","*SHORT STORY WRITING","Undergrad","https://secure.oregonstate.edu/ap/cps/documents/view/99932","No Sustainability Content"]
[null,"SWLF","WR",329,"WR 329","WRITING FOR LAW AND LAW SCHOOL. (3 Credits)","Undergrad","https://secure.oregonstate.edu/ap/cps/documents/view/111743","No Sustainability Content"]
[null,"SWLF","WR",340,{"$f":"TRIM(C4032)&\" \"&TRIM(D4032)","v":"WR 340"},"CREATIVE NONFICTION WRITING","Undergrad","https://secure.oregonstate.edu/ap/cps/documents/view/126325","No Sustainability Content"]
[null,"SWLF","WR",341,"WR 341","*POETRY WRITING","Undergrad","https://secure.oregonstate.edu/ap/cps/documents/view/99933","No Sustainability Content"]
[null,"SWLF","WR",353,"WR 353","WRITING ABOUT PLACES",{"$f":"IF(D4034>499,\"Grad\", \"Undergrad\")","v":"Undergrad"},"https://secure.oregonstate.edu/ap/cps/documents/view/111818","No Sustainability Content"]
[null,"SWLF","WR",362,"WR 362","*SCIENCE WRITING","Undergrad","https://secure.oregonstate.edu/ap/cps/documents/view/101218","No Sustainability Content"]
[null,"SWLF","WR",383,"WR 383","FOOD WRITING","Undergrad","https://secure.oregonstate.edu/ap/cps/documents/view/101626","No Sustainability Content"]
[null,"SWLF","WR",411,"WR 411","^THE TEACHING OF WRITING. (4 Credits)","Undergrad","https://catalog.oregonstate.edu/search/?P=WR%20411","No Sustainability Content"]
[null,"SWLF","WR",414,"WR 414","ADVER & PUBLIC RELATIONS WRIT","Undergrad","https://catalog.oregonstate.edu/search/?P=WR%20414","No Sustainability Content"]
[null,"SWLF","WR",416,"WR 416","ADVANCED COMPOSITION. (4 Credits)","Undergrad","https://catalog.oregonstate.edu/search/?P=WR%20416","No Sustainability Content"]
[null,"SWLF","WR",420,"WR 420","STUDIES IN WRITING","Undergrad","https://catalog.oregonstate.edu/search/?P=WR%20420","No Sustainability Content"]
[null,"SWLF","WR",435,"WR 435","SCIENCE/TECH/PRO COMM CAPSTONE","Undergrad","https://secure.oregonstate.edu/ap/cps/documents/view/124249","No Sustainability Content"]
[null,"SWLF","WR",448,"WR 448","MAGAZINE ARTICLE WRITING","Undergrad","https://catalog.oregonstate.edu/search/?P=WR%20448","No Sustainability Content"]
[null,"SWLF","WR",449,"WR 449","CRITICAL REVIEWING","Undergrad","https://catalog.oregonstate.edu/search/?P=WR%20449","No Sustainability Content"]
[null,"SWLF","WR",466,"WR 466","PROFESSIONAL WRITING. (4 Credits)","Undergrad","https://catalog.oregonstate.edu/search/?P=WR%20466","No Sustainability Content"]
[null,"SWLF","WR",475,"WR 475","RHETORICS OF RACE. (4 Credits)","Undergrad","https://secure.oregonstate.edu/ap/cps/documents/view/129098","No Sustainability Content"]
[null,"SWLF","WR",485,"WR 485","CONTEMPORARY RHETORIC THEORY. (4 Credits)","Undergrad","https://catalog.oregonstate.edu/search/?P=WR%20485","No Sustainability Content"]
[null,"SWLF","WR",493,"WR 493","^THE RHETORICAL TRADITION AND THE TEACHING OF WRITING. (4 Credits)","Undergrad","https://catalog.oregonstate.edu/search/?P=WR%20493","No Sustainability Content"]
[null,"SWLF","WR",495,"WR 495","^INTRODUCTION TO LITERACY STUDIES. (4 Credits)","Undergrad","https://catalog.oregonstate.edu/search/?P=WR%20495","No Sustainability Content"]
[null,"SWLF","WR",497,"WR 497","DIGITAL LITERACY AND CULTURE. (4 Credits)","Undergrad","https://catalog.oregonstate.edu/search/?P=WR%20497","No Sustainability Content"]
[null,"SWLF","WR",500,{"$f":"TRIM(C4050)&\" \"&TRIM(D4050)","v":"WR 500"},"MFA RESIDENCY","Grad","https://secure.oregonstate.edu/ap/cps/documents/view/126116","No Sustainability Content"]
[null,"SWLF","WR",511,"WR 511","THE TEACHING OF WRITING. (4 Credits)","Grad","https://catalog.oregonstate.edu/search/?P=WR%20511","No Sustainability Content"]
[null,"SWLF","WR",512,"WR 512","CURRENT COMPOSITION THEORY","Grad","https://secure.oregonstate.edu/ap/cps/documents/view/99949","No Sustainability Content"]
[null,"SWLF","WR",513,{"$f":"TRIM(C4053)&\" \"&TRIM(D4053)","v":"WR 513"},"LOW-RESIDENCY MFA MENTORSHIP","Grad","https://secure.oregonstate.edu/ap/cps/documents/view/126115","No Sustainability Content"]
[null,"SWLF","WR",514,"WR 514","ADVERTISING AND PUBLIC RELATIONS WRITING. (4 Credits)","Grad","https://catalog.oregonstate.edu/search/?P=WR%20514","No Sustainability Content"]
[null,"SWLF","WR",516,"WR 516","ADVANCED COMPOSITION. (4 Credits)","Grad","https://catalog.oregonstate.edu/search/?P=WR%20516","No Sustainability Content"]
[null,"SWLF","WR",518,"WR 518","TEACHING PRACTICUM: WRITING IN BUSINESS. (1 Credit)","Grad","https://secure.oregonstate.edu/ap/cps/documents/view/114968","No Sustainability Content"]
[null,"SWLF","WR",519,"WR 519","TEACHING PRACTICUM: WR 222. (1 Credit)","Grad","https://secure.oregonstate.edu/ap/cps/documents/view/130885","No Sustainability Content"]
[null,"SWLF","WR",520,"WR 520","STUDIES IN WRITING","Grad","https://catalog.oregonstate.edu/search/?P=WR%20520","No Sustainability Content"]
[null,"SWLF","WR",522,"WR 522","TEACHING PRACTICUM: POETRY","Grad","https://secure.oregonstate.edu/ap/cps/documents/view/9056","No Sustainability Content"]
[null,"SWLF","WR",523,"WR 523","TEACHING PRACTICUM: NONFICTION WRITING. (1 Credit)","Grad","https://secure.oregonstate.edu/ap/cps/documents/view/132992","No Sustainability Content"]
[null,"SWLF","WR",524,"WR 524","ADVANCED FICTION WRITING","Grad","https://secure.oregonstate.edu/ap/cps/documents/view/99945","No Sustainability Content"]
[null,"SWLF","WR",525,"WR 525","ADVANCED SCIENTIFIC AND TECHNICAL WRITING. (4 Credits)","Grad","https://secure.oregonstate.edu/ap/cps/documents/view/103630","No Sustainability Content"]
[null,"SWLF","WR",540,"WR 540","ADVANCED NONFICTION WRITING","Grad","https://secure.oregonstate.edu/ap/cps/documents/view/110974","No Sustainability Content"]
[null,"SWLF","WR",541,"WR 541","ADVANCED POETRY WRITING","Grad","https://secure.oregonstate.edu/ap/cps/documents/view/99946","No Sustainability Content"]
[null,"SWLF","WR",548,"WR 548","MAGAZINE ARTICLE WRITING. (4 Credits)","Grad","https://catalog.oregonstate.edu/search/?P=WR%20548","No Sustainability Content"]
[null,"SWLF","WR",549,"WR 549","CRITICAL REVIEWING. (4 Credits)","Grad","https://catalog.oregonstate.edu/search/?P=WR%20549","No Sustainability Content"]
[null,"SWLF","WR",566,"WR 566","PROFESSIONAL WRITING. (4 Credits)","Grad","https://catalog.oregonstate.edu/search/?P=WR%20566","No Sustainability Content"]
[null,"SWLF","WR",575,{"$f":"TRIM(C4068)&\" \"&TRIM(D4068)","v":"WR 575"},"RHETORICS OF RACE","Grad","https://secure.oregonstate.edu/ap/cps/documents/view/129098","No Sustainability Content"]
[null,"SWLF","WR",585,"WR 585","CONTEMPORARY RHETORIC THEORY. (4 Credits)","Grad","https://catalog.oregonstate.edu/search/?P=WR%20585","No Sustainability Content"]
[null,"SWLF","WR",593,"WR 593","RHET TRAD & TEACHING WRITING","Grad","https://catalog.oregonstate.edu/search/?P=WR%20593","No Sustainability Content"]
[null,"SWLF","WR",595,"WR 595","INTRODUCTION TO LITERACY STUDIES. (4 Credits)","Grad","https://catalog.oregonstate.edu/search/?P=WR%20595","No Sustainability Content"]
[null,"SWLF","WR",597,"WR 597","DIGITAL LITERACY AND CULTURE. (4 Credits)","Grad","https://catalog.oregonstate.edu/search/?P=WR%20597","No Sustainability Content"]
[null,"GRD","WRP",517,"WRP 517","WRITING IN WATER RESOURCES. (4 Credits)","Grad","https://secure.oregonstate.edu/ap/cps/documents/view/123721","No Sustainability Content"]
[null,"WSE","WSE",211,{"$f":"TRIM(C4074)&\" \"&TRIM(D4074)","v":"WSE 211"},"WOODTURNING WITH SCIENCE I","Undergrad","https://secure.oregonstate.edu/ap/cps/documents/view/127091","No Sustainability Content"]
[null,"WSE","WSE",250,{"$f":"TRIM(C4075)&\" \"&TRIM(D4075)","v":"WSE 250"},"CAD: COMPUTER AIDED DESIGN","Undergrad","https://secure.oregonstate.edu/ap/cps/documents/view/129258","No Sustainability Content"]
[null,"WSE","WSE",320,"WSE 320","ANATOMY OF RENEWABLE MATERIALS. (3 Credits)","Undergrad","https://secure.oregonstate.edu/ap/cps/documents/view/129397","No Sustainability Content"]
[null,"WSE","WSE",321,"WSE 321","CHEMISTRY OF RENEWABLE MATLS","Undergrad","https://secure.oregonstate.edu/ap/cps/documents/view/110585","No Sustainability Content"]
[null,"WSE","WSE",322,"WSE 322","PHYS & MECH PROP RENEW MATLS","Undergrad","https://secure.oregonstate.edu/ap/cps/documents/view/100726","No Sustainability Content"]
[null,"WSE","WSE",350,{"$f":"TRIM(C4079)&\" \"&TRIM(D4079)","v":"WSE 350"},"SECOND PRODUCTS DESIGN & MANUF","Undergrad","https://secure.oregonstate.edu/ap/cps/documents/view/129974","No Sustainability Content"]
[null,"WSE","WSE",351,{"$f":"TRIM(C4080)&\" \"&TRIM(D4080)","v":"WSE 351"},"ADV CAD: COMPUTER AIDED DESIGN","Undergrad","https://secure.oregonstate.edu/ap/cps/documents/view/129972","No Sustainability Content"]
[null,"WSE","WSE",352,"WSE 352","CAM FOR THE CNC ROUTER AND LASER ENGRAVER. (3 Credits)","Undergrad","https://secure.oregonstate.edu/ap/cps/documents/view/129976","No Sustainability Content"]
[null,"WSE","WSE",373,"WSE 373","Wood Machining I ","Undergrad","https://secure.oregonstate.edu/ap/cps/documents/view/114669","No Sustainability Content"]
[null,"WSE","WSE",374,"WSE 374","Wood Machining II","Undergrad","https://secure.oregonstate.edu/ap/cps/documents/view/116219","No Sustainability Content"]
[null,"WSE","WSE",375,"WSE 375","Wood Machining III","Undergrad","https://secure.oregonstate.edu/ap/cps/documents/view/117159","No Sustainability Content"]
[null,"WSE","WSE",413,{"$f":"TRIM(C4085)&\" \"&TRIM(D4085)","v":"WSE 413"},"WOODTURNING WITH SCIENCE II","Undergrad","https://secure.oregonstate.edu/ap/cps/documents/view/128341","No Sustainability Content"]
[null,"WSE","WSE",414,"WSE 414","^ART AND DESIGN CAPSTONE","Undergrad","https://catalog.oregonstate.edu/search/?P=WSE%20414","No Sustainability Content"]
[null,"WSE","WSE",425,{"$f":"TRIM(C4087)&\" \"&TRIM(D4087)","v":"WSE 425"},"TIMBER TECTONICS DIGITAL AGE","Undergrad","https://secure.oregonstate.edu/ap/cps/documents/view/129612","No Sustainability Content"]
[null,"WSE","WSE",430,"WSE 430","FUNDAMENTALS OF ENGINEERING MECHANICS. (4 Credits)","Undergrad","https://secure.oregonstate.edu/ap/cps/documents/view/129396","No Sustainability Content"]
[null,"WSE","WSE",444,"WSE 444","WOOD COMPOSITES MANUFACTURE","Undergrad","https://secure.oregonstate.edu/ap/cps/documents/view/122608","No Sustainability Content"]
[null,"WSE","WSE",450,{"$f":"TRIM(C4090)&\" \"&TRIM(D4090)","v":"WSE 450"},"ENTREPR PRODUCT DEVELOPMENT I","Undergrad","https://secure.oregonstate.edu/ap/cps/documents/view/129969","No Sustainability Content"]
[null,"WSE","WSE",458,"WSE 458","DESIGN OF WOOD STRUCTURES","Undergrad","https://secure.oregonstate.edu/ap/cps/documents/view/116696","No Sustainability Content"]
[null,"WSE","WSE",463,"WSE 463","ADVANCED MANUFACTURING 2. (4 Credits)","Undergrad","https://secure.oregonstate.edu/ap/cps/documents/view/129174","No Sustainability Content"]
[null,"WSE","WSE",471,"WSE 471","RENEW MATERIALS IN BLDG CONST","Undergrad","https://catalog.oregonstate.edu/search/?P=WSE%20471","No Sustainability Content"]
[null,"WSE","WSE",514,"WSE 514","ART AND DESIGN CAPSTONE","Grad","https://catalog.oregonstate.edu/search/?P=WSE%20514","No Sustainability Content"]
[null,"WSE","WSE",525,{"$f":"TRIM(C4095)&\" \"&TRIM(D4095)","v":"WSE 525"},"TIMBER TECTONICS DIGITAL AGE","Grad","https://secure.oregonstate.edu/ap/cps/documents/view/129612","No Sustainability Content"]
[null,"WSE","WSE",530,"WSE 530","POLYMER COMPOSITES. (3 Credits)","Grad","https://secure.oregonstate.edu/ap/cps/documents/view/5764","No Sustainability Content"]
[null,"WSE","WSE",535,"WSE 535","POLYMER SYNTHESIS & STRUCTURE","Grad","https://catalog.oregonstate.edu/search/?P=WSE%20535","No Sustainability Content"]
[null,"WSE","WSE",563,"WSE 563","ADVANCED MANUFACTURING 2. (4 Credits)",{"$f":"IF(D4098>499,\"Grad\", \"Undergrad\")","v":"Grad"},"https://secure.oregonstate.edu/ap/cps/documents/view/129174","No Sustainability Content"]
[null,"WSE","WSE",571,"WSE 571","RENEW MATERIALS IN BLDG CONST","Grad","https://catalog.oregonstate.edu/search/?P=WSE%20571","No Sustainability Content"]
[null,"INBI","Z",319,"Z 319","^THINKING & COMM LIFE SCIENCES","Undergrad","https://secure.oregonstate.edu/ap/cps/documents/view/126009","No Sustainability Content"]
[null,"INBI","Z",361,"Z 361","INVERTEBRATE BIOLOGY","Undergrad","https://secure.oregonstate.edu/ap/cps/documents/view/116751","No Sustainability Content"]
[null,"INBI","Z",362,{"$f":"TRIM(C4102)&\" \"&TRIM(D4102)","v":"Z 362"},"INVERTEBRATE BIOLOGY LAB","Undergrad","https://secure.oregonstate.edu/ap/cps/documents/view/128485","No Sustainability Content"]
[null,"INBI","Z",365,"Z 365","Biology of Insects","Undergrad","https://secure.oregonstate.edu/ap/cps/documents/view/118042","No Sustainability Content"]
[null,"INBI","Z",372,{"$f":"TRIM(C4104)&\" \"&TRIM(D4104)","v":"Z 372"},"VERTEBRATE BIOLOGY LABORATORY","Undergrad","https://secure.oregonstate.edu/ap/cps/documents/view/127666","No Sustainability Content"]
[null,"INBI","Z",414,"Z 414","Writing for the Biological Sciences","Undergrad","https://secure.oregonstate.edu/ap/cps/documents/view/116824","No Sustainability Content"]
[null,"INBI","Z",415,"Z 415","Biological Sciences Thesis","Undergrad","https://secure.oregonstate.edu/ap/cps/documents/view/119599","No Sustainability Content"]
[null,"INBI","Z",422,"Z 422","COMPARATIVE VERTEBRATE ANATOMY","Undergrad","https://catalog.oregonstate.edu/search/?P=Z%20422","No Sustainability Content"]
[null,"INBI","Z",425,"Z 425","EMBRYOLOGY AND DEVELOPMENT","Undergrad","https://catalog.oregonstate.edu/search/?P=Z%20425","No Sustainability Content"]
[null,"INBI","Z",431,"Z 431","VERTEBRATE PHYSIOLOGY I","Undergrad","https://catalog.oregonstate.edu/search/?P=Z%20431","No Sustainability Content"]
[null,"INBI","Z",432,"Z 432","VERTEBRATE PHYSIOLOGY II","Undergrad","https://catalog.oregonstate.edu/search/?P=Z%20432","No Sustainability Content"]
[null,"INBI","Z",437,"Z 437","Insect Physiology ","Undergrad","https://secure.oregonstate.edu/ap/cps/documents/view/1964","No Sustainability Content"]
[null,"INBI","Z",438,"Z 438","BEHAVIORAL NEUROBIOLOGY","Undergrad","https://catalog.oregonstate.edu/search/?P=Z%20438","No Sustainability Content"]
[null,"INBI","Z",440,"Z 440","Insect Physiology ","Undergrad","https://secure.oregonstate.edu/ap/cps/documents/view/120053","No Sustainability Content"]
[null,"INBI","Z",441,"Z 441","VERTEBRATE PHYSIOLOGY LAB","Undergrad","https://secure.oregonstate.edu/ap/cps/documents/view/116033","No Sustainability Content"]
[null,"INBI","Z",442,"Z 442","VERTEBRATE PHYSIOLOGY LAB","Undergrad","https://secure.oregonstate.edu/ap/cps/documents/view/116100","No Sustainability Content"]
[null,"INBI","Z",461,"Z 461","MARINE/ESTUARINE INVERTEBRATES","Undergrad","https://catalog.oregonstate.edu/search/?P=Z%20461","No Sustainability Content"]
[null,"INBI","Z",473,"Z 473","Herpetology","Undergrad","https://secure.oregonstate.edu/ap/cps/documents/view/117017","No Sustainability Content"]
[null,"INBI","Z",522,"Z 522","COMPARATIVE VERTEBRATE ANATOMY","Grad","https://catalog.oregonstate.edu/search/?P=Z%20522","No Sustainability Content"]
[null,"INBI","Z",525,"Z 525","EMBRYOLOGY AND DEVELOPMENT","Grad","https://catalog.oregonstate.edu/search/?P=Z%20525","No Sustainability Content"]
[null,"INBI","Z",531,"Z 531","VERTEBRATE PHYSIOLOGY I","Grad","https://catalog.oregonstate.edu/search/?P=Z%20531","No Sustainability Content"]
[null,"INBI","Z",532,"Z 532","VERTEBRATE PHYSIOLOGY II","Grad","https://catalog.oregonstate.edu/search/?P=Z%20532","No Sustainability Content"]
[null,"INBI","Z",537,"Z 537","Insect Physiology ","Grad","https://secure.oregonstate.edu/ap/cps/documents/view/1964","No Sustainability Content"]
[null,"INBI","Z",538,"Z 538","BEHAVIORAL NEUROBIOLOGY","Grad","https://catalog.oregonstate.edu/search/?P=Z%20538","No Sustainability Content"]
[null,"INBI","Z",540,"Z 540","Insect Physiology ","Grad","https://secure.oregonstate.edu/ap/cps/documents/view/120053","No Sustainability Content"]
[null,"INBI","Z",554,"Z 554","Principles of Systematic Biology","Grad","https://secure.oregonstate.edu/ap/cps/documents/view/2008","No Sustainability Content"]
[null,"INBI","Z",556,"Z 556","MARINE CONSERVATION SCIENCE AND POLICY","Grad","https://secure.oregonstate.edu/ap/cps/documents/view/3128","No Sustainability Content"]
[null,"INBI","Z",561,"Z 561","MARINE/ESTUARINE INVERTEBRATES","Grad","https://catalog.oregonstate.edu/search/?P=Z%20561","No Sustainability Content"]
[null,"INBI","Z",573,"Z 573","Herpetology","Grad","https://secure.oregonstate.edu/ap/cps/documents/view/117017","No Sustainability Content"]
[null,"INBI","Z",585,"Z 585","GRANT WRITING AND ETHICS","Grad","https://secure.oregonstate.edu/ap/cps/documents/view/112970","No Sustainability Content"]
[null,"INBI","Z",587,"Z 587","SCIENTIFIC WRITING & ETHICS","Grad","https://secure.oregonstate.edu/ap/cps/documents/view/113044","No Sustainability Content"]

{"sheet":"DeptoCodes","index":2,"n_rows":190,"n_cols":9,"rows_kept":190,"cut":false,"hidden":false,"merged":[]}
["CollegeDescription","DeptCode","DepartmentDesc","SubjCode","SubjectDesc",null,null,"Row Labels","Count of CollegeDescription"]
["College of Agricultural Sciences","AG","Agriculture, General","AGRI","Agricultural Sci, College of",null,null,"AED",3]
["College of Agricultural Sciences","CSS","Crop & Soil Science","CSS","Crop & Soil Science",null,null,"AERO",1]
["College of Agricultural Sciences","BRR","Bioresource Research","BRR","Bioresource Research",null,null,"AG",1]
["College of Agricultural Sciences","AED","Agricultural Education","LEAD","Leadership",null,null,"AHE",1]
["College of Agricultural Sciences","AED","Agricultural Education","AED","Agricultural Education",null,null,"ALS",2]
["College of Agricultural Sciences","ENT","Entomology","ENT","Entomology",null,null,"AMS",1]
["College of Agricultural Sciences","AED","Agricultural Education","AG","Agriculture-General",null,null,"ANRS",2]
["College of Agricultural Sciences","CSS","Crop & Soil Science","SUS","Sustainability",null,null,"APEC",3]
["College of Agricultural Sciences","HORT","Horticulture","PBG","Plant Breeding & Genetics",null,null,"BA",6]
["College of Agricultural Sciences","ANRS","Animal and Rangeland Sci","RNG","Rangeland Ecology & Management",null,null,"BB",1]
["College of Agricultural Sciences","EMT","Environ & Molecular Toxicology","TOX","Toxicology",null,null,"BEE",1]
["College of Agricultural Sciences","CSS","Crop & Soil Science","SOIL","Soil Science",null,null,"BMS",1]
["College of Agricultural Sciences","CSS","Crop & Soil Science","CROP","Crop Science",null,null,"BOT",1]
["College of Agricultural Sciences","APEC","Applied Economics","AEC","Applied Economics",null,null,"BPHS",5]
["College of Agricultural Sciences","FST","Food Science & Technology","FST","Food Science and Technology",null,null,"BRR",1]
["College of Agricultural Sciences","HORT","Horticulture","HORT","Horticulture",null,null,"CBE",4]
["College of Agricultural Sciences","BOT","Botany & Plant Pathology","BOT","Botany and Plant Pathology",null,null,"CCE",3]
["College of Agricultural Sciences","ANRS","Animal and Rangeland Sci","ANS","Animal Sciences",null,null,"CH",1]
["College of Agricultural Sciences","FW","Fisheries & Wildlife","FW","Fisheries and Wildlife",null,null,"COUN",1]
["College of Business","BA","Business Administration","DHE","Design and Human Environment",null,null,"CSS",4]
["College of Business","BA","Business Administration","HM","Hospitality Management",null,null,"ED",1]
["College of Business","BA","Business Administration","FIN","Finance",null,null,"EECS",2]
["College of Business","BA","Business Administration","ACTG","Accounting",null,null,"EMT",1]
["College of Business","BA","Business Administration","MRKT","Marketing",null,null,"ENGR",2]
["College of Business","BA","Business Administration","MGMT","Management",null,null,"ENT",1]
["College of Business","BA","Business Administration","DSGN","Design",null,null,"FERM",2]
["College of Business","BA","Business Administration","BA","Business Administration",null,null,"FES",5]
["College of Education","SED","Science and Math Education","SED","Science & Mathematics Educ",null,null,"FST",1]
["College of Education","AHE","Adult Ed & Higher Ed Leadershp","AHE","Adult Ed & Higher Ed Leadershp",null,null,"FW",1]
["College of Education","COUN","Counseling","COUN","Counseling",null,null,"GEO",2]
["College of Education","ED","Education","ED","Education",null,null,"GRAD",1]
["College of Forestry","FES","Forest Ecosystems & Society","MNR","Master of Natural Resources",null,null,"GRD",4]
["College of Forestry","FES","Forest Ecosystems & Society","SNR","Sustainable Natural Resources",null,null,"GS",1]
["College of Forestry","FES","Forest Ecosystems & Society","NR","Natural Resources",null,null,"HC",1]
["College of Forestry","FES","Forest Ecosystems & Society","TRAL","Tourism, Recreat, Adven. Lead.",null,null,"HORT",2]
["College of Forestry","FERM","Forest Engr, Resources & Mgmt","FE","Forest Engineering",null,null,"INBI",2]
["College of Forestry","WSE","Wood Science and Engineering","WSE","Wood Science and Engineering",null,null,"INTL",1]
["College of Forestry","FERM","Forest Engr, Resources & Mgmt","FOR","Forestry",null,null,"IST",2]
["College of Forestry","FES","Forest Ecosystems & Society","FES","Forest Ecosystems and Society",null,null,"JCUO",1]
["College of Pharmacy","PHAR","Pharmacy","PHAR","Pharmacy",null,null,"LA",1]
["College of Science","GS","General Science","GS","General Science",null,null,"LS",2]
["College of Science","MB","Microbiology","BHS","BioHealth Sciences",null,null,"MB",2]
["College of Science","INBI","Integrative Biology","Z","Zoology",null,null,"MCB",1]
["College of Science","INBI","Integrative Biology","IB","Integrative Biology",null,null,"MIME",8]
["College of Science","MB","Microbiology","MB","Microbiology",null,null,"MS",1]
["College of Science","BB","Biochemistry & Biophysics","BB","Biochemistry and Biophysics",null,null,"MTH",1]
["College of Science","ST","Statistics","ST","Statistics",null,null,"NE",1]
["College of Science","INBI","Integrative Biology","BI","Biology",null,null,"NS",1]
["College of Science","PH","Physics","PH","Physics",null,null,"OC",5]
["College of Science","CH","Chemistry","CH","Chemistry",null,null,"PH",1]
["College of Science","MTH","Mathematics","MTH","Mathematics",null,null,"PHAR",1]
["Graduate School","IST","Interdisciplinary Studies","IST","Interdisciplinary Programs",null,null,"SAC",7]
["Graduate School","GRAD","Graduate Block Transfer Credit","GRAD","Graduate Education",null,null,"SBHS",2]
["Graduate School","GRD","Graduate School","WRP","Water Resources Policy and Mgt",null,null,"SDHE",2]
["Graduate School","GRD","Graduate School","WRE","Water Resources Engineering",null,null,"SED",1]
["Graduate School","GRD","Graduate School","WRS","Water Resources Science",null,null,"SHPR",6]
["Graduate School","GRD","Graduate School","ENSC","Environmental Sciences",null,null,"SLCS",21]
["Graduate School","MCB","Molecular & Cellular Biology","MCB","Molecular & Cellular Biology",null,null,"SNSE",3]
["College of Liberal Arts","SLCS","School of Lang, Cult and Soc","HEBR","Hebrew",null,null,"SPP",5]
["College of Liberal Arts","SLCS","School of Lang, Cult and Soc","LING","Linguistics",null,null,"SPS",1]
["College of Liberal Arts","SWLF","School of Writing, Lit and Flm","AJ","Applied Journalism",null,null,"ST",1]
["College of Liberal Arts","AMS","American Studies Program","AMS","American Studies Program",null,null,"SWLF",3]
["College of Liberal Arts","SLCS","School of Lang, Cult and Soc","SSCI","Social Science",null,null,"TCE",1]
["College of Liberal Arts","SHPR","School of Hist, Phil, and Rel.","PAX","Peace Studies",null,null,"VCS",1]
["College of Liberal Arts","SLCS","School of Lang, Cult and Soc","IT","Italian",null,null,"WSE",1]
["College of Liberal Arts","SLCS","School of Lang, Cult and Soc","KOR","Korean",null,null,"Grand Total",156]
["College of Liberal Arts","SLCS","School of Lang, Cult and Soc","CHN","Chinese"]
["College of Liberal Arts","LA","Liberal Arts","EAH","Environmental Arts &Humanities"]
["College of Liberal Arts","SWLF","School of Writing, Lit and Flm","FILM","Film Studies"]
["College of Liberal Arts","SLCS","School of Lang, Cult and Soc","ASL","American Sign Language"]
["College of Liberal Arts","SLCS","School of Lang, Cult and Soc","FCSJ","Food in Culture,Social Justice"]
["College of Liberal Arts","LS","Liberal Studies","LS","Liberal Studies"]
["College of Liberal Arts","SLCS","School of Lang, Cult and Soc","WLC","World Languages and Cultures"]
["College of Liberal Arts","SLCS","School of Lang, Cult and Soc","QS","Queer Studies"]
["College of Liberal Arts","SAC","School of Arts and Comm","GD","Graphic Design"]
["College of Liberal Arts","SLCS","School of Lang, Cult and Soc","JPN","Japanese"]
["College of Liberal Arts","SLCS","School of Lang, Cult and Soc","GER","German"]
["College of Liberal Arts","SAC","School of Arts and Comm","MUED","Music Education"]
["College of Liberal Arts","SPP","School of Public Policy","PPOL","Public Policy"]
["College of Liberal Arts","SLCS","School of Lang, Cult and Soc","FR","French"]
["College of Liberal Arts","SHPR","School of Hist, Phil, and Rel.","HSTS","History of Science"]
["College of Liberal Arts","SHPR","School of Hist, Phil, and Rel.","REL","Religious Studies"]
["College of Liberal Arts","SLCS","School of Lang, Cult and Soc","ES","Ethnic Studies"]
["College of Liberal Arts","SLCS","School of Lang, Cult and Soc","CSSA","College Student Services Admin"]
["College of Liberal Arts","SAC","School of Arts and Comm","TA","Theatre Arts"]
["College of Liberal Arts","SAC","School of Arts and Comm","NMC","New Media Communications"]
["College of Liberal Arts","SPP","School of Public Policy","ECON","Economics"]
["College of Liberal Arts","SPP","School of Public Policy","PS","Political Science"]
["College of Liberal Arts","SWLF","School of Writing, Lit and Flm","ENG","English"]
["College of Liberal Arts","SLCS","School of Lang, Cult and Soc","SPAN","Spanish"]
["College of Liberal Arts","SHPR","School of Hist, Phil, and Rel.","PHL","Philosophy"]
["College of Liberal Arts","SPP","School of Public Policy","SOC","Sociology"]
["College of Liberal Arts","SHPR","School of Hist, Phil, and Rel.","HST","History"]
["College of Liberal Arts","SLCS","School of Lang, Cult and Soc","WGSS","Women, Gender, and Sexuality"]
["College of Liberal Arts","SAC","School of Arts and Comm","ART","Art"]
["College of Liberal Arts","SPS","School of Psy Sci","PSY","Psychology"]
["College of Liberal Arts","SLCS","School of Lang, Cult and Soc","ANTH","Anthropology"]
["College of Liberal Arts","SAC","School of Arts and Comm","MUS","Music"]
["College of Liberal Arts","SAC","School of Arts and Comm","COMM","Communication"]
["College of Liberal Arts","SWLF","School of Writing, Lit and Flm","WR","Written English"]
["College of Liberal Arts","SAC","School of Arts and Comm","MUP","Music (Studio)"]
["Defense Education","NS","Naval Science","NS","Naval Science"]
["Defense Education","AERO","Aerospace Studies","AS","Aerospace Studies"]
["Defense Education","MS","Military Science","MS","Military Science"]
["College of Veterinary Medicine","BMS","Biomedical Sciences","VMB","Veterinary Medicine Biomedical"]
["College of Veterinary Medicine","VCS","Clinical Sciences","VMC","Veterinary Medicine Clinical"]
["College of Engineering","MIME","School of Mech, Ind, Manf Engr","AAE","Aeronautical & Astronaut. Eng."]
["College of Engineering","ENGR","Engineering Science","HEST","Humanitarian Engr Sci & Tech"]
["College of Engineering","MIME","School of Mech, Ind, Manf Engr","ESE","Energy Systems Engineering"]
["College of Engineering","MIME","School of Mech, Ind, Manf Engr","MIME","Mech/Ind/Mfg Engineering"]
["College of Engineering","MIME","School of Mech, Ind, Manf Engr","MATS","Materials Science"]
["College of Engineering","CCE","School of Civl & Constr Engr","CEM","Construction Engineering Mngmt"]
["College of Engineering","MIME","School of Mech, Ind, Manf Engr","MFGE","Manufacturing Engineering"]
["College of Engineering","CCE","School of Civl & Constr Engr","CCE","Civil and Construction Engr"]
["College of Engineering","CBE","School of Chem, Bio, Enviro En","BIOE","Biological Engineering"]
["College of Engineering","CBE","School of Chem, Bio, Enviro En","CBEE","Chem, Bio, Enviro Engineering"]
["College of Engineering","MIME","School of Mech, Ind, Manf Engr","ROB","Robotics"]
["College of Engineering","CBE","School of Chem, Bio, Enviro En","ENVE","Environmental Engineering"]
["College of Engineering","BEE","Biological & Ecological Engr","BEE","Biological & Ecological Engr"]
["College of Engineering","MIME","School of Mech, Ind, Manf Engr","IE","Industrial and Mfg Engineering"]
["College of Engineering","ENGR","Engineering Science","ENGR","Engineering Science"]
["College of Engineering","SNSE","School of Nuclear Sci & Engin","NSE","Nuclear Science & Engineering"]
["College of Engineering","CBE","School of Chem, Bio, Enviro En","CHE","Chemical Engineering"]
["College of Engineering","CCE","School of Civl & Constr Engr","CE","Civil Engineering"]
["College of Engineering","MIME","School of Mech, Ind, Manf Engr","ME","Mechanical Engineering"]
["College of Engineering","EECS","School of Electrical & Compute","ECE","Electrical & Computer Engineer"]
["College of Engineering","EECS","School of Electrical & Compute","CS","Computer Science"]
["University Honors College","HC","Honors College","HC","Honors College"]
["Academic Learning Services","ALS","Academic Learning Services","LIB","Library & Information Science"]
["Academic Learning Services","ALS","Academic Learning Services","UEXP","University Experience"]
["Academic Learning Services","ALS","Academic Learning Services","ALS","Academic Learning Services"]
["Overseas Study","OSEA","Overseas Study Centers","OANU","OS/Canberra, Australia"]
["Overseas Study","OSEA","Overseas Study Centers","OCBY","OS/Christchurch, New Zealand"]
["Overseas Study","OSEA","Overseas Study Centers","OCHI","OS/Winter term in Chile"]
["Overseas Study","OSEA","Overseas Study Centers","ODTU","OS/Lyngby, Denmark"]
["Overseas Study","OSEA","Overseas Study Centers","OFJU","OS/Taipei, Taiwan"]
["Overseas Study","OSEA","Overseas Study Centers","OFOR","OS/College of Forestry Exchnge"]
["Overseas Study","OSEA","Overseas Study Centers","ONOT","OS/Nottingham, England"]
["Overseas Study","OSEA","Overseas Study Centers","OQUI","OS/Quito, Ecuador"]
["Overseas Study","OSEA","Overseas Study Centers","OSAC","OS/Florence, Italy"]
["Overseas Study","OSEA","Overseas Study Centers","OSAS","OS/Semester at Sea"]
["Overseas Study","OSEA","Overseas Study Centers","OSTE","OS/Stellenbosch, South Africa"]
["Overseas Study","OSEA","Overseas Study Centers","OSYD","OS/Sydney, Australia"]
["Overseas Study","OSEA","Overseas Study Centers","OUBC","OS/British Columbia"]
["Overseas Study","OSEA","Overseas Study Centers","OVAL","OS/Valdivia, Chile"]
["Overseas Study","OSEA","Overseas Study Centers","OVIE","OS/Vienna, Austria"]
["Overseas Study","OCHU","OS/Bangkok, Thailand","OCHU","OS/Bangkok, Thailand"]
["Overseas Study","OSEA","Overseas Study Centers","OGRO","OS/Netherlands; Germany; Spain"]
["Overseas Study","OSEA","Overseas Study Centers","OIND","OS/Kala Raksha, India"]
["Overseas Study","OSEA","Overseas Study Centers","OIRP","OS/Int'l Ugrad Research Prog"]
["Overseas Study","OSEA","Overseas Study Centers","OLUN","OS/Lund, Sweden"]
["Overseas Study","OSEA","Overseas Study Centers","OMEN","OS/Centers in Czech Republic"]
["Overseas Study","OSEA","Overseas Study Centers","OSIT","OS/School for Intl Training"]
["Overseas Study","OSEA","Overseas Study Centers","OTUN","OS/Tunis, Tunisia"]
["Overseas Study","OSEA","Overseas Study Centers","OUTS","OS/Sydney, Australia"]
["Overseas Study","OSEA","Overseas Study Centers","OVUE","OS/Vienna, Austria"]
["Overseas Study","OSEA","Overseas Study Centers","OAAR","OS/Aarhus, Denmark"]
["Overseas Study","OSEA","Overseas Study Centers","OAGD","OS/Kristiansand, Norway"]
["Overseas Study","OSEA","Overseas Study Centers","OCHK","OS/Hong Kong, China"]
["Overseas Study","OSEA","Overseas Study Centers","OCSU","OS/Bathurst or Wagga, Australi"]
["Overseas Study","OSEA","Overseas Study Centers","OJYV","OS/Jyvaskyla, Finland"]
["Overseas Study","OSEA","Overseas Study Centers","OLAN","OS/Lancaster, England"]
["Overseas Study","OSEA","Overseas Study Centers","OSUS","OS/Sussex, England"]
["Overseas Study","OSEA","Overseas Study Centers","OUMA","OS/Sydney, Australia"]
["Overseas Study","OSEA","Overseas Study Centers","OBIO","OS/Chillan, Chile"]
["Overseas Study","OSEA","Overseas Study Centers","OCAN","OS/Cantabria, Santander, Spain"]
["Overseas Study","OSEA","Overseas Study Centers","OMAC","OS/Macerata, Italy"]
["Overseas Study","OSEA","Overseas Study Centers","OGEO","OS/Global Education Oregon"]
["Overseas Study","OSEA","Overseas Study Centers","OCIE","OS/CIEE study abroad"]
["Overseas Study","OSEA","Overseas Study Centers","OIFS","OS/Institute for Study Abroad"]
["Overseas Study","OSEA","Overseas Study Centers","ONZC","OS/Christchurch, New Zealand"]
["Overseas Study","INTL","International Degree","INTL","International Degree"]
["Overseas Study","OSEA","Overseas Study Centers","OEEE","OS/IE3 Global"]
["Overseas Study","OSEA","Overseas Study Centers","OAPI","OS/Academic Programs Intl"]
["Overseas Study","OSEA","Overseas Study Centers","OINT","OS/Internship"]
["Overseas Study","OSEA","Overseas Study Centers","OSAB","OS/Various Locations Abroad"]
["College of Public Health and Human Sciences","BPHS","School Bio. & Pop. Health Sci.","HHS","Health and Human Sciences"]
["College of Public Health and Human Sciences","BPHS","School Bio. & Pop. Health Sci.","NUTR","Nutrition"]
["College of Public Health and Human Sciences","SBHS","School Soc. & Behav. Science","HDFS","Human Dev and Family Sciences"]
["College of Public Health and Human Sciences","SBHS","School Soc. & Behav. Science","H","Public Health"]
["College of Public Health and Human Sciences","BPHS","School Bio. & Pop. Health Sci.","KIN","Kinesiology"]
["College of Public Health and Human Sciences","BPHS","School Bio. & Pop. Health Sci.","PAC","Physical Activity Courses"]
["College of Earth, Ocean, and Atmospheric Sciences","OC","Oceanography","OEAS","Ocean Earth & Atmospheric Sci"]
["College of Earth, Ocean, and Atmospheric Sciences","OC","Oceanography","GPH","Geophysics"]
["College of Earth, Ocean, and Atmospheric Sciences","OC","Oceanography","MRM","Marine Resource Management"]
["College of Earth, Ocean, and Atmospheric Sciences","OC","Oceanography","ATS","Atmospheric Sciences"]
["College of Earth, Ocean, and Atmospheric Sciences","GEO","Geosciences","GEO","Geosciences"]
["College of Earth, Ocean, and Atmospheric Sciences","GEO","Geosciences","GEOG","Geography"]
["College of Earth, Ocean, and Atmospheric Sciences","OC","Oceanography","OC","Oceanography"]

{"sheet":"ResultsSummary","index":3,"n_rows":68,"n_cols":4,"rows_kept":68,"cut":false,"hidden":false,"merged":[]}
[]
["Sustainability Course Offerings by Class Standing"]
["Count of Status","Column Labels"]
["Row Labels","Grad","Undergrad","Grand Total"]
["Course that includes sustainability ",125,187,312]
["No Sustainability Content",1214,1722,2936]
["Sustainability Course",353,501,854]
["Unavailable syllabus",11,16,27]
["Grand Total",1703,2426,4129]
[]
["Status","(Multiple Items)"]
["Sustainability Course Offerings by Department"]
["Row Labels","Count of COURSE TITLE"]
["AED",4]
["AERO",2]
["AG",6]
["AHE",5]
["ALS",2]
["AMS",1]
["ANRS",23]
["APEC",35]
["BA",57]
["BB",1]
["BEE",17]
["BMS",4]
["BOT",5]
["BPHS",30]
["BRR",4]
["CBE",21]
["CCE",30]
["CH",5]
["COUN",2]
["CSS",22]
["ED",17]
["EECS",3]
["EMT",4]
["ENGR",6]
["ENT",7]
["FERM",63]
["FES",76]
["FST",1]
["FW",63]
["GEO",56]
["GRAD",2]
["GRD",7]
["HORT",31]
["INBI",28]
["LA",2]
["MB",8]
["MCB",3]
["MIME",20]
["MTH",1]
["OC",39]
["PH",2]
["PHAR",7]
["SAC",20]
["SBHS",44]
["SED",5]
["SHPR",63]
["SLCS",202]
["SNSE",4]
["SPP",66]
["SPS",13]
["SWLF",22]
["TCE",7]
["VCS",1]
["WSE",24]
["Grand Total",1193]